mesos-builds mailing list archives

Site index · List index
Message view « Date » · « Thread »
Top « Date » · « Thread »
From Apache Jenkins Server <jenk...@builds.apache.org>
Subject Build failed in Jenkins: Mesos » autotools,gcc,--verbose,GLOG_v=1 MESOS_VERBOSE=1,centos:7,(docker||Hadoop)&&(!ubuntu-us1)&&(!ubuntu-6)&&(!ubuntu-eu2) #2930
Date Wed, 16 Nov 2016 04:47:28 GMT
See <https://builds.apache.org/job/Mesos/BUILDTOOL=autotools,COMPILER=gcc,CONFIGURATION=--verbose,ENVIRONMENT=GLOG_v=1%20MESOS_VERBOSE=1,OS=centos%3A7,label_exp=(docker%7C%7CHadoop)&&(!ubuntu-us1)&&(!ubuntu-6)&&(!ubuntu-eu2)/2930/changes>

Changes:

[vinodkone] Add a content type option to mesos-execute.

------------------------------------------
[...truncated 216233 lines...]
W1116 04:45:43.410245 30708 backend.cpp:76] Failed to create 'aufs' backend: AufsBackend requires
root privileges, but is running as user mesos
W1116 04:45:43.410382 30708 backend.cpp:76] Failed to create 'bind' backend: BindBackend requires
root privileges
I1116 04:45:43.412904 30734 slave.cpp:208] Mesos agent started on (641)@172.17.0.2:44065
I1116 04:45:43.412927 30734 slave.cpp:209] Flags at startup: --acls="" --appc_simple_discovery_uri_prefix="http://"
--appc_store_dir="/tmp/mesos/store/appc" --authenticate_http_readonly="true" --authenticate_http_readwrite="true"
--authenticatee="crammd5" --authentication_backoff_factor="1secs" --authorizer="local" --cgroups_cpu_enable_pids_and_tids_count="false"
--cgroups_enable_cfs="false" --cgroups_hierarchy="/sys/fs/cgroup" --cgroups_limit_swap="false"
--cgroups_root="mesos" --container_disk_watch_interval="15secs" --containerizers="mesos" --credential="/tmp/Endpoint_SlaveEndpointTest_AuthorizedRequest_1_rW0x3U/credential"
--default_role="*" --disk_watch_interval="1mins" --docker="docker" --docker_kill_orphans="true"
--docker_registry="https://registry-1.docker.io" --docker_remove_delay="6hrs" --docker_socket="/var/run/docker.sock"
--docker_stop_timeout="0ns" --docker_store_dir="/tmp/mesos/store/docker" --docker_volume_checkpoint_dir="/var/run/mesos/isolators/docker/volume"
--enforce_container_disk_quota="false" --executor_registration_timeout="1mins" --executor_shutdown_grace_period="5secs"
--fetcher_cache_dir="/tmp/Endpoint_SlaveEndpointTest_AuthorizedRequest_1_rW0x3U/fetch" --fetcher_cache_size="2GB"
--frameworks_home="" --gc_delay="1weeks" --gc_disk_headroom="0.1" --hadoop_home="" --help="false"
--hostname_lookup="true" --http_authenticators="basic" --http_command_executor="false" --http_credentials="/tmp/Endpoint_SlaveEndpointTest_AuthorizedRequest_1_rW0x3U/http_credentials"
--image_provisioner_backend="copy" --initialize_driver_logging="true" --isolation="posix/cpu,posix/mem"
--launcher="posix" --launcher_dir="/mesos/mesos-1.2.0/_build/src" --logbufsecs="0" --logging_level="INFO"
--max_completed_executors_per_framework="150" --oversubscribed_resources_interval="15secs"
--perf_duration="10secs" --perf_interval="1mins" --qos_correction_interval_min="0ns" --quiet="false"
--recover="reconnect" --recovery_timeout="15mins" --registration_backoff_factor="10ms" --resources="cpus:2;gpus:0;mem:1024;disk:1024;ports:[31000-32000]"
--revocable_cpu_low_priority="true" --runtime_dir="/tmp/Endpoint_SlaveEndpointTest_AuthorizedRequest_1_rW0x3U"
--sandbox_directory="/mnt/mesos/sandbox" --strict="true" --switch_user="true" --systemd_enable_support="true"
--systemd_runtime_directory="/run/systemd/system" --version="false" --work_dir="/tmp/Endpoint_SlaveEndpointTest_AuthorizedRequest_1_j3mORY"
I1116 04:45:43.413422 30734 credentials.hpp:86] Loading credential for authentication from
'/tmp/Endpoint_SlaveEndpointTest_AuthorizedRequest_1_rW0x3U/credential'
I1116 04:45:43.413621 30734 slave.cpp:346] Agent using credential for: test-principal
I1116 04:45:43.413668 30734 credentials.hpp:37] Loading credentials for authentication from
'/tmp/Endpoint_SlaveEndpointTest_AuthorizedRequest_1_rW0x3U/http_credentials'
I1116 04:45:43.413893 30734 http.cpp:895] Using default 'basic' HTTP authenticator for realm
'mesos-agent-readonly'
I1116 04:45:43.414041 30734 http.cpp:895] Using default 'basic' HTTP authenticator for realm
'mesos-agent-readwrite'
I1116 04:45:43.415052 30734 slave.cpp:533] Agent resources: cpus(*):2; mem(*):1024; disk(*):1024;
ports(*):[31000-32000]
I1116 04:45:43.415133 30734 slave.cpp:541] Agent attributes: [  ]
I1116 04:45:43.415146 30734 slave.cpp:546] Agent hostname: 766843bf103b
I1116 04:45:43.416755 30739 state.cpp:57] Recovering state from '/tmp/Endpoint_SlaveEndpointTest_AuthorizedRequest_1_j3mORY/meta'
I1116 04:45:43.417101 30729 status_update_manager.cpp:203] Recovering status update manager
I1116 04:45:43.417338 30731 containerizer.cpp:561] Recovering containerizer
I1116 04:45:43.418869 30737 provisioner.cpp:253] Provisioner recovery complete
I1116 04:45:43.419332 30736 slave.cpp:5411] Finished recovery
I1116 04:45:43.419939 30736 slave.cpp:5585] Querying resource estimator for oversubscribable
resources
I1116 04:45:43.420244 30738 slave.cpp:5599] Received oversubscribable resources {} from the
resource estimator
I1116 04:45:43.422212 30737 process.cpp:3570] Handling HTTP event for process 'slave(641)'
with path: '/slave(641)/monitor/statistics.json'
I1116 04:45:43.423202 30742 http.cpp:847] Authorizing principal 'test-principal' to GET the
'/monitor/statistics.json' endpoint
I1116 04:45:43.427049 30734 slave.cpp:787] Agent terminating
[       OK ] Endpoint/SlaveEndpointTest.AuthorizedRequest/1 (26 ms)
[ RUN      ] Endpoint/SlaveEndpointTest.AuthorizedRequest/2
I1116 04:45:43.437755 30708 containerizer.cpp:202] Using isolation: posix/cpu,posix/mem,filesystem/posix,network/cni
W1116 04:45:43.438356 30708 backend.cpp:76] Failed to create 'aufs' backend: AufsBackend requires
root privileges, but is running as user mesos
W1116 04:45:43.438499 30708 backend.cpp:76] Failed to create 'bind' backend: BindBackend requires
root privileges
I1116 04:45:43.441275 30734 slave.cpp:208] Mesos agent started on (642)@172.17.0.2:44065
I1116 04:45:43.441301 30734 slave.cpp:209] Flags at startup: --acls="" --appc_simple_discovery_uri_prefix="http://"
--appc_store_dir="/tmp/mesos/store/appc" --authenticate_http_readonly="true" --authenticate_http_readwrite="true"
--authenticatee="crammd5" --authentication_backoff_factor="1secs" --authorizer="local" --cgroups_cpu_enable_pids_and_tids_count="false"
--cgroups_enable_cfs="false" --cgroups_hierarchy="/sys/fs/cgroup" --cgroups_limit_swap="false"
--cgroups_root="mesos" --container_disk_watch_interval="15secs" --containerizers="mesos" --credential="/tmp/Endpoint_SlaveEndpointTest_AuthorizedRequest_2_jHQx3F/credential"
--default_role="*" --disk_watch_interval="1mins" --docker="docker" --docker_kill_orphans="true"
--docker_registry="https://registry-1.docker.io" --docker_remove_delay="6hrs" --docker_socket="/var/run/docker.sock"
--docker_stop_timeout="0ns" --docker_store_dir="/tmp/mesos/store/docker" --docker_volume_checkpoint_dir="/var/run/mesos/isolators/docker/volume"
--enforce_container_disk_quota="false" --executor_registration_timeout="1mins" --executor_shutdown_grace_period="5secs"
--fetcher_cache_dir="/tmp/Endpoint_SlaveEndpointTest_AuthorizedRequest_2_jHQx3F/fetch" --fetcher_cache_size="2GB"
--frameworks_home="" --gc_delay="1weeks" --gc_disk_headroom="0.1" --hadoop_home="" --help="false"
--hostname_lookup="true" --http_authenticators="basic" --http_command_executor="false" --http_credentials="/tmp/Endpoint_SlaveEndpointTest_AuthorizedRequest_2_jHQx3F/http_credentials"
--image_provisioner_backend="copy" --initialize_driver_logging="true" --isolation="posix/cpu,posix/mem"
--launcher="posix" --launcher_dir="/mesos/mesos-1.2.0/_build/src" --logbufsecs="0" --logging_level="INFO"
--max_completed_executors_per_framework="150" --oversubscribed_resources_interval="15secs"
--perf_duration="10secs" --perf_interval="1mins" --qos_correction_interval_min="0ns" --quiet="false"
--recover="reconnect" --recovery_timeout="15mins" --registration_backoff_factor="10ms" --resources="cpus:2;gpus:0;mem:1024;disk:1024;ports:[31000-32000]"
--revocable_cpu_low_priority="true" --runtime_dir="/tmp/Endpoint_SlaveEndpointTest_AuthorizedRequest_2_jHQx3F"
--sandbox_directory="/mnt/mesos/sandbox" --strict="true" --switch_user="true" --systemd_enable_support="true"
--systemd_runtime_directory="/run/systemd/system" --version="false" --work_dir="/tmp/Endpoint_SlaveEndpointTest_AuthorizedRequest_2_hnukNJ"
I1116 04:45:43.441908 30734 credentials.hpp:86] Loading credential for authentication from
'/tmp/Endpoint_SlaveEndpointTest_AuthorizedRequest_2_jHQx3F/credential'
I1116 04:45:43.442050 30734 slave.cpp:346] Agent using credential for: test-principal
I1116 04:45:43.442072 30734 credentials.hpp:37] Loading credentials for authentication from
'/tmp/Endpoint_SlaveEndpointTest_AuthorizedRequest_2_jHQx3F/http_credentials'
I1116 04:45:43.442309 30734 http.cpp:895] Using default 'basic' HTTP authenticator for realm
'mesos-agent-readonly'
I1116 04:45:43.442451 30734 http.cpp:895] Using default 'basic' HTTP authenticator for realm
'mesos-agent-readwrite'
I1116 04:45:43.443564 30734 slave.cpp:533] Agent resources: cpus(*):2; mem(*):1024; disk(*):1024;
ports(*):[31000-32000]
I1116 04:45:43.443662 30734 slave.cpp:541] Agent attributes: [  ]
I1116 04:45:43.443677 30734 slave.cpp:546] Agent hostname: 766843bf103b
I1116 04:45:43.444969 30729 state.cpp:57] Recovering state from '/tmp/Endpoint_SlaveEndpointTest_AuthorizedRequest_2_hnukNJ/meta'
I1116 04:45:43.445263 30735 status_update_manager.cpp:203] Recovering status update manager
I1116 04:45:43.445487 30732 containerizer.cpp:561] Recovering containerizer
I1116 04:45:43.446828 30730 provisioner.cpp:253] Provisioner recovery complete
I1116 04:45:43.447185 30734 slave.cpp:5411] Finished recovery
I1116 04:45:43.447682 30734 slave.cpp:5585] Querying resource estimator for oversubscribable
resources
I1116 04:45:43.447963 30738 slave.cpp:5599] Received oversubscribable resources {} from the
resource estimator
I1116 04:45:43.450080 30739 process.cpp:3570] Handling HTTP event for process 'slave(642)'
with path: '/slave(642)/containers'
I1116 04:45:43.451223 30736 http.cpp:847] Authorizing principal 'test-principal' to GET the
'/containers' endpoint
I1116 04:45:43.455904 30732 slave.cpp:787] Agent terminating
[       OK ] Endpoint/SlaveEndpointTest.AuthorizedRequest/2 (29 ms)
[ RUN      ] Endpoint/SlaveEndpointTest.UnauthorizedRequest/0
I1116 04:45:43.467825 30708 containerizer.cpp:202] Using isolation: posix/cpu,posix/mem,filesystem/posix,network/cni
W1116 04:45:43.468461 30708 backend.cpp:76] Failed to create 'aufs' backend: AufsBackend requires
root privileges, but is running as user mesos
W1116 04:45:43.468605 30708 backend.cpp:76] Failed to create 'bind' backend: BindBackend requires
root privileges
I1116 04:45:43.471448 30738 slave.cpp:208] Mesos agent started on (643)@172.17.0.2:44065
I1116 04:45:43.471505 30738 slave.cpp:209] Flags at startup: --acls="" --appc_simple_discovery_uri_prefix="http://"
--appc_store_dir="/tmp/mesos/store/appc" --authenticate_http_readonly="true" --authenticate_http_readwrite="true"
--authenticatee="crammd5" --authentication_backoff_factor="1secs" --authorizer="local" --cgroups_cpu_enable_pids_and_tids_count="false"
--cgroups_enable_cfs="false" --cgroups_hierarchy="/sys/fs/cgroup" --cgroups_limit_swap="false"
--cgroups_root="mesos" --container_disk_watch_interval="15secs" --containerizers="mesos" --credential="/tmp/Endpoint_SlaveEndpointTest_UnauthorizedRequest_0_LeVBmr/credential"
--default_role="*" --disk_watch_interval="1mins" --docker="docker" --docker_kill_orphans="true"
--docker_registry="https://registry-1.docker.io" --docker_remove_delay="6hrs" --docker_socket="/var/run/docker.sock"
--docker_stop_timeout="0ns" --docker_store_dir="/tmp/mesos/store/docker" --docker_volume_checkpoint_dir="/var/run/mesos/isolators/docker/volume"
--enforce_container_disk_quota="false" --executor_registration_timeout="1mins" --executor_shutdown_grace_period="5secs"
--fetcher_cache_dir="/tmp/Endpoint_SlaveEndpointTest_UnauthorizedRequest_0_LeVBmr/fetch" --fetcher_cache_size="2GB"
--frameworks_home="" --gc_delay="1weeks" --gc_disk_headroom="0.1" --hadoop_home="" --help="false"
--hostname_lookup="true" --http_authenticators="basic" --http_command_executor="false" --http_credentials="/tmp/Endpoint_SlaveEndpointTest_UnauthorizedRequest_0_LeVBmr/http_credentials"
--image_provisioner_backend="copy" --initialize_driver_logging="true" --isolation="posix/cpu,posix/mem"
--launcher="posix" --launcher_dir="/mesos/mesos-1.2.0/_build/src" --logbufsecs="0" --logging_level="INFO"
--max_completed_executors_per_framework="150" --oversubscribed_resources_interval="15secs"
--perf_duration="10secs" --perf_interval="1mins" --qos_correction_interval_min="0ns" --quiet="false"
--recover="reconnect" --recovery_timeout="15mins" --registration_backoff_factor="10ms" --resources="cpus:2;gpus:0;mem:1024;disk:1024;ports:[31000-32000]"
--revocable_cpu_low_priority="true" --runtime_dir="/tmp/Endpoint_SlaveEndpointTest_UnauthorizedRequest_0_LeVBmr"
--sandbox_directory="/mnt/mesos/sandbox" --strict="true" --switch_user="true" --systemd_enable_support="true"
--systemd_runtime_directory="/run/systemd/system" --version="false" --work_dir="/tmp/Endpoint_SlaveEndpointTest_UnauthorizedRequest_0_JXex1u"
I1116 04:45:43.472059 30738 credentials.hpp:86] Loading credential for authentication from
'/tmp/Endpoint_SlaveEndpointTest_UnauthorizedRequest_0_LeVBmr/credential'
I1116 04:45:43.472239 30738 slave.cpp:346] Agent using credential for: test-principal
I1116 04:45:43.472262 30738 credentials.hpp:37] Loading credentials for authentication from
'/tmp/Endpoint_SlaveEndpointTest_UnauthorizedRequest_0_LeVBmr/http_credentials'
I1116 04:45:43.472504 30738 http.cpp:895] Using default 'basic' HTTP authenticator for realm
'mesos-agent-readonly'
I1116 04:45:43.472748 30738 http.cpp:895] Using default 'basic' HTTP authenticator for realm
'mesos-agent-readwrite'
I1116 04:45:43.473898 30738 slave.cpp:533] Agent resources: cpus(*):2; mem(*):1024; disk(*):1024;
ports(*):[31000-32000]
I1116 04:45:43.474001 30738 slave.cpp:541] Agent attributes: [  ]
I1116 04:45:43.474015 30738 slave.cpp:546] Agent hostname: 766843bf103b
I1116 04:45:43.475793 30741 state.cpp:57] Recovering state from '/tmp/Endpoint_SlaveEndpointTest_UnauthorizedRequest_0_JXex1u/meta'
I1116 04:45:43.476069 30742 status_update_manager.cpp:203] Recovering status update manager
I1116 04:45:43.476522 30738 containerizer.cpp:561] Recovering containerizer
I1116 04:45:43.477969 30735 provisioner.cpp:253] Provisioner recovery complete
I1116 04:45:43.478467 30727 slave.cpp:5411] Finished recovery
I1116 04:45:43.479040 30727 slave.cpp:5585] Querying resource estimator for oversubscribable
resources
I1116 04:45:43.479399 30730 slave.cpp:5599] Received oversubscribable resources {} from the
resource estimator
I1116 04:45:43.481251 30736 process.cpp:3570] Handling HTTP event for process 'slave(643)'
with path: '/slave(643)/monitor/statistics'
I1116 04:45:43.482297 30739 http.cpp:847] Authorizing principal 'test-principal' to GET the
'/monitor/statistics' endpoint
I1116 04:45:43.484977 30732 slave.cpp:787] Agent terminating
[       OK ] Endpoint/SlaveEndpointTest.UnauthorizedRequest/0 (27 ms)
[ RUN      ] Endpoint/SlaveEndpointTest.UnauthorizedRequest/1
I1116 04:45:43.495590 30708 containerizer.cpp:202] Using isolation: posix/cpu,posix/mem,filesystem/posix,network/cni
W1116 04:45:43.496314 30708 backend.cpp:76] Failed to create 'aufs' backend: AufsBackend requires
root privileges, but is running as user mesos
W1116 04:45:43.496484 30708 backend.cpp:76] Failed to create 'bind' backend: BindBackend requires
root privileges
I1116 04:45:43.499150 30732 slave.cpp:208] Mesos agent started on (644)@172.17.0.2:44065
I1116 04:45:43.499171 30732 slave.cpp:209] Flags at startup: --acls="" --appc_simple_discovery_uri_prefix="http://"
--appc_store_dir="/tmp/mesos/store/appc" --authenticate_http_readonly="true" --authenticate_http_readwrite="true"
--authenticatee="crammd5" --authentication_backoff_factor="1secs" --authorizer="local" --cgroups_cpu_enable_pids_and_tids_count="false"
--cgroups_enable_cfs="false" --cgroups_hierarchy="/sys/fs/cgroup" --cgroups_limit_swap="false"
--cgroups_root="mesos" --container_disk_watch_interval="15secs" --containerizers="mesos" --credential="/tmp/Endpoint_SlaveEndpointTest_UnauthorizedRequest_1_hBbtYc/credential"
--default_role="*" --disk_watch_interval="1mins" --docker="docker" --docker_kill_orphans="true"
--docker_registry="https://registry-1.docker.io" --docker_remove_delay="6hrs" --docker_socket="/var/run/docker.sock"
--docker_stop_timeout="0ns" --docker_store_dir="/tmp/mesos/store/docker" --docker_volume_checkpoint_dir="/var/run/mesos/isolators/docker/volume"
--enforce_container_disk_quota="false" --executor_registration_timeout="1mins" --executor_shutdown_grace_period="5secs"
--fetcher_cache_dir="/tmp/Endpoint_SlaveEndpointTest_UnauthorizedRequest_1_hBbtYc/fetch" --fetcher_cache_size="2GB"
--frameworks_home="" --gc_delay="1weeks" --gc_disk_headroom="0.1" --hadoop_home="" --help="false"
--hostname_lookup="true" --http_authenticators="basic" --http_command_executor="false" --http_credentials="/tmp/Endpoint_SlaveEndpointTest_UnauthorizedRequest_1_hBbtYc/http_credentials"
--image_provisioner_backend="copy" --initialize_driver_logging="true" --isolation="posix/cpu,posix/mem"
--launcher="posix" --launcher_dir="/mesos/mesos-1.2.0/_build/src" --logbufsecs="0" --logging_level="INFO"
--max_completed_executors_per_framework="150" --oversubscribed_resources_interval="15secs"
--perf_duration="10secs" --perf_interval="1mins" --qos_correction_interval_min="0ns" --quiet="false"
--recover="reconnect" --recovery_timeout="15mins" --registration_backoff_factor="10ms" --resources="cpus:2;gpus:0;mem:1024;disk:1024;ports:[31000-32000]"
--revocable_cpu_low_priority="true" --runtime_dir="/tmp/Endpoint_SlaveEndpointTest_UnauthorizedRequest_1_hBbtYc"
--sandbox_directory="/mnt/mesos/sandbox" --strict="true" --switch_user="true" --systemd_enable_support="true"
--systemd_runtime_directory="/run/systemd/system" --version="false" --work_dir="/tmp/Endpoint_SlaveEndpointTest_UnauthorizedRequest_1_BRSPyg"
I1116 04:45:43.499699 30732 credentials.hpp:86] Loading credential for authentication from
'/tmp/Endpoint_SlaveEndpointTest_UnauthorizedRequest_1_hBbtYc/credential'
I1116 04:45:43.499821 30732 slave.cpp:346] Agent using credential for: test-principal
I1116 04:45:43.499840 30732 credentials.hpp:37] Loading credentials for authentication from
'/tmp/Endpoint_SlaveEndpointTest_UnauthorizedRequest_1_hBbtYc/http_credentials'
I1116 04:45:43.500021 30732 http.cpp:895] Using default 'basic' HTTP authenticator for realm
'mesos-agent-readonly'
I1116 04:45:43.500134 30732 http.cpp:895] Using default 'basic' HTTP authenticator for realm
'mesos-agent-readwrite'
I1116 04:45:43.501049 30732 slave.cpp:533] Agent resources: cpus(*):2; mem(*):1024; disk(*):1024;
ports(*):[31000-32000]
I1116 04:45:43.501119 30732 slave.cpp:541] Agent attributes: [  ]
I1116 04:45:43.501130 30732 slave.cpp:546] Agent hostname: 766843bf103b
I1116 04:45:43.502710 30733 state.cpp:57] Recovering state from '/tmp/Endpoint_SlaveEndpointTest_UnauthorizedRequest_1_BRSPyg/meta'
I1116 04:45:43.502988 30742 status_update_manager.cpp:203] Recovering status update manager
I1116 04:45:43.503235 30734 containerizer.cpp:561] Recovering containerizer
I1116 04:45:43.504287 30728 provisioner.cpp:253] Provisioner recovery complete
I1116 04:45:43.504786 30737 slave.cpp:5411] Finished recovery
I1116 04:45:43.505254 30737 slave.cpp:5585] Querying resource estimator for oversubscribable
resources
I1116 04:45:43.505544 30741 slave.cpp:5599] Received oversubscribable resources {} from the
resource estimator
I1116 04:45:43.507578 30734 process.cpp:3570] Handling HTTP event for process 'slave(644)'
with path: '/slave(644)/monitor/statistics.json'
I1116 04:45:43.508553 30732 http.cpp:847] Authorizing principal 'test-principal' to GET the
'/monitor/statistics.json' endpoint
I1116 04:45:43.511095 30728 slave.cpp:787] Agent terminating
[       OK ] Endpoint/SlaveEndpointTest.UnauthorizedRequest/1 (26 ms)
[ RUN      ] Endpoint/SlaveEndpointTest.UnauthorizedRequest/2
I1116 04:45:43.522265 30708 containerizer.cpp:202] Using isolation: posix/cpu,posix/mem,filesystem/posix,network/cni
W1116 04:45:43.522989 30708 backend.cpp:76] Failed to create 'aufs' backend: AufsBackend requires
root privileges, but is running as user mesos
W1116 04:45:43.523154 30708 backend.cpp:76] Failed to create 'bind' backend: BindBackend requires
root privileges
I1116 04:45:43.526708 30733 slave.cpp:208] Mesos agent started on (645)@172.17.0.2:44065
I1116 04:45:43.526741 30733 slave.cpp:209] Flags at startup: --acls="" --appc_simple_discovery_uri_prefix="http://"
--appc_store_dir="/tmp/mesos/store/appc" --authenticate_http_readonly="true" --authenticate_http_readwrite="true"
--authenticatee="crammd5" --authentication_backoff_factor="1secs" --authorizer="local" --cgroups_cpu_enable_pids_and_tids_count="false"
--cgroups_enable_cfs="false" --cgroups_hierarchy="/sys/fs/cgroup" --cgroups_limit_swap="false"
--cgroups_root="mesos" --container_disk_watch_interval="15secs" --containerizers="mesos" --credential="/tmp/Endpoint_SlaveEndpointTest_UnauthorizedRequest_2_rIVvRY/credential"
--default_role="*" --disk_watch_interval="1mins" --docker="docker" --docker_kill_orphans="true"
--docker_registry="https://registry-1.docker.io" --docker_remove_delay="6hrs" --docker_socket="/var/run/docker.sock"
--docker_stop_timeout="0ns" --docker_store_dir="/tmp/mesos/store/docker" --docker_volume_checkpoint_dir="/var/run/mesos/isolators/docker/volume"
--enforce_container_disk_quota="false" --executor_registration_timeout="1mins" --executor_shutdown_grace_period="5secs"
--fetcher_cache_dir="/tmp/Endpoint_SlaveEndpointTest_UnauthorizedRequest_2_rIVvRY/fetch" --fetcher_cache_size="2GB"
--frameworks_home="" --gc_delay="1weeks" --gc_disk_headroom="0.1" --hadoop_home="" --help="false"
--hostname_lookup="true" --http_authenticators="basic" --http_command_executor="false" --http_credentials="/tmp/Endpoint_SlaveEndpointTest_UnauthorizedRequest_2_rIVvRY/http_credentials"
--image_provisioner_backend="copy" --initialize_driver_logging="true" --isolation="posix/cpu,posix/mem"
--launcher="posix" --launcher_dir="/mesos/mesos-1.2.0/_build/src" --logbufsecs="0" --logging_level="INFO"
--max_completed_executors_per_framework="150" --oversubscribed_resources_interval="15secs"
--perf_duration="10secs" --perf_interval="1mins" --qos_correction_interval_min="0ns" --quiet="false"
--recover="reconnect" --recovery_timeout="15mins" --registration_backoff_factor="10ms" --resources="cpus:2;gpus:0;mem:1024;disk:1024;ports:[31000-32000]"
--revocable_cpu_low_priority="true" --runtime_dir="/tmp/Endpoint_SlaveEndpointTest_UnauthorizedRequest_2_rIVvRY"
--sandbox_directory="/mnt/mesos/sandbox" --strict="true" --switch_user="true" --systemd_enable_support="true"
--systemd_runtime_directory="/run/systemd/system" --version="false" --work_dir="/tmp/Endpoint_SlaveEndpointTest_UnauthorizedRequest_2_7mEzn2"
I1116 04:45:43.527439 30733 credentials.hpp:86] Loading credential for authentication from
'/tmp/Endpoint_SlaveEndpointTest_UnauthorizedRequest_2_rIVvRY/credential'
I1116 04:45:43.527601 30733 slave.cpp:346] Agent using credential for: test-principal
I1116 04:45:43.527626 30733 credentials.hpp:37] Loading credentials for authentication from
'/tmp/Endpoint_SlaveEndpointTest_UnauthorizedRequest_2_rIVvRY/http_credentials'
I1116 04:45:43.528136 30733 http.cpp:895] Using default 'basic' HTTP authenticator for realm
'mesos-agent-readonly'
I1116 04:45:43.528372 30733 http.cpp:895] Using default 'basic' HTTP authenticator for realm
'mesos-agent-readwrite'
I1116 04:45:43.529568 30733 slave.cpp:533] Agent resources: cpus(*):2; mem(*):1024; disk(*):1024;
ports(*):[31000-32000]
I1116 04:45:43.529688 30733 slave.cpp:541] Agent attributes: [  ]
I1116 04:45:43.529703 30733 slave.cpp:546] Agent hostname: 766843bf103b
I1116 04:45:43.531296 30727 state.cpp:57] Recovering state from '/tmp/Endpoint_SlaveEndpointTest_UnauthorizedRequest_2_7mEzn2/meta'
I1116 04:45:43.531602 30730 status_update_manager.cpp:203] Recovering status update manager
I1116 04:45:43.531961 30737 containerizer.cpp:561] Recovering containerizer
I1116 04:45:43.533367 30729 provisioner.cpp:253] Provisioner recovery complete
I1116 04:45:43.533870 30737 slave.cpp:5411] Finished recovery
I1116 04:45:43.534446 30737 slave.cpp:5585] Querying resource estimator for oversubscribable
resources
I1116 04:45:43.534795 30728 slave.cpp:5599] Received oversubscribable resources {} from the
resource estimator
I1116 04:45:43.536363 30730 process.cpp:3570] Handling HTTP event for process 'slave(645)'
with path: '/slave(645)/containers'
I1116 04:45:43.537350 30730 http.cpp:847] Authorizing principal 'test-principal' to GET the
'/containers' endpoint
I1116 04:45:43.539594 30737 slave.cpp:787] Agent terminating
[       OK ] Endpoint/SlaveEndpointTest.UnauthorizedRequest/2 (27 ms)
[ RUN      ] Endpoint/SlaveEndpointTest.NoAuthorizer/0
I1116 04:45:43.549942 30708 containerizer.cpp:202] Using isolation: posix/cpu,posix/mem,filesystem/posix,network/cni
W1116 04:45:43.550530 30708 backend.cpp:76] Failed to create 'aufs' backend: AufsBackend requires
root privileges, but is running as user mesos
W1116 04:45:43.550685 30708 backend.cpp:76] Failed to create 'bind' backend: BindBackend requires
root privileges
I1116 04:45:43.551945 30708 cluster.cpp:435] Creating default 'local' authorizer
I1116 04:45:43.553601 30729 slave.cpp:208] Mesos agent started on (646)@172.17.0.2:44065
I1116 04:45:43.553629 30729 slave.cpp:209] Flags at startup: --acls="" --appc_simple_discovery_uri_prefix="http://"
--appc_store_dir="/tmp/mesos/store/appc" --authenticate_http_readonly="true" --authenticate_http_readwrite="true"
--authenticatee="crammd5" --authentication_backoff_factor="1secs" --authorizer="local" --cgroups_cpu_enable_pids_and_tids_count="false"
--cgroups_enable_cfs="false" --cgroups_hierarchy="/sys/fs/cgroup" --cgroups_limit_swap="false"
--cgroups_root="mesos" --container_disk_watch_interval="15secs" --containerizers="mesos" --credential="/tmp/Endpoint_SlaveEndpointTest_NoAuthorizer_0_VcHT2K/credential"
--default_role="*" --disk_watch_interval="1mins" --docker="docker" --docker_kill_orphans="true"
--docker_registry="https://registry-1.docker.io" --docker_remove_delay="6hrs" --docker_socket="/var/run/docker.sock"
--docker_stop_timeout="0ns" --docker_store_dir="/tmp/mesos/store/docker" --docker_volume_checkpoint_dir="/var/run/mesos/isolators/docker/volume"
--enforce_container_disk_quota="false" --executor_registration_timeout="1mins" --executor_shutdown_grace_period="5secs"
--fetcher_cache_dir="/tmp/Endpoint_SlaveEndpointTest_NoAuthorizer_0_VcHT2K/fetch" --fetcher_cache_size="2GB"
--frameworks_home="" --gc_delay="1weeks" --gc_disk_headroom="0.1" --hadoop_home="" --help="false"
--hostname_lookup="true" --http_authenticators="basic" --http_command_executor="false" --http_credentials="/tmp/Endpoint_SlaveEndpointTest_NoAuthorizer_0_VcHT2K/http_credentials"
--image_provisioner_backend="copy" --initialize_driver_logging="true" --isolation="posix/cpu,posix/mem"
--launcher="posix" --launcher_dir="/mesos/mesos-1.2.0/_build/src" --logbufsecs="0" --logging_level="INFO"
--max_completed_executors_per_framework="150" --oversubscribed_resources_interval="15secs"
--perf_duration="10secs" --perf_interval="1mins" --qos_correction_interval_min="0ns" --quiet="false"
--recover="reconnect" --recovery_timeout="15mins" --registration_backoff_factor="10ms" --resources="cpus:2;gpus:0;mem:1024;disk:1024;ports:[31000-32000]"
--revocable_cpu_low_priority="true" --runtime_dir="/tmp/Endpoint_SlaveEndpointTest_NoAuthorizer_0_VcHT2K"
--sandbox_directory="/mnt/mesos/sandbox" --strict="true" --switch_user="true" --systemd_enable_support="true"
--systemd_runtime_directory="/run/systemd/system" --version="false" --work_dir="/tmp/Endpoint_SlaveEndpointTest_NoAuthorizer_0_lzFquO"
I1116 04:45:43.554358 30729 credentials.hpp:86] Loading credential for authentication from
'/tmp/Endpoint_SlaveEndpointTest_NoAuthorizer_0_VcHT2K/credential'
I1116 04:45:43.554577 30729 slave.cpp:346] Agent using credential for: test-principal
I1116 04:45:43.554605 30729 credentials.hpp:37] Loading credentials for authentication from
'/tmp/Endpoint_SlaveEndpointTest_NoAuthorizer_0_VcHT2K/http_credentials'
I1116 04:45:43.554924 30729 http.cpp:895] Using default 'basic' HTTP authenticator for realm
'mesos-agent-readonly'
I1116 04:45:43.555097 30729 http.cpp:895] Using default 'basic' HTTP authenticator for realm
'mesos-agent-readwrite'
I1116 04:45:43.556506 30729 slave.cpp:533] Agent resources: cpus(*):2; mem(*):1024; disk(*):1024;
ports(*):[31000-32000]
I1116 04:45:43.556607 30729 slave.cpp:541] Agent attributes: [  ]
I1116 04:45:43.556624 30729 slave.cpp:546] Agent hostname: 766843bf103b
I1116 04:45:43.558281 30731 state.cpp:57] Recovering state from '/tmp/Endpoint_SlaveEndpointTest_NoAuthorizer_0_lzFquO/meta'
I1116 04:45:43.558620 30740 status_update_manager.cpp:203] Recovering status update manager
I1116 04:45:43.558943 30736 containerizer.cpp:561] Recovering containerizer
I1116 04:45:43.560395 30730 provisioner.cpp:253] Provisioner recovery complete
I1116 04:45:43.560845 30728 slave.cpp:5411] Finished recovery
I1116 04:45:43.561384 30728 slave.cpp:5585] Querying resource estimator for oversubscribable
resources
I1116 04:45:43.561700 30729 slave.cpp:5599] Received oversubscribable resources {} from the
resource estimator
I1116 04:45:43.563673 30740 process.cpp:3570] Handling HTTP event for process 'slave(646)'
with path: '/slave(646)/monitor/statistics'
I1116 04:45:43.564630 30737 http.cpp:847] Authorizing principal 'test-principal' to GET the
'/monitor/statistics' endpoint
I1116 04:45:43.568342 30738 slave.cpp:787] Agent terminating
[       OK ] Endpoint/SlaveEndpointTest.NoAuthorizer/0 (28 ms)
[ RUN      ] Endpoint/SlaveEndpointTest.NoAuthorizer/1
I1116 04:45:43.579373 30708 containerizer.cpp:202] Using isolation: posix/cpu,posix/mem,filesystem/posix,network/cni
W1116 04:45:43.580040 30708 backend.cpp:76] Failed to create 'aufs' backend: AufsBackend requires
root privileges, but is running as user mesos
W1116 04:45:43.580204 30708 backend.cpp:76] Failed to create 'bind' backend: BindBackend requires
root privileges
I1116 04:45:43.581776 30708 cluster.cpp:435] Creating default 'local' authorizer
I1116 04:45:43.583609 30727 slave.cpp:208] Mesos agent started on (647)@172.17.0.2:44065
I1116 04:45:43.583667 30727 slave.cpp:209] Flags at startup: --acls="" --appc_simple_discovery_uri_prefix="http://"
--appc_store_dir="/tmp/mesos/store/appc" --authenticate_http_readonly="true" --authenticate_http_readwrite="true"
--authenticatee="crammd5" --authentication_backoff_factor="1secs" --authorizer="local" --cgroups_cpu_enable_pids_and_tids_count="false"
--cgroups_enable_cfs="false" --cgroups_hierarchy="/sys/fs/cgroup" --cgroups_limit_swap="false"
--cgroups_root="mesos" --container_disk_watch_interval="15secs" --containerizers="mesos" --credential="/tmp/Endpoint_SlaveEndpointTest_NoAuthorizer_1_3tIPwx/credential"
--default_role="*" --disk_watch_interval="1mins" --docker="docker" --docker_kill_orphans="true"
--docker_registry="https://registry-1.docker.io" --docker_remove_delay="6hrs" --docker_socket="/var/run/docker.sock"
--docker_stop_timeout="0ns" --docker_store_dir="/tmp/mesos/store/docker" --docker_volume_checkpoint_dir="/var/run/mesos/isolators/docker/volume"
--enforce_container_disk_quota="false" --executor_registration_timeout="1mins" --executor_shutdown_grace_period="5secs"
--fetcher_cache_dir="/tmp/Endpoint_SlaveEndpointTest_NoAuthorizer_1_3tIPwx/fetch" --fetcher_cache_size="2GB"
--frameworks_home="" --gc_delay="1weeks" --gc_disk_headroom="0.1" --hadoop_home="" --help="false"
--hostname_lookup="true" --http_authenticators="basic" --http_command_executor="false" --http_credentials="/tmp/Endpoint_SlaveEndpointTest_NoAuthorizer_1_3tIPwx/http_credentials"
--image_provisioner_backend="copy" --initialize_driver_logging="true" --isolation="posix/cpu,posix/mem"
--launcher="posix" --launcher_dir="/mesos/mesos-1.2.0/_build/src" --logbufsecs="0" --logging_level="INFO"
--max_completed_executors_per_framework="150" --oversubscribed_resources_interval="15secs"
--perf_duration="10secs" --perf_interval="1mins" --qos_correction_interval_min="0ns" --quiet="false"
--recover="reconnect" --recovery_timeout="15mins" --registration_backoff_factor="10ms" --resources="cpus:2;gpus:0;mem:1024;disk:1024;ports:[31000-32000]"
--revocable_cpu_low_priority="true" --runtime_dir="/tmp/Endpoint_SlaveEndpointTest_NoAuthorizer_1_3tIPwx"
--sandbox_directory="/mnt/mesos/sandbox" --strict="true" --switch_user="true" --systemd_enable_support="true"
--systemd_runtime_directory="/run/systemd/system" --version="false" --work_dir="/tmp/Endpoint_SlaveEndpointTest_NoAuthorizer_1_lxQDTA"
I1116 04:45:43.584563 30727 credentials.hpp:86] Loading credential for authentication from
'/tmp/Endpoint_SlaveEndpointTest_NoAuthorizer_1_3tIPwx/credential'
I1116 04:45:43.584843 30727 slave.cpp:346] Agent using credential for: test-principal
I1116 04:45:43.584879 30727 credentials.hpp:37] Loading credentials for authentication from
'/tmp/Endpoint_SlaveEndpointTest_NoAuthorizer_1_3tIPwx/http_credentials'
I1116 04:45:43.585278 30727 http.cpp:895] Using default 'basic' HTTP authenticator for realm
'mesos-agent-readonly'
I1116 04:45:43.585429 30727 http.cpp:895] Using default 'basic' HTTP authenticator for realm
'mesos-agent-readwrite'
I1116 04:45:43.586716 30727 slave.cpp:533] Agent resources: cpus(*):2; mem(*):1024; disk(*):1024;
ports(*):[31000-32000]
I1116 04:45:43.586809 30727 slave.cpp:541] Agent attributes: [  ]
I1116 04:45:43.586825 30727 slave.cpp:546] Agent hostname: 766843bf103b
I1116 04:45:43.588235 30732 state.cpp:57] Recovering state from '/tmp/Endpoint_SlaveEndpointTest_NoAuthorizer_1_lxQDTA/meta'
I1116 04:45:43.588461 30728 status_update_manager.cpp:203] Recovering status update manager
I1116 04:45:43.588670 30730 containerizer.cpp:561] Recovering containerizer
I1116 04:45:43.589745 30731 provisioner.cpp:253] Provisioner recovery complete
I1116 04:45:43.590032 30727 slave.cpp:5411] Finished recovery
I1116 04:45:43.590487 30727 slave.cpp:5585] Querying resource estimator for oversubscribable
resources
I1116 04:45:43.590736 30737 slave.cpp:5599] Received oversubscribable resources {} from the
resource estimator
I1116 04:45:43.592206 30742 process.cpp:3570] Handling HTTP event for process 'slave(647)'
with path: '/slave(647)/monitor/statistics.json'
I1116 04:45:43.592933 30740 http.cpp:847] Authorizing principal 'test-principal' to GET the
'/monitor/statistics.json' endpoint
I1116 04:45:43.595793 30739 slave.cpp:787] Agent terminating
[       OK ] Endpoint/SlaveEndpointTest.NoAuthorizer/1 (25 ms)
[ RUN      ] Endpoint/SlaveEndpointTest.NoAuthorizer/2
I1116 04:45:43.605892 30708 containerizer.cpp:202] Using isolation: posix/cpu,posix/mem,filesystem/posix,network/cni
W1116 04:45:43.606623 30708 backend.cpp:76] Failed to create 'aufs' backend: AufsBackend requires
root privileges, but is running as user mesos
W1116 04:45:43.606833 30708 backend.cpp:76] Failed to create 'bind' backend: BindBackend requires
root privileges
I1116 04:45:43.608237 30708 cluster.cpp:435] Creating default 'local' authorizer
I1116 04:45:43.609560 30731 slave.cpp:208] Mesos agent started on (648)@172.17.0.2:44065
I1116 04:45:43.609580 30731 slave.cpp:209] Flags at startup: --acls="" --appc_simple_discovery_uri_prefix="http://"
--appc_store_dir="/tmp/mesos/store/appc" --authenticate_http_readonly="true" --authenticate_http_readwrite="true"
--authenticatee="crammd5" --authentication_backoff_factor="1secs" --authorizer="local" --cgroups_cpu_enable_pids_and_tids_count="false"
--cgroups_enable_cfs="false" --cgroups_hierarchy="/sys/fs/cgroup" --cgroups_limit_swap="false"
--cgroups_root="mesos" --container_disk_watch_interval="15secs" --containerizers="mesos" --credential="/tmp/Endpoint_SlaveEndpointTest_NoAuthorizer_2_Fe9iik/credential"
--default_role="*" --disk_watch_interval="1mins" --docker="docker" --docker_kill_orphans="true"
--docker_registry="https://registry-1.docker.io" --docker_remove_delay="6hrs" --docker_socket="/var/run/docker.sock"
--docker_stop_timeout="0ns" --docker_store_dir="/tmp/mesos/store/docker" --docker_volume_checkpoint_dir="/var/run/mesos/isolators/docker/volume"
--enforce_container_disk_quota="false" --executor_registration_timeout="1mins" --executor_shutdown_grace_period="5secs"
--fetcher_cache_dir="/tmp/Endpoint_SlaveEndpointTest_NoAuthorizer_2_Fe9iik/fetch" --fetcher_cache_size="2GB"
--frameworks_home="" --gc_delay="1weeks" --gc_disk_headroom="0.1" --hadoop_home="" --help="false"
--hostname_lookup="true" --http_authenticators="basic" --http_command_executor="false" --http_credentials="/tmp/Endpoint_SlaveEndpointTest_NoAuthorizer_2_Fe9iik/http_credentials"
--image_provisioner_backend="copy" --initialize_driver_logging="true" --isolation="posix/cpu,posix/mem"
--launcher="posix" --launcher_dir="/mesos/mesos-1.2.0/_build/src" --logbufsecs="0" --logging_level="INFO"
--max_completed_executors_per_framework="150" --oversubscribed_resources_interval="15secs"
--perf_duration="10secs" --perf_interval="1mins" --qos_correction_interval_min="0ns" --quiet="false"
--recover="reconnect" --recovery_timeout="15mins" --registration_backoff_factor="10ms" --resources="cpus:2;gpus:0;mem:1024;disk:1024;ports:[31000-32000]"
--revocable_cpu_low_priority="true" --runtime_dir="/tmp/Endpoint_SlaveEndpointTest_NoAuthorizer_2_Fe9iik"
--sandbox_directory="/mnt/mesos/sandbox" --strict="true" --switch_user="true" --systemd_enable_support="true"
--systemd_runtime_directory="/run/systemd/system" --version="false" --work_dir="/tmp/Endpoint_SlaveEndpointTest_NoAuthorizer_2_VViQAn"
I1116 04:45:43.610070 30731 credentials.hpp:86] Loading credential for authentication from
'/tmp/Endpoint_SlaveEndpointTest_NoAuthorizer_2_Fe9iik/credential'
I1116 04:45:43.610219 30731 slave.cpp:346] Agent using credential for: test-principal
I1116 04:45:43.610239 30731 credentials.hpp:37] Loading credentials for authentication from
'/tmp/Endpoint_SlaveEndpointTest_NoAuthorizer_2_Fe9iik/http_credentials'
I1116 04:45:43.610460 30731 http.cpp:895] Using default 'basic' HTTP authenticator for realm
'mesos-agent-readonly'
I1116 04:45:43.610652 30731 http.cpp:895] Using default 'basic' HTTP authenticator for realm
'mesos-agent-readwrite'
I1116 04:45:43.611526 30731 slave.cpp:533] Agent resources: cpus(*):2; mem(*):1024; disk(*):1024;
ports(*):[31000-32000]
I1116 04:45:43.611603 30731 slave.cpp:541] Agent attributes: [  ]
I1116 04:45:43.611616 30731 slave.cpp:546] Agent hostname: 766843bf103b
I1116 04:45:43.613031 30741 state.cpp:57] Recovering state from '/tmp/Endpoint_SlaveEndpointTest_NoAuthorizer_2_VViQAn/meta'
I1116 04:45:43.613406 30729 status_update_manager.cpp:203] Recovering status update manager
I1116 04:45:43.613600 30728 containerizer.cpp:561] Recovering containerizer
I1116 04:45:43.614696 30733 provisioner.cpp:253] Provisioner recovery complete
I1116 04:45:43.615041 30730 slave.cpp:5411] Finished recovery
I1116 04:45:43.615480 30730 slave.cpp:5585] Querying resource estimator for oversubscribable
resources
I1116 04:45:43.615722 30742 slave.cpp:5599] Received oversubscribable resources {} from the
resource estimator
I1116 04:45:43.617192 30727 process.cpp:3570] Handling HTTP event for process 'slave(648)'
with path: '/slave(648)/containers'
I1116 04:45:43.617990 30740 http.cpp:847] Authorizing principal 'test-principal' to GET the
'/containers' endpoint
I1116 04:45:43.621042 30734 slave.cpp:787] Agent terminating
[       OK ] Endpoint/SlaveEndpointTest.NoAuthorizer/2 (26 ms)
[----------] 9 tests from Endpoint/SlaveEndpointTest (251 ms total)

[----------] Global test environment tear-down
[==========] 1371 tests from 155 test cases ran. (475922 ms total)
[  PASSED  ] 1370 tests.
[  FAILED  ] 1 test, listed below:
[  FAILED  ] PartitionTest.ReregisterSlavePartitionAware

 1 FAILED TEST
  YOU HAVE 4 DISABLED TESTS

make[4]: *** [check-local] Error 1
make[4]: Leaving directory `/mesos/mesos-1.2.0/_build/src'
make[3]: *** [check-am] Error 2
make[3]: Leaving directory `/mesos/mesos-1.2.0/_build/src'
make[2]: *** [check] Error 2
make[2]: Leaving directory `/mesos/mesos-1.2.0/_build/src'
make[1]: *** [check-recursive] Error 1
make[1]: Leaving directory `/mesos/mesos-1.2.0/_build'
make: *** [distcheck] Error 1
+ docker rmi mesos-1479269475-4206
Untagged: mesos-1479269475-4206:latest
Deleted: sha256:fa5976244dac04df42900e3f52437dde9467b8f501e757b95b1328df2b6eb3e0
Deleted: sha256:0f8640c6035c86b3b11c6a023eff9d061c0d11c445b792aeb49588496aaaba48
Deleted: sha256:6e97a008541c61fd0692fbb3013fdcca1fa99dc2425da044dc0f74a02b482853
Deleted: sha256:b07794f487851518cefb3747e4a3e5dc123c89270f31896e1905c96c7a9a830c
Deleted: sha256:2fd303c69922165a08741ecc08e13e5ff37b22a8bfe297de0380a65f1ec552d4
Deleted: sha256:35285d251f9bb18a9b3154177dcc46e826e8e6faa916e965c4ef61abb9bb3f98
Deleted: sha256:50b4a94172c344760508ccdc0305d9a163e90b528e19b39af698c8774b9720c7
Deleted: sha256:41fa87a50b873e5e0d5fee13f533a14eb543bb89d1f10aaed429b244beee96b6
Deleted: sha256:773dd4e5db1cafbeda22026c4d74b22b6febd639bb035afa89459787519e5881
Deleted: sha256:65ed67ed08bbe4a21893e04243daa3cdfcb78a849b84521243d68b52a58ace4e
Deleted: sha256:3ac029ed65d83ae619943b53652929a023ede7bc2a03f8f1c59fdd84dd08b8fb
Deleted: sha256:9c0c050f91b25202eb9d6c6cbf672d56c338b6d501e1a46c617d9f6dfd037c7e
Deleted: sha256:3fcc8f3099f8a779bc481567795e5001ac1705e7cf2ecbae139c66869c617d3f
Deleted: sha256:67700d02d41c842b90532f4252ddc517426dd7967e8f60f815285b0f4f84067c
Deleted: sha256:23754a5e411147b4f193cfd505369c72d15aed07a99b3eb587520cf0d0e185e6
Deleted: sha256:603410735a311e6d489c5704499091b1ba9508d7406fc00970961f64981ced95
Deleted: sha256:e96c99f1cc8fbc0a6f2bad3adcebe6c374797e5b5996b4f62aa9a6dc7b50ee77
Deleted: sha256:3d03baf60f3fdc24758f991ef9242fe9522fbeb65b57815f73cb8e209e846c96
Deleted: sha256:70b2b2208d20c7704b75f816c3fafcdf4cf669228646478adcd05015a8d67352
Deleted: sha256:dd9e92111c2537d5c6260ec388ca894fbd00da88c3a2b29fabad35525377c039
Deleted: sha256:96cd2bec588f5dcd0837bb1a1eb53471fb4b9bb5e8141e4d46432f01c87b6bd3
Deleted: sha256:af9f54363a8e5a9c1bf9f6000704052cff80157971cb9d82c6739c151229b2ec
Deleted: sha256:d8f3aec2e7bb61328371462841d3bfa1e3d608aa3c77b90b332f7129a3224684
Deleted: sha256:32ea711b6133991869592f73d7671a711071c0f1940d45ade1e8b4c0e5293c4c
Deleted: sha256:22701ea3ec3b0fde87eeceb836c9cc0d9a737a3de4473bb2257e0e4bdb96118a
Build step 'Execute shell' marked build as failure

Mime
View raw message