mesos-builds mailing list archives

Site index · List index
Message view « Date » · « Thread »
Top « Date » · « Thread »
From Apache Jenkins Server <jenk...@builds.apache.org>
Subject Build failed in Jenkins: Mesos » autotools,gcc,--verbose --enable-libevent --enable-ssl,GLOG_v=1 MESOS_VERBOSE=1,centos:7,(docker||Hadoop)&&(!ubuntu-us1)&&(!ubuntu-6)&&(!ubuntu-eu2) #2929
Date Tue, 15 Nov 2016 21:13:20 GMT
See <https://builds.apache.org/job/Mesos/BUILDTOOL=autotools,COMPILER=gcc,CONFIGURATION=--verbose%20--enable-libevent%20--enable-ssl,ENVIRONMENT=GLOG_v=1%20MESOS_VERBOSE=1,OS=centos%3A7,label_exp=(docker%7C%7CHadoop)&&(!ubuntu-us1)&&(!ubuntu-6)&&(!ubuntu-eu2)/2929/changes>

Changes:

[toenshoff] Updated getting-started.md for Mesos 1.1.0.

------------------------------------------
[...truncated 220494 lines...]
W1115 21:11:30.632025 31938 backend.cpp:76] Failed to create 'bind' backend: BindBackend requires
root privileges
I1115 21:11:30.634456 31962 slave.cpp:208] Mesos agent started on (641)@172.17.0.2:49967
I1115 21:11:30.634479 31962 slave.cpp:209] Flags at startup: --acls="" --appc_simple_discovery_uri_prefix="http://"
--appc_store_dir="/tmp/mesos/store/appc" --authenticate_http_readonly="true" --authenticate_http_readwrite="true"
--authenticatee="crammd5" --authentication_backoff_factor="1secs" --authorizer="local" --cgroups_cpu_enable_pids_and_tids_count="false"
--cgroups_enable_cfs="false" --cgroups_hierarchy="/sys/fs/cgroup" --cgroups_limit_swap="false"
--cgroups_root="mesos" --container_disk_watch_interval="15secs" --containerizers="mesos" --credential="/tmp/Endpoint_SlaveEndpointTest_AuthorizedRequest_1_5IzSMk/credential"
--default_role="*" --disk_watch_interval="1mins" --docker="docker" --docker_kill_orphans="true"
--docker_registry="https://registry-1.docker.io" --docker_remove_delay="6hrs" --docker_socket="/var/run/docker.sock"
--docker_stop_timeout="0ns" --docker_store_dir="/tmp/mesos/store/docker" --docker_volume_checkpoint_dir="/var/run/mesos/isolators/docker/volume"
--enforce_container_disk_quota="false" --executor_registration_timeout="1mins" --executor_shutdown_grace_period="5secs"
--fetcher_cache_dir="/tmp/Endpoint_SlaveEndpointTest_AuthorizedRequest_1_5IzSMk/fetch" --fetcher_cache_size="2GB"
--frameworks_home="" --gc_delay="1weeks" --gc_disk_headroom="0.1" --hadoop_home="" --help="false"
--hostname_lookup="true" --http_authenticators="basic" --http_command_executor="false" --http_credentials="/tmp/Endpoint_SlaveEndpointTest_AuthorizedRequest_1_5IzSMk/http_credentials"
--image_provisioner_backend="copy" --initialize_driver_logging="true" --isolation="posix/cpu,posix/mem"
--launcher="posix" --launcher_dir="/mesos/mesos-1.2.0/_build/src" --logbufsecs="0" --logging_level="INFO"
--max_completed_executors_per_framework="150" --oversubscribed_resources_interval="15secs"
--perf_duration="10secs" --perf_interval="1mins" --qos_correction_interval_min="0ns" --quiet="false"
--recover="reconnect" --recovery_timeout="15mins" --registration_backoff_factor="10ms" --resources="cpus:2;gpus:0;mem:1024;disk:1024;ports:[31000-32000]"
--revocable_cpu_low_priority="true" --runtime_dir="/tmp/Endpoint_SlaveEndpointTest_AuthorizedRequest_1_5IzSMk"
--sandbox_directory="/mnt/mesos/sandbox" --strict="true" --switch_user="true" --systemd_enable_support="true"
--systemd_runtime_directory="/run/systemd/system" --version="false" --work_dir="/tmp/Endpoint_SlaveEndpointTest_AuthorizedRequest_1_zlX8oX"
I1115 21:11:30.634979 31962 credentials.hpp:86] Loading credential for authentication from
'/tmp/Endpoint_SlaveEndpointTest_AuthorizedRequest_1_5IzSMk/credential'
I1115 21:11:30.635133 31962 slave.cpp:346] Agent using credential for: test-principal
I1115 21:11:30.635154 31962 credentials.hpp:37] Loading credentials for authentication from
'/tmp/Endpoint_SlaveEndpointTest_AuthorizedRequest_1_5IzSMk/http_credentials'
I1115 21:11:30.635368 31962 http.cpp:895] Using default 'basic' HTTP authenticator for realm
'mesos-agent-readonly'
I1115 21:11:30.635514 31962 http.cpp:895] Using default 'basic' HTTP authenticator for realm
'mesos-agent-readwrite'
I1115 21:11:30.636543 31962 slave.cpp:533] Agent resources: cpus(*):2; mem(*):1024; disk(*):1024;
ports(*):[31000-32000]
I1115 21:11:30.636620 31962 slave.cpp:541] Agent attributes: [  ]
I1115 21:11:30.636687 31962 slave.cpp:546] Agent hostname: e93e80a4717f
I1115 21:11:30.638201 31966 state.cpp:57] Recovering state from '/tmp/Endpoint_SlaveEndpointTest_AuthorizedRequest_1_zlX8oX/meta'
I1115 21:11:30.638458 31957 status_update_manager.cpp:203] Recovering status update manager
I1115 21:11:30.638751 31962 containerizer.cpp:561] Recovering containerizer
I1115 21:11:30.640348 31972 provisioner.cpp:253] Provisioner recovery complete
I1115 21:11:30.640866 31969 slave.cpp:5411] Finished recovery
I1115 21:11:30.641415 31969 slave.cpp:5585] Querying resource estimator for oversubscribable
resources
I1115 21:11:30.641787 31959 slave.cpp:5599] Received oversubscribable resources {} from the
resource estimator
I1115 21:11:30.643337 31957 process.cpp:3570] Handling HTTP event for process 'slave(641)'
with path: '/slave(641)/monitor/statistics.json'
I1115 21:11:30.644477 31972 http.cpp:847] Authorizing principal 'test-principal' to GET the
'/monitor/statistics.json' endpoint
I1115 21:11:30.647928 31963 slave.cpp:787] Agent terminating
[       OK ] Endpoint/SlaveEndpointTest.AuthorizedRequest/1 (27 ms)
[ RUN      ] Endpoint/SlaveEndpointTest.AuthorizedRequest/2
I1115 21:11:30.659039 31938 containerizer.cpp:202] Using isolation: posix/cpu,posix/mem,filesystem/posix,network/cni
W1115 21:11:30.659584 31938 backend.cpp:76] Failed to create 'aufs' backend: AufsBackend requires
root privileges, but is running as user mesos
W1115 21:11:30.659724 31938 backend.cpp:76] Failed to create 'bind' backend: BindBackend requires
root privileges
I1115 21:11:30.662252 31960 slave.cpp:208] Mesos agent started on (642)@172.17.0.2:49967
I1115 21:11:30.662277 31960 slave.cpp:209] Flags at startup: --acls="" --appc_simple_discovery_uri_prefix="http://"
--appc_store_dir="/tmp/mesos/store/appc" --authenticate_http_readonly="true" --authenticate_http_readwrite="true"
--authenticatee="crammd5" --authentication_backoff_factor="1secs" --authorizer="local" --cgroups_cpu_enable_pids_and_tids_count="false"
--cgroups_enable_cfs="false" --cgroups_hierarchy="/sys/fs/cgroup" --cgroups_limit_swap="false"
--cgroups_root="mesos" --container_disk_watch_interval="15secs" --containerizers="mesos" --credential="/tmp/Endpoint_SlaveEndpointTest_AuthorizedRequest_2_3rlhzQ/credential"
--default_role="*" --disk_watch_interval="1mins" --docker="docker" --docker_kill_orphans="true"
--docker_registry="https://registry-1.docker.io" --docker_remove_delay="6hrs" --docker_socket="/var/run/docker.sock"
--docker_stop_timeout="0ns" --docker_store_dir="/tmp/mesos/store/docker" --docker_volume_checkpoint_dir="/var/run/mesos/isolators/docker/volume"
--enforce_container_disk_quota="false" --executor_registration_timeout="1mins" --executor_shutdown_grace_period="5secs"
--fetcher_cache_dir="/tmp/Endpoint_SlaveEndpointTest_AuthorizedRequest_2_3rlhzQ/fetch" --fetcher_cache_size="2GB"
--frameworks_home="" --gc_delay="1weeks" --gc_disk_headroom="0.1" --hadoop_home="" --help="false"
--hostname_lookup="true" --http_authenticators="basic" --http_command_executor="false" --http_credentials="/tmp/Endpoint_SlaveEndpointTest_AuthorizedRequest_2_3rlhzQ/http_credentials"
--image_provisioner_backend="copy" --initialize_driver_logging="true" --isolation="posix/cpu,posix/mem"
--launcher="posix" --launcher_dir="/mesos/mesos-1.2.0/_build/src" --logbufsecs="0" --logging_level="INFO"
--max_completed_executors_per_framework="150" --oversubscribed_resources_interval="15secs"
--perf_duration="10secs" --perf_interval="1mins" --qos_correction_interval_min="0ns" --quiet="false"
--recover="reconnect" --recovery_timeout="15mins" --registration_backoff_factor="10ms" --resources="cpus:2;gpus:0;mem:1024;disk:1024;ports:[31000-32000]"
--revocable_cpu_low_priority="true" --runtime_dir="/tmp/Endpoint_SlaveEndpointTest_AuthorizedRequest_2_3rlhzQ"
--sandbox_directory="/mnt/mesos/sandbox" --strict="true" --switch_user="true" --systemd_enable_support="true"
--systemd_runtime_directory="/run/systemd/system" --version="false" --work_dir="/tmp/Endpoint_SlaveEndpointTest_AuthorizedRequest_2_hgVW6s"
I1115 21:11:30.662793 31960 credentials.hpp:86] Loading credential for authentication from
'/tmp/Endpoint_SlaveEndpointTest_AuthorizedRequest_2_3rlhzQ/credential'
I1115 21:11:30.662932 31960 slave.cpp:346] Agent using credential for: test-principal
I1115 21:11:30.662955 31960 credentials.hpp:37] Loading credentials for authentication from
'/tmp/Endpoint_SlaveEndpointTest_AuthorizedRequest_2_3rlhzQ/http_credentials'
I1115 21:11:30.663166 31960 http.cpp:895] Using default 'basic' HTTP authenticator for realm
'mesos-agent-readonly'
I1115 21:11:30.663305 31960 http.cpp:895] Using default 'basic' HTTP authenticator for realm
'mesos-agent-readwrite'
I1115 21:11:30.664351 31960 slave.cpp:533] Agent resources: cpus(*):2; mem(*):1024; disk(*):1024;
ports(*):[31000-32000]
I1115 21:11:30.664429 31960 slave.cpp:541] Agent attributes: [  ]
I1115 21:11:30.664449 31960 slave.cpp:546] Agent hostname: e93e80a4717f
I1115 21:11:30.665766 31964 state.cpp:57] Recovering state from '/tmp/Endpoint_SlaveEndpointTest_AuthorizedRequest_2_hgVW6s/meta'
I1115 21:11:30.666023 31961 status_update_manager.cpp:203] Recovering status update manager
I1115 21:11:30.666360 31971 containerizer.cpp:561] Recovering containerizer
I1115 21:11:30.667454 31958 provisioner.cpp:253] Provisioner recovery complete
I1115 21:11:30.667811 31963 slave.cpp:5411] Finished recovery
I1115 21:11:30.668210 31963 slave.cpp:5585] Querying resource estimator for oversubscribable
resources
I1115 21:11:30.668421 31959 slave.cpp:5599] Received oversubscribable resources {} from the
resource estimator
I1115 21:11:30.669662 31963 process.cpp:3570] Handling HTTP event for process 'slave(642)'
with path: '/slave(642)/containers'
I1115 21:11:30.670730 31969 http.cpp:847] Authorizing principal 'test-principal' to GET the
'/containers' endpoint
I1115 21:11:30.674263 31960 slave.cpp:787] Agent terminating
[       OK ] Endpoint/SlaveEndpointTest.AuthorizedRequest/2 (25 ms)
[ RUN      ] Endpoint/SlaveEndpointTest.UnauthorizedRequest/0
I1115 21:11:30.684736 31938 containerizer.cpp:202] Using isolation: posix/cpu,posix/mem,filesystem/posix,network/cni
W1115 21:11:30.685478 31938 backend.cpp:76] Failed to create 'aufs' backend: AufsBackend requires
root privileges, but is running as user mesos
W1115 21:11:30.685670 31938 backend.cpp:76] Failed to create 'bind' backend: BindBackend requires
root privileges
I1115 21:11:30.689162 31959 slave.cpp:208] Mesos agent started on (643)@172.17.0.2:49967
I1115 21:11:30.689194 31959 slave.cpp:209] Flags at startup: --acls="" --appc_simple_discovery_uri_prefix="http://"
--appc_store_dir="/tmp/mesos/store/appc" --authenticate_http_readonly="true" --authenticate_http_readwrite="true"
--authenticatee="crammd5" --authentication_backoff_factor="1secs" --authorizer="local" --cgroups_cpu_enable_pids_and_tids_count="false"
--cgroups_enable_cfs="false" --cgroups_hierarchy="/sys/fs/cgroup" --cgroups_limit_swap="false"
--cgroups_root="mesos" --container_disk_watch_interval="15secs" --containerizers="mesos" --credential="/tmp/Endpoint_SlaveEndpointTest_UnauthorizedRequest_0_l2FmCm/credential"
--default_role="*" --disk_watch_interval="1mins" --docker="docker" --docker_kill_orphans="true"
--docker_registry="https://registry-1.docker.io" --docker_remove_delay="6hrs" --docker_socket="/var/run/docker.sock"
--docker_stop_timeout="0ns" --docker_store_dir="/tmp/mesos/store/docker" --docker_volume_checkpoint_dir="/var/run/mesos/isolators/docker/volume"
--enforce_container_disk_quota="false" --executor_registration_timeout="1mins" --executor_shutdown_grace_period="5secs"
--fetcher_cache_dir="/tmp/Endpoint_SlaveEndpointTest_UnauthorizedRequest_0_l2FmCm/fetch" --fetcher_cache_size="2GB"
--frameworks_home="" --gc_delay="1weeks" --gc_disk_headroom="0.1" --hadoop_home="" --help="false"
--hostname_lookup="true" --http_authenticators="basic" --http_command_executor="false" --http_credentials="/tmp/Endpoint_SlaveEndpointTest_UnauthorizedRequest_0_l2FmCm/http_credentials"
--image_provisioner_backend="copy" --initialize_driver_logging="true" --isolation="posix/cpu,posix/mem"
--launcher="posix" --launcher_dir="/mesos/mesos-1.2.0/_build/src" --logbufsecs="0" --logging_level="INFO"
--max_completed_executors_per_framework="150" --oversubscribed_resources_interval="15secs"
--perf_duration="10secs" --perf_interval="1mins" --qos_correction_interval_min="0ns" --quiet="false"
--recover="reconnect" --recovery_timeout="15mins" --registration_backoff_factor="10ms" --resources="cpus:2;gpus:0;mem:1024;disk:1024;ports:[31000-32000]"
--revocable_cpu_low_priority="true" --runtime_dir="/tmp/Endpoint_SlaveEndpointTest_UnauthorizedRequest_0_l2FmCm"
--sandbox_directory="/mnt/mesos/sandbox" --strict="true" --switch_user="true" --systemd_enable_support="true"
--systemd_runtime_directory="/run/systemd/system" --version="false" --work_dir="/tmp/Endpoint_SlaveEndpointTest_UnauthorizedRequest_0_FLZV5Y"
I1115 21:11:30.690162 31959 credentials.hpp:86] Loading credential for authentication from
'/tmp/Endpoint_SlaveEndpointTest_UnauthorizedRequest_0_l2FmCm/credential'
I1115 21:11:30.690382 31959 slave.cpp:346] Agent using credential for: test-principal
I1115 21:11:30.690418 31959 credentials.hpp:37] Loading credentials for authentication from
'/tmp/Endpoint_SlaveEndpointTest_UnauthorizedRequest_0_l2FmCm/http_credentials'
I1115 21:11:30.690824 31959 http.cpp:895] Using default 'basic' HTTP authenticator for realm
'mesos-agent-readonly'
I1115 21:11:30.691020 31959 http.cpp:895] Using default 'basic' HTTP authenticator for realm
'mesos-agent-readwrite'
I1115 21:11:30.692332 31959 slave.cpp:533] Agent resources: cpus(*):2; mem(*):1024; disk(*):1024;
ports(*):[31000-32000]
I1115 21:11:30.692435 31959 slave.cpp:541] Agent attributes: [  ]
I1115 21:11:30.692451 31959 slave.cpp:546] Agent hostname: e93e80a4717f
I1115 21:11:30.694041 31964 state.cpp:57] Recovering state from '/tmp/Endpoint_SlaveEndpointTest_UnauthorizedRequest_0_FLZV5Y/meta'
I1115 21:11:30.694306 31970 status_update_manager.cpp:203] Recovering status update manager
I1115 21:11:30.694667 31961 containerizer.cpp:561] Recovering containerizer
I1115 21:11:30.696224 31963 provisioner.cpp:253] Provisioner recovery complete
I1115 21:11:30.696722 31959 slave.cpp:5411] Finished recovery
I1115 21:11:30.697258 31959 slave.cpp:5585] Querying resource estimator for oversubscribable
resources
I1115 21:11:30.697563 31963 slave.cpp:5599] Received oversubscribable resources {} from the
resource estimator
I1115 21:11:30.699098 31962 process.cpp:3570] Handling HTTP event for process 'slave(643)'
with path: '/slave(643)/monitor/statistics'
I1115 21:11:30.699933 31972 http.cpp:847] Authorizing principal 'test-principal' to GET the
'/monitor/statistics' endpoint
I1115 21:11:30.701791 31965 slave.cpp:787] Agent terminating
[       OK ] Endpoint/SlaveEndpointTest.UnauthorizedRequest/0 (27 ms)
[ RUN      ] Endpoint/SlaveEndpointTest.UnauthorizedRequest/1
I1115 21:11:30.712050 31938 containerizer.cpp:202] Using isolation: posix/cpu,posix/mem,filesystem/posix,network/cni
W1115 21:11:30.712879 31938 backend.cpp:76] Failed to create 'aufs' backend: AufsBackend requires
root privileges, but is running as user mesos
W1115 21:11:30.713104 31938 backend.cpp:76] Failed to create 'bind' backend: BindBackend requires
root privileges
I1115 21:11:30.716604 31957 slave.cpp:208] Mesos agent started on (644)@172.17.0.2:49967
I1115 21:11:30.716708 31957 slave.cpp:209] Flags at startup: --acls="" --appc_simple_discovery_uri_prefix="http://"
--appc_store_dir="/tmp/mesos/store/appc" --authenticate_http_readonly="true" --authenticate_http_readwrite="true"
--authenticatee="crammd5" --authentication_backoff_factor="1secs" --authorizer="local" --cgroups_cpu_enable_pids_and_tids_count="false"
--cgroups_enable_cfs="false" --cgroups_hierarchy="/sys/fs/cgroup" --cgroups_limit_swap="false"
--cgroups_root="mesos" --container_disk_watch_interval="15secs" --containerizers="mesos" --credential="/tmp/Endpoint_SlaveEndpointTest_UnauthorizedRequest_1_3DbiXS/credential"
--default_role="*" --disk_watch_interval="1mins" --docker="docker" --docker_kill_orphans="true"
--docker_registry="https://registry-1.docker.io" --docker_remove_delay="6hrs" --docker_socket="/var/run/docker.sock"
--docker_stop_timeout="0ns" --docker_store_dir="/tmp/mesos/store/docker" --docker_volume_checkpoint_dir="/var/run/mesos/isolators/docker/volume"
--enforce_container_disk_quota="false" --executor_registration_timeout="1mins" --executor_shutdown_grace_period="5secs"
--fetcher_cache_dir="/tmp/Endpoint_SlaveEndpointTest_UnauthorizedRequest_1_3DbiXS/fetch" --fetcher_cache_size="2GB"
--frameworks_home="" --gc_delay="1weeks" --gc_disk_headroom="0.1" --hadoop_home="" --help="false"
--hostname_lookup="true" --http_authenticators="basic" --http_command_executor="false" --http_credentials="/tmp/Endpoint_SlaveEndpointTest_UnauthorizedRequest_1_3DbiXS/http_credentials"
--image_provisioner_backend="copy" --initialize_driver_logging="true" --isolation="posix/cpu,posix/mem"
--launcher="posix" --launcher_dir="/mesos/mesos-1.2.0/_build/src" --logbufsecs="0" --logging_level="INFO"
--max_completed_executors_per_framework="150" --oversubscribed_resources_interval="15secs"
--perf_duration="10secs" --perf_interval="1mins" --qos_correction_interval_min="0ns" --quiet="false"
--recover="reconnect" --recovery_timeout="15mins" --registration_backoff_factor="10ms" --resources="cpus:2;gpus:0;mem:1024;disk:1024;ports:[31000-32000]"
--revocable_cpu_low_priority="true" --runtime_dir="/tmp/Endpoint_SlaveEndpointTest_UnauthorizedRequest_1_3DbiXS"
--sandbox_directory="/mnt/mesos/sandbox" --strict="true" --switch_user="true" --systemd_enable_support="true"
--systemd_runtime_directory="/run/systemd/system" --version="false" --work_dir="/tmp/Endpoint_SlaveEndpointTest_UnauthorizedRequest_1_9C6smv"
I1115 21:11:30.717365 31957 credentials.hpp:86] Loading credential for authentication from
'/tmp/Endpoint_SlaveEndpointTest_UnauthorizedRequest_1_3DbiXS/credential'
I1115 21:11:30.717533 31957 slave.cpp:346] Agent using credential for: test-principal
I1115 21:11:30.717559 31957 credentials.hpp:37] Loading credentials for authentication from
'/tmp/Endpoint_SlaveEndpointTest_UnauthorizedRequest_1_3DbiXS/http_credentials'
I1115 21:11:30.717830 31957 http.cpp:895] Using default 'basic' HTTP authenticator for realm
'mesos-agent-readonly'
I1115 21:11:30.717941 31957 http.cpp:895] Using default 'basic' HTTP authenticator for realm
'mesos-agent-readwrite'
I1115 21:11:30.718842 31957 slave.cpp:533] Agent resources: cpus(*):2; mem(*):1024; disk(*):1024;
ports(*):[31000-32000]
I1115 21:11:30.718912 31957 slave.cpp:541] Agent attributes: [  ]
I1115 21:11:30.718924 31957 slave.cpp:546] Agent hostname: e93e80a4717f
I1115 21:11:30.720080 31967 state.cpp:57] Recovering state from '/tmp/Endpoint_SlaveEndpointTest_UnauthorizedRequest_1_9C6smv/meta'
I1115 21:11:30.720351 31966 status_update_manager.cpp:203] Recovering status update manager
I1115 21:11:30.720592 31963 containerizer.cpp:561] Recovering containerizer
I1115 21:11:30.721735 31965 provisioner.cpp:253] Provisioner recovery complete
I1115 21:11:30.722093 31958 slave.cpp:5411] Finished recovery
I1115 21:11:30.722530 31958 slave.cpp:5585] Querying resource estimator for oversubscribable
resources
I1115 21:11:30.722779 31963 slave.cpp:5599] Received oversubscribable resources {} from the
resource estimator
I1115 21:11:30.723907 31965 process.cpp:3570] Handling HTTP event for process 'slave(644)'
with path: '/slave(644)/monitor/statistics.json'
I1115 21:11:30.724766 31969 http.cpp:847] Authorizing principal 'test-principal' to GET the
'/monitor/statistics.json' endpoint
I1115 21:11:30.726508 31972 slave.cpp:787] Agent terminating
[       OK ] Endpoint/SlaveEndpointTest.UnauthorizedRequest/1 (24 ms)
[ RUN      ] Endpoint/SlaveEndpointTest.UnauthorizedRequest/2
I1115 21:11:30.735803 31938 containerizer.cpp:202] Using isolation: posix/cpu,posix/mem,filesystem/posix,network/cni
W1115 21:11:30.736518 31938 backend.cpp:76] Failed to create 'aufs' backend: AufsBackend requires
root privileges, but is running as user mesos
W1115 21:11:30.736716 31938 backend.cpp:76] Failed to create 'bind' backend: BindBackend requires
root privileges
I1115 21:11:30.739325 31970 slave.cpp:208] Mesos agent started on (645)@172.17.0.2:49967
I1115 21:11:30.739382 31970 slave.cpp:209] Flags at startup: --acls="" --appc_simple_discovery_uri_prefix="http://"
--appc_store_dir="/tmp/mesos/store/appc" --authenticate_http_readonly="true" --authenticate_http_readwrite="true"
--authenticatee="crammd5" --authentication_backoff_factor="1secs" --authorizer="local" --cgroups_cpu_enable_pids_and_tids_count="false"
--cgroups_enable_cfs="false" --cgroups_hierarchy="/sys/fs/cgroup" --cgroups_limit_swap="false"
--cgroups_root="mesos" --container_disk_watch_interval="15secs" --containerizers="mesos" --credential="/tmp/Endpoint_SlaveEndpointTest_UnauthorizedRequest_2_hDD6xp/credential"
--default_role="*" --disk_watch_interval="1mins" --docker="docker" --docker_kill_orphans="true"
--docker_registry="https://registry-1.docker.io" --docker_remove_delay="6hrs" --docker_socket="/var/run/docker.sock"
--docker_stop_timeout="0ns" --docker_store_dir="/tmp/mesos/store/docker" --docker_volume_checkpoint_dir="/var/run/mesos/isolators/docker/volume"
--enforce_container_disk_quota="false" --executor_registration_timeout="1mins" --executor_shutdown_grace_period="5secs"
--fetcher_cache_dir="/tmp/Endpoint_SlaveEndpointTest_UnauthorizedRequest_2_hDD6xp/fetch" --fetcher_cache_size="2GB"
--frameworks_home="" --gc_delay="1weeks" --gc_disk_headroom="0.1" --hadoop_home="" --help="false"
--hostname_lookup="true" --http_authenticators="basic" --http_command_executor="false" --http_credentials="/tmp/Endpoint_SlaveEndpointTest_UnauthorizedRequest_2_hDD6xp/http_credentials"
--image_provisioner_backend="copy" --initialize_driver_logging="true" --isolation="posix/cpu,posix/mem"
--launcher="posix" --launcher_dir="/mesos/mesos-1.2.0/_build/src" --logbufsecs="0" --logging_level="INFO"
--max_completed_executors_per_framework="150" --oversubscribed_resources_interval="15secs"
--perf_duration="10secs" --perf_interval="1mins" --qos_correction_interval_min="0ns" --quiet="false"
--recover="reconnect" --recovery_timeout="15mins" --registration_backoff_factor="10ms" --resources="cpus:2;gpus:0;mem:1024;disk:1024;ports:[31000-32000]"
--revocable_cpu_low_priority="true" --runtime_dir="/tmp/Endpoint_SlaveEndpointTest_UnauthorizedRequest_2_hDD6xp"
--sandbox_directory="/mnt/mesos/sandbox" --strict="true" --switch_user="true" --systemd_enable_support="true"
--systemd_runtime_directory="/run/systemd/system" --version="false" --work_dir="/tmp/Endpoint_SlaveEndpointTest_UnauthorizedRequest_2_7FdnT1"
I1115 21:11:30.739871 31970 credentials.hpp:86] Loading credential for authentication from
'/tmp/Endpoint_SlaveEndpointTest_UnauthorizedRequest_2_hDD6xp/credential'
I1115 21:11:30.739995 31970 slave.cpp:346] Agent using credential for: test-principal
I1115 21:11:30.740015 31970 credentials.hpp:37] Loading credentials for authentication from
'/tmp/Endpoint_SlaveEndpointTest_UnauthorizedRequest_2_hDD6xp/http_credentials'
I1115 21:11:30.740207 31970 http.cpp:895] Using default 'basic' HTTP authenticator for realm
'mesos-agent-readonly'
I1115 21:11:30.740329 31970 http.cpp:895] Using default 'basic' HTTP authenticator for realm
'mesos-agent-readwrite'
I1115 21:11:30.741276 31970 slave.cpp:533] Agent resources: cpus(*):2; mem(*):1024; disk(*):1024;
ports(*):[31000-32000]
I1115 21:11:30.741348 31970 slave.cpp:541] Agent attributes: [  ]
I1115 21:11:30.741359 31970 slave.cpp:546] Agent hostname: e93e80a4717f
I1115 21:11:30.742563 31971 state.cpp:57] Recovering state from '/tmp/Endpoint_SlaveEndpointTest_UnauthorizedRequest_2_7FdnT1/meta'
I1115 21:11:30.742756 31964 status_update_manager.cpp:203] Recovering status update manager
I1115 21:11:30.742946 31958 containerizer.cpp:561] Recovering containerizer
I1115 21:11:30.744047 31972 provisioner.cpp:253] Provisioner recovery complete
I1115 21:11:30.744362 31960 slave.cpp:5411] Finished recovery
I1115 21:11:30.744771 31960 slave.cpp:5585] Querying resource estimator for oversubscribable
resources
I1115 21:11:30.745024 31958 slave.cpp:5599] Received oversubscribable resources {} from the
resource estimator
I1115 21:11:30.746289 31971 process.cpp:3570] Handling HTTP event for process 'slave(645)'
with path: '/slave(645)/containers'
I1115 21:11:30.747021 31960 http.cpp:847] Authorizing principal 'test-principal' to GET the
'/containers' endpoint
I1115 21:11:30.749325 31963 slave.cpp:787] Agent terminating
[       OK ] Endpoint/SlaveEndpointTest.UnauthorizedRequest/2 (24 ms)
[ RUN      ] Endpoint/SlaveEndpointTest.NoAuthorizer/0
I1115 21:11:30.759426 31938 containerizer.cpp:202] Using isolation: posix/cpu,posix/mem,filesystem/posix,network/cni
W1115 21:11:30.759989 31938 backend.cpp:76] Failed to create 'aufs' backend: AufsBackend requires
root privileges, but is running as user mesos
W1115 21:11:30.760125 31938 backend.cpp:76] Failed to create 'bind' backend: BindBackend requires
root privileges
I1115 21:11:30.761273 31938 cluster.cpp:435] Creating default 'local' authorizer
I1115 21:11:30.762694 31971 slave.cpp:208] Mesos agent started on (646)@172.17.0.2:49967
I1115 21:11:30.762717 31971 slave.cpp:209] Flags at startup: --acls="" --appc_simple_discovery_uri_prefix="http://"
--appc_store_dir="/tmp/mesos/store/appc" --authenticate_http_readonly="true" --authenticate_http_readwrite="true"
--authenticatee="crammd5" --authentication_backoff_factor="1secs" --authorizer="local" --cgroups_cpu_enable_pids_and_tids_count="false"
--cgroups_enable_cfs="false" --cgroups_hierarchy="/sys/fs/cgroup" --cgroups_limit_swap="false"
--cgroups_root="mesos" --container_disk_watch_interval="15secs" --containerizers="mesos" --credential="/tmp/Endpoint_SlaveEndpointTest_NoAuthorizer_0_NkgaoW/credential"
--default_role="*" --disk_watch_interval="1mins" --docker="docker" --docker_kill_orphans="true"
--docker_registry="https://registry-1.docker.io" --docker_remove_delay="6hrs" --docker_socket="/var/run/docker.sock"
--docker_stop_timeout="0ns" --docker_store_dir="/tmp/mesos/store/docker" --docker_volume_checkpoint_dir="/var/run/mesos/isolators/docker/volume"
--enforce_container_disk_quota="false" --executor_registration_timeout="1mins" --executor_shutdown_grace_period="5secs"
--fetcher_cache_dir="/tmp/Endpoint_SlaveEndpointTest_NoAuthorizer_0_NkgaoW/fetch" --fetcher_cache_size="2GB"
--frameworks_home="" --gc_delay="1weeks" --gc_disk_headroom="0.1" --hadoop_home="" --help="false"
--hostname_lookup="true" --http_authenticators="basic" --http_command_executor="false" --http_credentials="/tmp/Endpoint_SlaveEndpointTest_NoAuthorizer_0_NkgaoW/http_credentials"
--image_provisioner_backend="copy" --initialize_driver_logging="true" --isolation="posix/cpu,posix/mem"
--launcher="posix" --launcher_dir="/mesos/mesos-1.2.0/_build/src" --logbufsecs="0" --logging_level="INFO"
--max_completed_executors_per_framework="150" --oversubscribed_resources_interval="15secs"
--perf_duration="10secs" --perf_interval="1mins" --qos_correction_interval_min="0ns" --quiet="false"
--recover="reconnect" --recovery_timeout="15mins" --registration_backoff_factor="10ms" --resources="cpus:2;gpus:0;mem:1024;disk:1024;ports:[31000-32000]"
--revocable_cpu_low_priority="true" --runtime_dir="/tmp/Endpoint_SlaveEndpointTest_NoAuthorizer_0_NkgaoW"
--sandbox_directory="/mnt/mesos/sandbox" --strict="true" --switch_user="true" --systemd_enable_support="true"
--systemd_runtime_directory="/run/systemd/system" --version="false" --work_dir="/tmp/Endpoint_SlaveEndpointTest_NoAuthorizer_0_bvsyFy"
I1115 21:11:30.763218 31971 credentials.hpp:86] Loading credential for authentication from
'/tmp/Endpoint_SlaveEndpointTest_NoAuthorizer_0_NkgaoW/credential'
I1115 21:11:30.763339 31971 slave.cpp:346] Agent using credential for: test-principal
I1115 21:11:30.763360 31971 credentials.hpp:37] Loading credentials for authentication from
'/tmp/Endpoint_SlaveEndpointTest_NoAuthorizer_0_NkgaoW/http_credentials'
I1115 21:11:30.763550 31971 http.cpp:895] Using default 'basic' HTTP authenticator for realm
'mesos-agent-readonly'
I1115 21:11:30.763707 31971 http.cpp:895] Using default 'basic' HTTP authenticator for realm
'mesos-agent-readwrite'
I1115 21:11:30.764950 31971 slave.cpp:533] Agent resources: cpus(*):2; mem(*):1024; disk(*):1024;
ports(*):[31000-32000]
I1115 21:11:30.765048 31971 slave.cpp:541] Agent attributes: [  ]
I1115 21:11:30.765067 31971 slave.cpp:546] Agent hostname: e93e80a4717f
I1115 21:11:30.766407 31967 state.cpp:57] Recovering state from '/tmp/Endpoint_SlaveEndpointTest_NoAuthorizer_0_bvsyFy/meta'
I1115 21:11:30.766710 31957 status_update_manager.cpp:203] Recovering status update manager
I1115 21:11:30.766897 31970 containerizer.cpp:561] Recovering containerizer
I1115 21:11:30.768266 31963 provisioner.cpp:253] Provisioner recovery complete
I1115 21:11:30.768744 31958 slave.cpp:5411] Finished recovery
I1115 21:11:30.769398 31958 slave.cpp:5585] Querying resource estimator for oversubscribable
resources
I1115 21:11:30.769734 31957 slave.cpp:5599] Received oversubscribable resources {} from the
resource estimator
I1115 21:11:30.771364 31967 process.cpp:3570] Handling HTTP event for process 'slave(646)'
with path: '/slave(646)/monitor/statistics'
I1115 21:11:30.772400 31957 http.cpp:847] Authorizing principal 'test-principal' to GET the
'/monitor/statistics' endpoint
I1115 21:11:30.775728 31958 slave.cpp:787] Agent terminating
[       OK ] Endpoint/SlaveEndpointTest.NoAuthorizer/0 (26 ms)
[ RUN      ] Endpoint/SlaveEndpointTest.NoAuthorizer/1
I1115 21:11:30.786886 31938 containerizer.cpp:202] Using isolation: posix/cpu,posix/mem,filesystem/posix,network/cni
W1115 21:11:30.787665 31938 backend.cpp:76] Failed to create 'aufs' backend: AufsBackend requires
root privileges, but is running as user mesos
W1115 21:11:30.787835 31938 backend.cpp:76] Failed to create 'bind' backend: BindBackend requires
root privileges
I1115 21:11:30.789010 31938 cluster.cpp:435] Creating default 'local' authorizer
I1115 21:11:30.790400 31970 slave.cpp:208] Mesos agent started on (647)@172.17.0.2:49967
I1115 21:11:30.790437 31970 slave.cpp:209] Flags at startup: --acls="" --appc_simple_discovery_uri_prefix="http://"
--appc_store_dir="/tmp/mesos/store/appc" --authenticate_http_readonly="true" --authenticate_http_readwrite="true"
--authenticatee="crammd5" --authentication_backoff_factor="1secs" --authorizer="local" --cgroups_cpu_enable_pids_and_tids_count="false"
--cgroups_enable_cfs="false" --cgroups_hierarchy="/sys/fs/cgroup" --cgroups_limit_swap="false"
--cgroups_root="mesos" --container_disk_watch_interval="15secs" --containerizers="mesos" --credential="/tmp/Endpoint_SlaveEndpointTest_NoAuthorizer_1_HPMdvt/credential"
--default_role="*" --disk_watch_interval="1mins" --docker="docker" --docker_kill_orphans="true"
--docker_registry="https://registry-1.docker.io" --docker_remove_delay="6hrs" --docker_socket="/var/run/docker.sock"
--docker_stop_timeout="0ns" --docker_store_dir="/tmp/mesos/store/docker" --docker_volume_checkpoint_dir="/var/run/mesos/isolators/docker/volume"
--enforce_container_disk_quota="false" --executor_registration_timeout="1mins" --executor_shutdown_grace_period="5secs"
--fetcher_cache_dir="/tmp/Endpoint_SlaveEndpointTest_NoAuthorizer_1_HPMdvt/fetch" --fetcher_cache_size="2GB"
--frameworks_home="" --gc_delay="1weeks" --gc_disk_headroom="0.1" --hadoop_home="" --help="false"
--hostname_lookup="true" --http_authenticators="basic" --http_command_executor="false" --http_credentials="/tmp/Endpoint_SlaveEndpointTest_NoAuthorizer_1_HPMdvt/http_credentials"
--image_provisioner_backend="copy" --initialize_driver_logging="true" --isolation="posix/cpu,posix/mem"
--launcher="posix" --launcher_dir="/mesos/mesos-1.2.0/_build/src" --logbufsecs="0" --logging_level="INFO"
--max_completed_executors_per_framework="150" --oversubscribed_resources_interval="15secs"
--perf_duration="10secs" --perf_interval="1mins" --qos_correction_interval_min="0ns" --quiet="false"
--recover="reconnect" --recovery_timeout="15mins" --registration_backoff_factor="10ms" --resources="cpus:2;gpus:0;mem:1024;disk:1024;ports:[31000-32000]"
--revocable_cpu_low_priority="true" --runtime_dir="/tmp/Endpoint_SlaveEndpointTest_NoAuthorizer_1_HPMdvt"
--sandbox_directory="/mnt/mesos/sandbox" --strict="true" --switch_user="true" --systemd_enable_support="true"
--systemd_runtime_directory="/run/systemd/system" --version="false" --work_dir="/tmp/Endpoint_SlaveEndpointTest_NoAuthorizer_1_ZCCgI5"
I1115 21:11:30.790923 31970 credentials.hpp:86] Loading credential for authentication from
'/tmp/Endpoint_SlaveEndpointTest_NoAuthorizer_1_HPMdvt/credential'
I1115 21:11:30.791060 31970 slave.cpp:346] Agent using credential for: test-principal
I1115 21:11:30.791084 31970 credentials.hpp:37] Loading credentials for authentication from
'/tmp/Endpoint_SlaveEndpointTest_NoAuthorizer_1_HPMdvt/http_credentials'
I1115 21:11:30.791295 31970 http.cpp:895] Using default 'basic' HTTP authenticator for realm
'mesos-agent-readonly'
I1115 21:11:30.791409 31970 http.cpp:895] Using default 'basic' HTTP authenticator for realm
'mesos-agent-readwrite'
I1115 21:11:30.792531 31970 slave.cpp:533] Agent resources: cpus(*):2; mem(*):1024; disk(*):1024;
ports(*):[31000-32000]
I1115 21:11:30.792604 31970 slave.cpp:541] Agent attributes: [  ]
I1115 21:11:30.792618 31970 slave.cpp:546] Agent hostname: e93e80a4717f
I1115 21:11:30.794006 31961 state.cpp:57] Recovering state from '/tmp/Endpoint_SlaveEndpointTest_NoAuthorizer_1_ZCCgI5/meta'
I1115 21:11:30.794250 31971 status_update_manager.cpp:203] Recovering status update manager
I1115 21:11:30.794420 31963 containerizer.cpp:561] Recovering containerizer
I1115 21:11:30.795536 31970 provisioner.cpp:253] Provisioner recovery complete
I1115 21:11:30.795893 31964 slave.cpp:5411] Finished recovery
I1115 21:11:30.796308 31964 slave.cpp:5585] Querying resource estimator for oversubscribable
resources
I1115 21:11:30.796526 31960 slave.cpp:5599] Received oversubscribable resources {} from the
resource estimator
I1115 21:11:30.797726 31959 process.cpp:3570] Handling HTTP event for process 'slave(647)'
with path: '/slave(647)/monitor/statistics.json'
I1115 21:11:30.798431 31961 http.cpp:847] Authorizing principal 'test-principal' to GET the
'/monitor/statistics.json' endpoint
I1115 21:11:30.801944 31967 slave.cpp:787] Agent terminating
[       OK ] Endpoint/SlaveEndpointTest.NoAuthorizer/1 (25 ms)
[ RUN      ] Endpoint/SlaveEndpointTest.NoAuthorizer/2
I1115 21:11:30.812808 31938 containerizer.cpp:202] Using isolation: posix/cpu,posix/mem,filesystem/posix,network/cni
W1115 21:11:30.813529 31938 backend.cpp:76] Failed to create 'aufs' backend: AufsBackend requires
root privileges, but is running as user mesos
W1115 21:11:30.813714 31938 backend.cpp:76] Failed to create 'bind' backend: BindBackend requires
root privileges
I1115 21:11:30.815414 31938 cluster.cpp:435] Creating default 'local' authorizer
I1115 21:11:30.817301 31970 slave.cpp:208] Mesos agent started on (648)@172.17.0.2:49967
I1115 21:11:30.817335 31970 slave.cpp:209] Flags at startup: --acls="" --appc_simple_discovery_uri_prefix="http://"
--appc_store_dir="/tmp/mesos/store/appc" --authenticate_http_readonly="true" --authenticate_http_readwrite="true"
--authenticatee="crammd5" --authentication_backoff_factor="1secs" --authorizer="local" --cgroups_cpu_enable_pids_and_tids_count="false"
--cgroups_enable_cfs="false" --cgroups_hierarchy="/sys/fs/cgroup" --cgroups_limit_swap="false"
--cgroups_root="mesos" --container_disk_watch_interval="15secs" --containerizers="mesos" --credential="/tmp/Endpoint_SlaveEndpointTest_NoAuthorizer_2_ZqanT0/credential"
--default_role="*" --disk_watch_interval="1mins" --docker="docker" --docker_kill_orphans="true"
--docker_registry="https://registry-1.docker.io" --docker_remove_delay="6hrs" --docker_socket="/var/run/docker.sock"
--docker_stop_timeout="0ns" --docker_store_dir="/tmp/mesos/store/docker" --docker_volume_checkpoint_dir="/var/run/mesos/isolators/docker/volume"
--enforce_container_disk_quota="false" --executor_registration_timeout="1mins" --executor_shutdown_grace_period="5secs"
--fetcher_cache_dir="/tmp/Endpoint_SlaveEndpointTest_NoAuthorizer_2_ZqanT0/fetch" --fetcher_cache_size="2GB"
--frameworks_home="" --gc_delay="1weeks" --gc_disk_headroom="0.1" --hadoop_home="" --help="false"
--hostname_lookup="true" --http_authenticators="basic" --http_command_executor="false" --http_credentials="/tmp/Endpoint_SlaveEndpointTest_NoAuthorizer_2_ZqanT0/http_credentials"
--image_provisioner_backend="copy" --initialize_driver_logging="true" --isolation="posix/cpu,posix/mem"
--launcher="posix" --launcher_dir="/mesos/mesos-1.2.0/_build/src" --logbufsecs="0" --logging_level="INFO"
--max_completed_executors_per_framework="150" --oversubscribed_resources_interval="15secs"
--perf_duration="10secs" --perf_interval="1mins" --qos_correction_interval_min="0ns" --quiet="false"
--recover="reconnect" --recovery_timeout="15mins" --registration_backoff_factor="10ms" --resources="cpus:2;gpus:0;mem:1024;disk:1024;ports:[31000-32000]"
--revocable_cpu_low_priority="true" --runtime_dir="/tmp/Endpoint_SlaveEndpointTest_NoAuthorizer_2_ZqanT0"
--sandbox_directory="/mnt/mesos/sandbox" --strict="true" --switch_user="true" --systemd_enable_support="true"
--systemd_runtime_directory="/run/systemd/system" --version="false" --work_dir="/tmp/Endpoint_SlaveEndpointTest_NoAuthorizer_2_VqOb2C"
I1115 21:11:30.818127 31970 credentials.hpp:86] Loading credential for authentication from
'/tmp/Endpoint_SlaveEndpointTest_NoAuthorizer_2_ZqanT0/credential'
I1115 21:11:30.818279 31970 slave.cpp:346] Agent using credential for: test-principal
I1115 21:11:30.818305 31970 credentials.hpp:37] Loading credentials for authentication from
'/tmp/Endpoint_SlaveEndpointTest_NoAuthorizer_2_ZqanT0/http_credentials'
I1115 21:11:30.818568 31970 http.cpp:895] Using default 'basic' HTTP authenticator for realm
'mesos-agent-readonly'
I1115 21:11:30.818719 31970 http.cpp:895] Using default 'basic' HTTP authenticator for realm
'mesos-agent-readwrite'
I1115 21:11:30.819646 31970 slave.cpp:533] Agent resources: cpus(*):2; mem(*):1024; disk(*):1024;
ports(*):[31000-32000]
I1115 21:11:30.819721 31970 slave.cpp:541] Agent attributes: [  ]
I1115 21:11:30.819733 31970 slave.cpp:546] Agent hostname: e93e80a4717f
I1115 21:11:30.820814 31957 state.cpp:57] Recovering state from '/tmp/Endpoint_SlaveEndpointTest_NoAuthorizer_2_VqOb2C/meta'
I1115 21:11:30.821079 31971 status_update_manager.cpp:203] Recovering status update manager
I1115 21:11:30.821244 31968 containerizer.cpp:561] Recovering containerizer
I1115 21:11:30.822330 31968 provisioner.cpp:253] Provisioner recovery complete
I1115 21:11:30.822701 31961 slave.cpp:5411] Finished recovery
I1115 21:11:30.823125 31961 slave.cpp:5585] Querying resource estimator for oversubscribable
resources
I1115 21:11:30.823325 31967 slave.cpp:5599] Received oversubscribable resources {} from the
resource estimator
I1115 21:11:30.824458 31965 process.cpp:3570] Handling HTTP event for process 'slave(648)'
with path: '/slave(648)/containers'
I1115 21:11:30.825196 31962 http.cpp:847] Authorizing principal 'test-principal' to GET the
'/containers' endpoint
I1115 21:11:30.827543 31968 slave.cpp:787] Agent terminating
[       OK ] Endpoint/SlaveEndpointTest.NoAuthorizer/2 (25 ms)
[----------] 9 tests from Endpoint/SlaveEndpointTest (236 ms total)

[----------] Global test environment tear-down
[==========] 1371 tests from 155 test cases ran. (481245 ms total)
[  PASSED  ] 1369 tests.
[  FAILED  ] 2 tests, listed below:
[  FAILED  ] MasterAuthorizerTest/1.FilterFrameworksEndpoint, where TypeParam = mesos::internal::tests::Module<mesos::Authorizer,
(mesos::internal::tests::ModuleID)8>
[  FAILED  ] MasterTest.TaskStatusLabels

 2 FAILED TESTS
  YOU HAVE 4 DISABLED TESTS

make[4]: *** [check-local] Error 1
make[4]: Leaving directory `/mesos/mesos-1.2.0/_build/src'
make[3]: *** [check-am] Error 2
make[3]: Leaving directory `/mesos/mesos-1.2.0/_build/src'
make[2]: *** [check] Error 2
make[2]: Leaving directory `/mesos/mesos-1.2.0/_build/src'
make[1]: *** [check-recursive] Error 1
make[1]: Leaving directory `/mesos/mesos-1.2.0/_build'
make: *** [distcheck] Error 1
+ docker rmi mesos-1479242032-10434
Untagged: mesos-1479242032-10434:latest
Deleted: sha256:d6665fd47a5f4b014803ed42dac3596d369fcef1edf6d6d53671dc46d24893a2
Deleted: sha256:4fab468a1cd4be302749915fc7e2fb20c6c45017ba13f79522b55aecb4560ad9
Deleted: sha256:dec9e4723160739c582d64157d6815e396fa5fdb9907ad516528268ba2479eed
Deleted: sha256:d7862c1965e7f6d29feaf90dbe2d4a12ea0843ab8a2144221d8f4a02a7999f55
Deleted: sha256:22ce1b16ec9e7bcac2a35b40fa7d3249c9b7f9c26acc591fba3e474f4395bcb9
Deleted: sha256:ecedb75fe5997a4879f9f4a4fab96604b211b5b13c15be95dc33f5d4bff8a945
Deleted: sha256:430f8c0df19b99697040344058978ec1ad7196ff1ff15381bf92311ec3573b97
Deleted: sha256:ba92f982ae9c69f44c18dac489632b48c795cc7ee3890f7cb6a3dd2e4723f0aa
Deleted: sha256:2ec4a2e6755d2b3c02fa5d09913fe254cc0aac95559e7898894279ea8d9ee414
Deleted: sha256:dad2dc2da573bf5a5a33d81541eff213fc921c1be895c207a189952d88d5a2d0
Deleted: sha256:d802ea50953631d33f2d425e852d401f289d4ed16473701707c1d5f185b07e2e
Deleted: sha256:8dd0fcd20e257d39f4d9aab086cb5efc08b8880464fd06a2b36ae0312386b4a7
Deleted: sha256:93340c02f514878c4d1752e387464fa0a0c8995958f1255b0c2a20b825cf1e74
Deleted: sha256:c230e99dfdae855cebae7be1a16dd6e6536ffc8a320642020946c731442948d1
Deleted: sha256:a60480e663ae34878d415197049a696aa6812db531e9dc4fdfe54a038693c060
Deleted: sha256:dac96ce082f0805abe1ac024eecb4bd6c625a1483605b0d01477e1da0288b57a
Deleted: sha256:7bacaa45128bb3ae7c9a2fb5a4c2161db1a076ee9f01471bbedf398fed0617dc
Deleted: sha256:f9da85edc6eb51b82b5185d932a9955579d7eba1cdf32aa54b4d41b8c5458c0f
Deleted: sha256:519234a7f60529ab0a25628c1d478b31f145c06a4b5af3fb037a72660840c2d6
Deleted: sha256:dd1ee022c7e4b5299eb388ba53f5357ea18f0369dbacb2ba02e7384e84acdf81
Deleted: sha256:38fc0a091153802754c41ff43ee7f1f5a6eddf567d402af99b9d3cfa9a5ab4af
Deleted: sha256:ad0d27084de841f9b00ecb58834291556c9407920f422863c9779f369d86db33
Deleted: sha256:946f633a4d2521944f4bde20018b00a05e30e343025ac678df12e8920db029e5
Deleted: sha256:a53207165c80790337621c52e1274bf4298da10fba42e538fe5b7e155352bd95
Deleted: sha256:7620119ef712afc1f5eb960d4433e0a5d6550d0b6d3dc0eeb16d11db769618f1
Build step 'Execute shell' marked build as failure

Mime
View raw message