mesos-builds mailing list archives

Site index · List index
Message view « Date » · « Thread »
Top « Date » · « Thread »
From Apache Jenkins Server <jenk...@builds.apache.org>
Subject Build failed in Jenkins: Mesos » autotools,gcc,--verbose --enable-libevent --enable-ssl,GLOG_v=1 MESOS_VERBOSE=1,ubuntu:14.04,(docker||Hadoop)&&(!ubuntu-us1)&&(!ubuntu-6)&&(!ubuntu-eu2) #2927
Date Mon, 14 Nov 2016 15:21:40 GMT
See <https://builds.apache.org/job/Mesos/BUILDTOOL=autotools,COMPILER=gcc,CONFIGURATION=--verbose%20--enable-libevent%20--enable-ssl,ENVIRONMENT=GLOG_v=1%20MESOS_VERBOSE=1,OS=ubuntu%3A14.04,label_exp=(docker%7C%7CHadoop)&&(!ubuntu-us1)&&(!ubuntu-6)&&(!ubuntu-eu2)/2927/changes>

Changes:

[alexr] Added Stephen Hankinson to contributors list.

------------------------------------------
[...truncated 222107 lines...]
W1114 15:19:56.499135 30949 backend.cpp:76] Failed to create 'aufs' backend: AufsBackend requires
root privileges, but is running as user mesos
W1114 15:19:56.499266 30949 backend.cpp:76] Failed to create 'bind' backend: BindBackend requires
root privileges
I1114 15:19:56.501719 30971 slave.cpp:208] Mesos agent started on (642)@172.17.0.2:59098
I1114 15:19:56.501797 30971 slave.cpp:209] Flags at startup: --acls="" --appc_simple_discovery_uri_prefix="http://"
--appc_store_dir="/tmp/mesos/store/appc" --authenticate_http_readonly="true" --authenticate_http_readwrite="true"
--authenticatee="crammd5" --authentication_backoff_factor="1secs" --authorizer="local" --cgroups_cpu_enable_pids_and_tids_count="false"
--cgroups_enable_cfs="false" --cgroups_hierarchy="/sys/fs/cgroup" --cgroups_limit_swap="false"
--cgroups_root="mesos" --container_disk_watch_interval="15secs" --containerizers="mesos" --credential="/tmp/Endpoint_SlaveEndpointTest_AuthorizedRequest_1_Mj3TqZ/credential"
--default_role="*" --disk_watch_interval="1mins" --docker="docker" --docker_kill_orphans="true"
--docker_registry="https://registry-1.docker.io" --docker_remove_delay="6hrs" --docker_socket="/var/run/docker.sock"
--docker_stop_timeout="0ns" --docker_store_dir="/tmp/mesos/store/docker" --docker_volume_checkpoint_dir="/var/run/mesos/isolators/docker/volume"
--enforce_container_disk_quota="false" --executor_registration_timeout="1mins" --executor_shutdown_grace_period="5secs"
--fetcher_cache_dir="/tmp/Endpoint_SlaveEndpointTest_AuthorizedRequest_1_Mj3TqZ/fetch" --fetcher_cache_size="2GB"
--frameworks_home="" --gc_delay="1weeks" --gc_disk_headroom="0.1" --hadoop_home="" --help="false"
--hostname_lookup="true" --http_authenticators="basic" --http_command_executor="false" --http_credentials="/tmp/Endpoint_SlaveEndpointTest_AuthorizedRequest_1_Mj3TqZ/http_credentials"
--image_provisioner_backend="copy" --initialize_driver_logging="true" --isolation="posix/cpu,posix/mem"
--launcher="posix" --launcher_dir="/mesos/mesos-1.2.0/_build/src" --logbufsecs="0" --logging_level="INFO"
--max_completed_executors_per_framework="150" --oversubscribed_resources_interval="15secs"
--perf_duration="10secs" --perf_interval="1mins" --qos_correction_interval_min="0ns" --quiet="false"
--recover="reconnect" --recovery_timeout="15mins" --registration_backoff_factor="10ms" --resources="cpus:2;gpus:0;mem:1024;disk:1024;ports:[31000-32000]"
--revocable_cpu_low_priority="true" --runtime_dir="/tmp/Endpoint_SlaveEndpointTest_AuthorizedRequest_1_Mj3TqZ"
--sandbox_directory="/mnt/mesos/sandbox" --strict="true" --switch_user="true" --systemd_enable_support="true"
--systemd_runtime_directory="/run/systemd/system" --version="false" --work_dir="/tmp/Endpoint_SlaveEndpointTest_AuthorizedRequest_1_RCXl5K"
I1114 15:19:56.502223 30971 credentials.hpp:86] Loading credential for authentication from
'/tmp/Endpoint_SlaveEndpointTest_AuthorizedRequest_1_Mj3TqZ/credential'
I1114 15:19:56.502362 30971 slave.cpp:346] Agent using credential for: test-principal
I1114 15:19:56.502382 30971 credentials.hpp:37] Loading credentials for authentication from
'/tmp/Endpoint_SlaveEndpointTest_AuthorizedRequest_1_Mj3TqZ/http_credentials'
I1114 15:19:56.502599 30971 http.cpp:895] Using default 'basic' HTTP authenticator for realm
'mesos-agent-readonly'
I1114 15:19:56.502773 30971 http.cpp:895] Using default 'basic' HTTP authenticator for realm
'mesos-agent-readwrite'
I1114 15:19:56.503887 30971 slave.cpp:533] Agent resources: cpus(*):2; mem(*):1024; disk(*):1024;
ports(*):[31000-32000]
I1114 15:19:56.503959 30971 slave.cpp:541] Agent attributes: [  ]
I1114 15:19:56.503970 30971 slave.cpp:546] Agent hostname: ecdcfa35689e
I1114 15:19:56.505247 30981 state.cpp:57] Recovering state from '/tmp/Endpoint_SlaveEndpointTest_AuthorizedRequest_1_RCXl5K/meta'
I1114 15:19:56.505439 30971 status_update_manager.cpp:203] Recovering status update manager
I1114 15:19:56.505699 30972 containerizer.cpp:561] Recovering containerizer
I1114 15:19:56.506909 30971 provisioner.cpp:253] Provisioner recovery complete
I1114 15:19:56.507251 30978 slave.cpp:5411] Finished recovery
I1114 15:19:56.507753 30978 slave.cpp:5585] Querying resource estimator for oversubscribable
resources
I1114 15:19:56.508152 30974 slave.cpp:5599] Received oversubscribable resources {} from the
resource estimator
I1114 15:19:56.509968 30978 process.cpp:3570] Handling HTTP event for process 'slave(642)'
with path: '/slave(642)/monitor/statistics.json'
I1114 15:19:56.510949 30977 http.cpp:847] Authorizing principal 'test-principal' to GET the
'/monitor/statistics.json' endpoint
I1114 15:19:56.514722 30968 slave.cpp:787] Agent terminating
[       OK ] Endpoint/SlaveEndpointTest.AuthorizedRequest/1 (26 ms)
[ RUN      ] Endpoint/SlaveEndpointTest.AuthorizedRequest/2
I1114 15:19:56.524660 30949 containerizer.cpp:202] Using isolation: posix/cpu,posix/mem,filesystem/posix,network/cni
W1114 15:19:56.525264 30949 backend.cpp:76] Failed to create 'aufs' backend: AufsBackend requires
root privileges, but is running as user mesos
W1114 15:19:56.525399 30949 backend.cpp:76] Failed to create 'bind' backend: BindBackend requires
root privileges
I1114 15:19:56.528157 30982 slave.cpp:208] Mesos agent started on (643)@172.17.0.2:59098
I1114 15:19:56.528182 30982 slave.cpp:209] Flags at startup: --acls="" --appc_simple_discovery_uri_prefix="http://"
--appc_store_dir="/tmp/mesos/store/appc" --authenticate_http_readonly="true" --authenticate_http_readwrite="true"
--authenticatee="crammd5" --authentication_backoff_factor="1secs" --authorizer="local" --cgroups_cpu_enable_pids_and_tids_count="false"
--cgroups_enable_cfs="false" --cgroups_hierarchy="/sys/fs/cgroup" --cgroups_limit_swap="false"
--cgroups_root="mesos" --container_disk_watch_interval="15secs" --containerizers="mesos" --credential="/tmp/Endpoint_SlaveEndpointTest_AuthorizedRequest_2_k2na3U/credential"
--default_role="*" --disk_watch_interval="1mins" --docker="docker" --docker_kill_orphans="true"
--docker_registry="https://registry-1.docker.io" --docker_remove_delay="6hrs" --docker_socket="/var/run/docker.sock"
--docker_stop_timeout="0ns" --docker_store_dir="/tmp/mesos/store/docker" --docker_volume_checkpoint_dir="/var/run/mesos/isolators/docker/volume"
--enforce_container_disk_quota="false" --executor_registration_timeout="1mins" --executor_shutdown_grace_period="5secs"
--fetcher_cache_dir="/tmp/Endpoint_SlaveEndpointTest_AuthorizedRequest_2_k2na3U/fetch" --fetcher_cache_size="2GB"
--frameworks_home="" --gc_delay="1weeks" --gc_disk_headroom="0.1" --hadoop_home="" --help="false"
--hostname_lookup="true" --http_authenticators="basic" --http_command_executor="false" --http_credentials="/tmp/Endpoint_SlaveEndpointTest_AuthorizedRequest_2_k2na3U/http_credentials"
--image_provisioner_backend="copy" --initialize_driver_logging="true" --isolation="posix/cpu,posix/mem"
--launcher="posix" --launcher_dir="/mesos/mesos-1.2.0/_build/src" --logbufsecs="0" --logging_level="INFO"
--max_completed_executors_per_framework="150" --oversubscribed_resources_interval="15secs"
--perf_duration="10secs" --perf_interval="1mins" --qos_correction_interval_min="0ns" --quiet="false"
--recover="reconnect" --recovery_timeout="15mins" --registration_backoff_factor="10ms" --resources="cpus:2;gpus:0;mem:1024;disk:1024;ports:[31000-32000]"
--revocable_cpu_low_priority="true" --runtime_dir="/tmp/Endpoint_SlaveEndpointTest_AuthorizedRequest_2_k2na3U"
--sandbox_directory="/mnt/mesos/sandbox" --strict="true" --switch_user="true" --systemd_enable_support="true"
--systemd_runtime_directory="/run/systemd/system" --version="false" --work_dir="/tmp/Endpoint_SlaveEndpointTest_AuthorizedRequest_2_J67pDG"
I1114 15:19:56.528647 30982 credentials.hpp:86] Loading credential for authentication from
'/tmp/Endpoint_SlaveEndpointTest_AuthorizedRequest_2_k2na3U/credential'
I1114 15:19:56.528797 30982 slave.cpp:346] Agent using credential for: test-principal
I1114 15:19:56.528816 30982 credentials.hpp:37] Loading credentials for authentication from
'/tmp/Endpoint_SlaveEndpointTest_AuthorizedRequest_2_k2na3U/http_credentials'
I1114 15:19:56.529001 30982 http.cpp:895] Using default 'basic' HTTP authenticator for realm
'mesos-agent-readonly'
I1114 15:19:56.529100 30982 http.cpp:895] Using default 'basic' HTTP authenticator for realm
'mesos-agent-readwrite'
I1114 15:19:56.530143 30982 slave.cpp:533] Agent resources: cpus(*):2; mem(*):1024; disk(*):1024;
ports(*):[31000-32000]
I1114 15:19:56.530242 30982 slave.cpp:541] Agent attributes: [  ]
I1114 15:19:56.530258 30982 slave.cpp:546] Agent hostname: ecdcfa35689e
I1114 15:19:56.531625 30983 state.cpp:57] Recovering state from '/tmp/Endpoint_SlaveEndpointTest_AuthorizedRequest_2_J67pDG/meta'
I1114 15:19:56.532009 30970 status_update_manager.cpp:203] Recovering status update manager
I1114 15:19:56.532281 30976 containerizer.cpp:561] Recovering containerizer
I1114 15:19:56.534073 30968 provisioner.cpp:253] Provisioner recovery complete
I1114 15:19:56.534592 30979 slave.cpp:5411] Finished recovery
I1114 15:19:56.535135 30979 slave.cpp:5585] Querying resource estimator for oversubscribable
resources
I1114 15:19:56.535389 30968 slave.cpp:5599] Received oversubscribable resources {} from the
resource estimator
I1114 15:19:56.536819 30978 process.cpp:3570] Handling HTTP event for process 'slave(643)'
with path: '/slave(643)/containers'
I1114 15:19:56.537590 30976 http.cpp:847] Authorizing principal 'test-principal' to GET the
'/containers' endpoint
I1114 15:19:56.540544 30978 slave.cpp:787] Agent terminating
[       OK ] Endpoint/SlaveEndpointTest.AuthorizedRequest/2 (26 ms)
[ RUN      ] Endpoint/SlaveEndpointTest.UnauthorizedRequest/0
I1114 15:19:56.551532 30949 containerizer.cpp:202] Using isolation: posix/cpu,posix/mem,filesystem/posix,network/cni
W1114 15:19:56.552192 30949 backend.cpp:76] Failed to create 'aufs' backend: AufsBackend requires
root privileges, but is running as user mesos
W1114 15:19:56.552356 30949 backend.cpp:76] Failed to create 'bind' backend: BindBackend requires
root privileges
I1114 15:19:56.555552 30982 slave.cpp:208] Mesos agent started on (644)@172.17.0.2:59098
I1114 15:19:56.555579 30982 slave.cpp:209] Flags at startup: --acls="" --appc_simple_discovery_uri_prefix="http://"
--appc_store_dir="/tmp/mesos/store/appc" --authenticate_http_readonly="true" --authenticate_http_readwrite="true"
--authenticatee="crammd5" --authentication_backoff_factor="1secs" --authorizer="local" --cgroups_cpu_enable_pids_and_tids_count="false"
--cgroups_enable_cfs="false" --cgroups_hierarchy="/sys/fs/cgroup" --cgroups_limit_swap="false"
--cgroups_root="mesos" --container_disk_watch_interval="15secs" --containerizers="mesos" --credential="/tmp/Endpoint_SlaveEndpointTest_UnauthorizedRequest_0_mSk1WQ/credential"
--default_role="*" --disk_watch_interval="1mins" --docker="docker" --docker_kill_orphans="true"
--docker_registry="https://registry-1.docker.io" --docker_remove_delay="6hrs" --docker_socket="/var/run/docker.sock"
--docker_stop_timeout="0ns" --docker_store_dir="/tmp/mesos/store/docker" --docker_volume_checkpoint_dir="/var/run/mesos/isolators/docker/volume"
--enforce_container_disk_quota="false" --executor_registration_timeout="1mins" --executor_shutdown_grace_period="5secs"
--fetcher_cache_dir="/tmp/Endpoint_SlaveEndpointTest_UnauthorizedRequest_0_mSk1WQ/fetch" --fetcher_cache_size="2GB"
--frameworks_home="" --gc_delay="1weeks" --gc_disk_headroom="0.1" --hadoop_home="" --help="false"
--hostname_lookup="true" --http_authenticators="basic" --http_command_executor="false" --http_credentials="/tmp/Endpoint_SlaveEndpointTest_UnauthorizedRequest_0_mSk1WQ/http_credentials"
--image_provisioner_backend="copy" --initialize_driver_logging="true" --isolation="posix/cpu,posix/mem"
--launcher="posix" --launcher_dir="/mesos/mesos-1.2.0/_build/src" --logbufsecs="0" --logging_level="INFO"
--max_completed_executors_per_framework="150" --oversubscribed_resources_interval="15secs"
--perf_duration="10secs" --perf_interval="1mins" --qos_correction_interval_min="0ns" --quiet="false"
--recover="reconnect" --recovery_timeout="15mins" --registration_backoff_factor="10ms" --resources="cpus:2;gpus:0;mem:1024;disk:1024;ports:[31000-32000]"
--revocable_cpu_low_priority="true" --runtime_dir="/tmp/Endpoint_SlaveEndpointTest_UnauthorizedRequest_0_mSk1WQ"
--sandbox_directory="/mnt/mesos/sandbox" --strict="true" --switch_user="true" --systemd_enable_support="true"
--systemd_runtime_directory="/run/systemd/system" --version="false" --work_dir="/tmp/Endpoint_SlaveEndpointTest_UnauthorizedRequest_0_zgrTsC"
I1114 15:19:56.556161 30982 credentials.hpp:86] Loading credential for authentication from
'/tmp/Endpoint_SlaveEndpointTest_UnauthorizedRequest_0_mSk1WQ/credential'
I1114 15:19:56.556325 30982 slave.cpp:346] Agent using credential for: test-principal
I1114 15:19:56.556354 30982 credentials.hpp:37] Loading credentials for authentication from
'/tmp/Endpoint_SlaveEndpointTest_UnauthorizedRequest_0_mSk1WQ/http_credentials'
I1114 15:19:56.556617 30982 http.cpp:895] Using default 'basic' HTTP authenticator for realm
'mesos-agent-readonly'
I1114 15:19:56.556795 30982 http.cpp:895] Using default 'basic' HTTP authenticator for realm
'mesos-agent-readwrite'
I1114 15:19:56.558146 30982 slave.cpp:533] Agent resources: cpus(*):2; mem(*):1024; disk(*):1024;
ports(*):[31000-32000]
I1114 15:19:56.558246 30982 slave.cpp:541] Agent attributes: [  ]
I1114 15:19:56.558271 30982 slave.cpp:546] Agent hostname: ecdcfa35689e
I1114 15:19:56.559792 30973 state.cpp:57] Recovering state from '/tmp/Endpoint_SlaveEndpointTest_UnauthorizedRequest_0_zgrTsC/meta'
I1114 15:19:56.560106 30979 status_update_manager.cpp:203] Recovering status update manager
I1114 15:19:56.560376 30980 containerizer.cpp:561] Recovering containerizer
I1114 15:19:56.561827 30972 provisioner.cpp:253] Provisioner recovery complete
I1114 15:19:56.562307 30979 slave.cpp:5411] Finished recovery
I1114 15:19:56.562904 30979 slave.cpp:5585] Querying resource estimator for oversubscribable
resources
I1114 15:19:56.563181 30970 slave.cpp:5599] Received oversubscribable resources {} from the
resource estimator
I1114 15:19:56.564805 30968 process.cpp:3570] Handling HTTP event for process 'slave(644)'
with path: '/slave(644)/monitor/statistics'
I1114 15:19:56.565759 30975 http.cpp:847] Authorizing principal 'test-principal' to GET the
'/monitor/statistics' endpoint
I1114 15:19:56.567967 30970 slave.cpp:787] Agent terminating
[       OK ] Endpoint/SlaveEndpointTest.UnauthorizedRequest/0 (26 ms)
[ RUN      ] Endpoint/SlaveEndpointTest.UnauthorizedRequest/1
I1114 15:19:56.578660 30949 containerizer.cpp:202] Using isolation: posix/cpu,posix/mem,filesystem/posix,network/cni
W1114 15:19:56.579267 30949 backend.cpp:76] Failed to create 'aufs' backend: AufsBackend requires
root privileges, but is running as user mesos
W1114 15:19:56.579411 30949 backend.cpp:76] Failed to create 'bind' backend: BindBackend requires
root privileges
I1114 15:19:56.582387 30974 slave.cpp:208] Mesos agent started on (645)@172.17.0.2:59098
I1114 15:19:56.582417 30974 slave.cpp:209] Flags at startup: --acls="" --appc_simple_discovery_uri_prefix="http://"
--appc_store_dir="/tmp/mesos/store/appc" --authenticate_http_readonly="true" --authenticate_http_readwrite="true"
--authenticatee="crammd5" --authentication_backoff_factor="1secs" --authorizer="local" --cgroups_cpu_enable_pids_and_tids_count="false"
--cgroups_enable_cfs="false" --cgroups_hierarchy="/sys/fs/cgroup" --cgroups_limit_swap="false"
--cgroups_root="mesos" --container_disk_watch_interval="15secs" --containerizers="mesos" --credential="/tmp/Endpoint_SlaveEndpointTest_UnauthorizedRequest_1_46Sx8M/credential"
--default_role="*" --disk_watch_interval="1mins" --docker="docker" --docker_kill_orphans="true"
--docker_registry="https://registry-1.docker.io" --docker_remove_delay="6hrs" --docker_socket="/var/run/docker.sock"
--docker_stop_timeout="0ns" --docker_store_dir="/tmp/mesos/store/docker" --docker_volume_checkpoint_dir="/var/run/mesos/isolators/docker/volume"
--enforce_container_disk_quota="false" --executor_registration_timeout="1mins" --executor_shutdown_grace_period="5secs"
--fetcher_cache_dir="/tmp/Endpoint_SlaveEndpointTest_UnauthorizedRequest_1_46Sx8M/fetch" --fetcher_cache_size="2GB"
--frameworks_home="" --gc_delay="1weeks" --gc_disk_headroom="0.1" --hadoop_home="" --help="false"
--hostname_lookup="true" --http_authenticators="basic" --http_command_executor="false" --http_credentials="/tmp/Endpoint_SlaveEndpointTest_UnauthorizedRequest_1_46Sx8M/http_credentials"
--image_provisioner_backend="copy" --initialize_driver_logging="true" --isolation="posix/cpu,posix/mem"
--launcher="posix" --launcher_dir="/mesos/mesos-1.2.0/_build/src" --logbufsecs="0" --logging_level="INFO"
--max_completed_executors_per_framework="150" --oversubscribed_resources_interval="15secs"
--perf_duration="10secs" --perf_interval="1mins" --qos_correction_interval_min="0ns" --quiet="false"
--recover="reconnect" --recovery_timeout="15mins" --registration_backoff_factor="10ms" --resources="cpus:2;gpus:0;mem:1024;disk:1024;ports:[31000-32000]"
--revocable_cpu_low_priority="true" --runtime_dir="/tmp/Endpoint_SlaveEndpointTest_UnauthorizedRequest_1_46Sx8M"
--sandbox_directory="/mnt/mesos/sandbox" --strict="true" --switch_user="true" --systemd_enable_support="true"
--systemd_runtime_directory="/run/systemd/system" --version="false" --work_dir="/tmp/Endpoint_SlaveEndpointTest_UnauthorizedRequest_1_jfQ1zy"
I1114 15:19:56.582999 30974 credentials.hpp:86] Loading credential for authentication from
'/tmp/Endpoint_SlaveEndpointTest_UnauthorizedRequest_1_46Sx8M/credential'
I1114 15:19:56.583148 30974 slave.cpp:346] Agent using credential for: test-principal
I1114 15:19:56.583171 30974 credentials.hpp:37] Loading credentials for authentication from
'/tmp/Endpoint_SlaveEndpointTest_UnauthorizedRequest_1_46Sx8M/http_credentials'
I1114 15:19:56.583405 30974 http.cpp:895] Using default 'basic' HTTP authenticator for realm
'mesos-agent-readonly'
I1114 15:19:56.583535 30974 http.cpp:895] Using default 'basic' HTTP authenticator for realm
'mesos-agent-readwrite'
I1114 15:19:56.584794 30974 slave.cpp:533] Agent resources: cpus(*):2; mem(*):1024; disk(*):1024;
ports(*):[31000-32000]
I1114 15:19:56.584883 30974 slave.cpp:541] Agent attributes: [  ]
I1114 15:19:56.584899 30974 slave.cpp:546] Agent hostname: ecdcfa35689e
I1114 15:19:56.586441 30971 state.cpp:57] Recovering state from '/tmp/Endpoint_SlaveEndpointTest_UnauthorizedRequest_1_jfQ1zy/meta'
I1114 15:19:56.586750 30970 status_update_manager.cpp:203] Recovering status update manager
I1114 15:19:56.586992 30977 containerizer.cpp:561] Recovering containerizer
I1114 15:19:56.588317 30977 provisioner.cpp:253] Provisioner recovery complete
I1114 15:19:56.588778 30981 slave.cpp:5411] Finished recovery
I1114 15:19:56.589342 30981 slave.cpp:5585] Querying resource estimator for oversubscribable
resources
I1114 15:19:56.589710 30969 slave.cpp:5599] Received oversubscribable resources {} from the
resource estimator
I1114 15:19:56.591189 30970 process.cpp:3570] Handling HTTP event for process 'slave(645)'
with path: '/slave(645)/monitor/statistics.json'
I1114 15:19:56.592234 30973 http.cpp:847] Authorizing principal 'test-principal' to GET the
'/monitor/statistics.json' endpoint
I1114 15:19:56.594750 30980 slave.cpp:787] Agent terminating
[       OK ] Endpoint/SlaveEndpointTest.UnauthorizedRequest/1 (27 ms)
[ RUN      ] Endpoint/SlaveEndpointTest.UnauthorizedRequest/2
I1114 15:19:56.605844 30949 containerizer.cpp:202] Using isolation: posix/cpu,posix/mem,filesystem/posix,network/cni
W1114 15:19:56.606510 30949 backend.cpp:76] Failed to create 'aufs' backend: AufsBackend requires
root privileges, but is running as user mesos
W1114 15:19:56.606690 30949 backend.cpp:76] Failed to create 'bind' backend: BindBackend requires
root privileges
I1114 15:19:56.609405 30971 slave.cpp:208] Mesos agent started on (646)@172.17.0.2:59098
I1114 15:19:56.609428 30971 slave.cpp:209] Flags at startup: --acls="" --appc_simple_discovery_uri_prefix="http://"
--appc_store_dir="/tmp/mesos/store/appc" --authenticate_http_readonly="true" --authenticate_http_readwrite="true"
--authenticatee="crammd5" --authentication_backoff_factor="1secs" --authorizer="local" --cgroups_cpu_enable_pids_and_tids_count="false"
--cgroups_enable_cfs="false" --cgroups_hierarchy="/sys/fs/cgroup" --cgroups_limit_swap="false"
--cgroups_root="mesos" --container_disk_watch_interval="15secs" --containerizers="mesos" --credential="/tmp/Endpoint_SlaveEndpointTest_UnauthorizedRequest_2_mVwBBJ/credential"
--default_role="*" --disk_watch_interval="1mins" --docker="docker" --docker_kill_orphans="true"
--docker_registry="https://registry-1.docker.io" --docker_remove_delay="6hrs" --docker_socket="/var/run/docker.sock"
--docker_stop_timeout="0ns" --docker_store_dir="/tmp/mesos/store/docker" --docker_volume_checkpoint_dir="/var/run/mesos/isolators/docker/volume"
--enforce_container_disk_quota="false" --executor_registration_timeout="1mins" --executor_shutdown_grace_period="5secs"
--fetcher_cache_dir="/tmp/Endpoint_SlaveEndpointTest_UnauthorizedRequest_2_mVwBBJ/fetch" --fetcher_cache_size="2GB"
--frameworks_home="" --gc_delay="1weeks" --gc_disk_headroom="0.1" --hadoop_home="" --help="false"
--hostname_lookup="true" --http_authenticators="basic" --http_command_executor="false" --http_credentials="/tmp/Endpoint_SlaveEndpointTest_UnauthorizedRequest_2_mVwBBJ/http_credentials"
--image_provisioner_backend="copy" --initialize_driver_logging="true" --isolation="posix/cpu,posix/mem"
--launcher="posix" --launcher_dir="/mesos/mesos-1.2.0/_build/src" --logbufsecs="0" --logging_level="INFO"
--max_completed_executors_per_framework="150" --oversubscribed_resources_interval="15secs"
--perf_duration="10secs" --perf_interval="1mins" --qos_correction_interval_min="0ns" --quiet="false"
--recover="reconnect" --recovery_timeout="15mins" --registration_backoff_factor="10ms" --resources="cpus:2;gpus:0;mem:1024;disk:1024;ports:[31000-32000]"
--revocable_cpu_low_priority="true" --runtime_dir="/tmp/Endpoint_SlaveEndpointTest_UnauthorizedRequest_2_mVwBBJ"
--sandbox_directory="/mnt/mesos/sandbox" --strict="true" --switch_user="true" --systemd_enable_support="true"
--systemd_runtime_directory="/run/systemd/system" --version="false" --work_dir="/tmp/Endpoint_SlaveEndpointTest_UnauthorizedRequest_2_XN6FYu"
I1114 15:19:56.610107 30971 credentials.hpp:86] Loading credential for authentication from
'/tmp/Endpoint_SlaveEndpointTest_UnauthorizedRequest_2_mVwBBJ/credential'
I1114 15:19:56.610265 30971 slave.cpp:346] Agent using credential for: test-principal
I1114 15:19:56.610291 30971 credentials.hpp:37] Loading credentials for authentication from
'/tmp/Endpoint_SlaveEndpointTest_UnauthorizedRequest_2_mVwBBJ/http_credentials'
I1114 15:19:56.610591 30971 http.cpp:895] Using default 'basic' HTTP authenticator for realm
'mesos-agent-readonly'
I1114 15:19:56.610746 30971 http.cpp:895] Using default 'basic' HTTP authenticator for realm
'mesos-agent-readwrite'
I1114 15:19:56.611719 30971 slave.cpp:533] Agent resources: cpus(*):2; mem(*):1024; disk(*):1024;
ports(*):[31000-32000]
I1114 15:19:56.611795 30971 slave.cpp:541] Agent attributes: [  ]
I1114 15:19:56.611807 30971 slave.cpp:546] Agent hostname: ecdcfa35689e
I1114 15:19:56.612939 30968 state.cpp:57] Recovering state from '/tmp/Endpoint_SlaveEndpointTest_UnauthorizedRequest_2_XN6FYu/meta'
I1114 15:19:56.613195 30973 status_update_manager.cpp:203] Recovering status update manager
I1114 15:19:56.613359 30972 containerizer.cpp:561] Recovering containerizer
I1114 15:19:56.614558 30976 provisioner.cpp:253] Provisioner recovery complete
I1114 15:19:56.614938 30977 slave.cpp:5411] Finished recovery
I1114 15:19:56.615381 30977 slave.cpp:5585] Querying resource estimator for oversubscribable
resources
I1114 15:19:56.615720 30977 slave.cpp:5599] Received oversubscribable resources {} from the
resource estimator
I1114 15:19:56.617663 30970 process.cpp:3570] Handling HTTP event for process 'slave(646)'
with path: '/slave(646)/containers'
I1114 15:19:56.618664 30970 http.cpp:847] Authorizing principal 'test-principal' to GET the
'/containers' endpoint
I1114 15:19:56.620517 30972 slave.cpp:787] Agent terminating
[       OK ] Endpoint/SlaveEndpointTest.UnauthorizedRequest/2 (24 ms)
[ RUN      ] Endpoint/SlaveEndpointTest.NoAuthorizer/0
I1114 15:19:56.629678 30949 containerizer.cpp:202] Using isolation: posix/cpu,posix/mem,filesystem/posix,network/cni
W1114 15:19:56.630164 30949 backend.cpp:76] Failed to create 'aufs' backend: AufsBackend requires
root privileges, but is running as user mesos
W1114 15:19:56.630286 30949 backend.cpp:76] Failed to create 'bind' backend: BindBackend requires
root privileges
I1114 15:19:56.631378 30949 cluster.cpp:435] Creating default 'local' authorizer
I1114 15:19:56.632719 30971 slave.cpp:208] Mesos agent started on (647)@172.17.0.2:59098
I1114 15:19:56.632786 30971 slave.cpp:209] Flags at startup: --acls="" --appc_simple_discovery_uri_prefix="http://"
--appc_store_dir="/tmp/mesos/store/appc" --authenticate_http_readonly="true" --authenticate_http_readwrite="true"
--authenticatee="crammd5" --authentication_backoff_factor="1secs" --authorizer="local" --cgroups_cpu_enable_pids_and_tids_count="false"
--cgroups_enable_cfs="false" --cgroups_hierarchy="/sys/fs/cgroup" --cgroups_limit_swap="false"
--cgroups_root="mesos" --container_disk_watch_interval="15secs" --containerizers="mesos" --credential="/tmp/Endpoint_SlaveEndpointTest_NoAuthorizer_0_2neOkG/credential"
--default_role="*" --disk_watch_interval="1mins" --docker="docker" --docker_kill_orphans="true"
--docker_registry="https://registry-1.docker.io" --docker_remove_delay="6hrs" --docker_socket="/var/run/docker.sock"
--docker_stop_timeout="0ns" --docker_store_dir="/tmp/mesos/store/docker" --docker_volume_checkpoint_dir="/var/run/mesos/isolators/docker/volume"
--enforce_container_disk_quota="false" --executor_registration_timeout="1mins" --executor_shutdown_grace_period="5secs"
--fetcher_cache_dir="/tmp/Endpoint_SlaveEndpointTest_NoAuthorizer_0_2neOkG/fetch" --fetcher_cache_size="2GB"
--frameworks_home="" --gc_delay="1weeks" --gc_disk_headroom="0.1" --hadoop_home="" --help="false"
--hostname_lookup="true" --http_authenticators="basic" --http_command_executor="false" --http_credentials="/tmp/Endpoint_SlaveEndpointTest_NoAuthorizer_0_2neOkG/http_credentials"
--image_provisioner_backend="copy" --initialize_driver_logging="true" --isolation="posix/cpu,posix/mem"
--launcher="posix" --launcher_dir="/mesos/mesos-1.2.0/_build/src" --logbufsecs="0" --logging_level="INFO"
--max_completed_executors_per_framework="150" --oversubscribed_resources_interval="15secs"
--perf_duration="10secs" --perf_interval="1mins" --qos_correction_interval_min="0ns" --quiet="false"
--recover="reconnect" --recovery_timeout="15mins" --registration_backoff_factor="10ms" --resources="cpus:2;gpus:0;mem:1024;disk:1024;ports:[31000-32000]"
--revocable_cpu_low_priority="true" --runtime_dir="/tmp/Endpoint_SlaveEndpointTest_NoAuthorizer_0_2neOkG"
--sandbox_directory="/mnt/mesos/sandbox" --strict="true" --switch_user="true" --systemd_enable_support="true"
--systemd_runtime_directory="/run/systemd/system" --version="false" --work_dir="/tmp/Endpoint_SlaveEndpointTest_NoAuthorizer_0_HwHVDr"
I1114 15:19:56.633208 30971 credentials.hpp:86] Loading credential for authentication from
'/tmp/Endpoint_SlaveEndpointTest_NoAuthorizer_0_2neOkG/credential'
I1114 15:19:56.633333 30971 slave.cpp:346] Agent using credential for: test-principal
I1114 15:19:56.633354 30971 credentials.hpp:37] Loading credentials for authentication from
'/tmp/Endpoint_SlaveEndpointTest_NoAuthorizer_0_2neOkG/http_credentials'
I1114 15:19:56.633558 30971 http.cpp:895] Using default 'basic' HTTP authenticator for realm
'mesos-agent-readonly'
I1114 15:19:56.633718 30971 http.cpp:895] Using default 'basic' HTTP authenticator for realm
'mesos-agent-readwrite'
I1114 15:19:56.634698 30971 slave.cpp:533] Agent resources: cpus(*):2; mem(*):1024; disk(*):1024;
ports(*):[31000-32000]
I1114 15:19:56.634804 30971 slave.cpp:541] Agent attributes: [  ]
I1114 15:19:56.634830 30971 slave.cpp:546] Agent hostname: ecdcfa35689e
I1114 15:19:56.636435 30968 state.cpp:57] Recovering state from '/tmp/Endpoint_SlaveEndpointTest_NoAuthorizer_0_HwHVDr/meta'
I1114 15:19:56.636811 30970 status_update_manager.cpp:203] Recovering status update manager
I1114 15:19:56.637048 30982 containerizer.cpp:561] Recovering containerizer
I1114 15:19:56.638259 30974 provisioner.cpp:253] Provisioner recovery complete
I1114 15:19:56.638598 30972 slave.cpp:5411] Finished recovery
I1114 15:19:56.639118 30972 slave.cpp:5585] Querying resource estimator for oversubscribable
resources
I1114 15:19:56.639443 30969 slave.cpp:5599] Received oversubscribable resources {} from the
resource estimator
I1114 15:19:56.640856 30976 process.cpp:3570] Handling HTTP event for process 'slave(647)'
with path: '/slave(647)/monitor/statistics'
I1114 15:19:56.641746 30983 http.cpp:847] Authorizing principal 'test-principal' to GET the
'/monitor/statistics' endpoint
I1114 15:19:56.645407 30975 slave.cpp:787] Agent terminating
[       OK ] Endpoint/SlaveEndpointTest.NoAuthorizer/0 (26 ms)
[ RUN      ] Endpoint/SlaveEndpointTest.NoAuthorizer/1
I1114 15:19:56.657188 30949 containerizer.cpp:202] Using isolation: posix/cpu,posix/mem,filesystem/posix,network/cni
W1114 15:19:56.657871 30949 backend.cpp:76] Failed to create 'aufs' backend: AufsBackend requires
root privileges, but is running as user mesos
W1114 15:19:56.658021 30949 backend.cpp:76] Failed to create 'bind' backend: BindBackend requires
root privileges
I1114 15:19:56.659308 30949 cluster.cpp:435] Creating default 'local' authorizer
I1114 15:19:56.660915 30977 slave.cpp:208] Mesos agent started on (648)@172.17.0.2:59098
I1114 15:19:56.660943 30977 slave.cpp:209] Flags at startup: --acls="" --appc_simple_discovery_uri_prefix="http://"
--appc_store_dir="/tmp/mesos/store/appc" --authenticate_http_readonly="true" --authenticate_http_readwrite="true"
--authenticatee="crammd5" --authentication_backoff_factor="1secs" --authorizer="local" --cgroups_cpu_enable_pids_and_tids_count="false"
--cgroups_enable_cfs="false" --cgroups_hierarchy="/sys/fs/cgroup" --cgroups_limit_swap="false"
--cgroups_root="mesos" --container_disk_watch_interval="15secs" --containerizers="mesos" --credential="/tmp/Endpoint_SlaveEndpointTest_NoAuthorizer_1_wimQkD/credential"
--default_role="*" --disk_watch_interval="1mins" --docker="docker" --docker_kill_orphans="true"
--docker_registry="https://registry-1.docker.io" --docker_remove_delay="6hrs" --docker_socket="/var/run/docker.sock"
--docker_stop_timeout="0ns" --docker_store_dir="/tmp/mesos/store/docker" --docker_volume_checkpoint_dir="/var/run/mesos/isolators/docker/volume"
--enforce_container_disk_quota="false" --executor_registration_timeout="1mins" --executor_shutdown_grace_period="5secs"
--fetcher_cache_dir="/tmp/Endpoint_SlaveEndpointTest_NoAuthorizer_1_wimQkD/fetch" --fetcher_cache_size="2GB"
--frameworks_home="" --gc_delay="1weeks" --gc_disk_headroom="0.1" --hadoop_home="" --help="false"
--hostname_lookup="true" --http_authenticators="basic" --http_command_executor="false" --http_credentials="/tmp/Endpoint_SlaveEndpointTest_NoAuthorizer_1_wimQkD/http_credentials"
--image_provisioner_backend="copy" --initialize_driver_logging="true" --isolation="posix/cpu,posix/mem"
--launcher="posix" --launcher_dir="/mesos/mesos-1.2.0/_build/src" --logbufsecs="0" --logging_level="INFO"
--max_completed_executors_per_framework="150" --oversubscribed_resources_interval="15secs"
--perf_duration="10secs" --perf_interval="1mins" --qos_correction_interval_min="0ns" --quiet="false"
--recover="reconnect" --recovery_timeout="15mins" --registration_backoff_factor="10ms" --resources="cpus:2;gpus:0;mem:1024;disk:1024;ports:[31000-32000]"
--revocable_cpu_low_priority="true" --runtime_dir="/tmp/Endpoint_SlaveEndpointTest_NoAuthorizer_1_wimQkD"
--sandbox_directory="/mnt/mesos/sandbox" --strict="true" --switch_user="true" --systemd_enable_support="true"
--systemd_runtime_directory="/run/systemd/system" --version="false" --work_dir="/tmp/Endpoint_SlaveEndpointTest_NoAuthorizer_1_59ECzo"
I1114 15:19:56.661751 30977 credentials.hpp:86] Loading credential for authentication from
'/tmp/Endpoint_SlaveEndpointTest_NoAuthorizer_1_wimQkD/credential'
I1114 15:19:56.661927 30977 slave.cpp:346] Agent using credential for: test-principal
I1114 15:19:56.661957 30977 credentials.hpp:37] Loading credentials for authentication from
'/tmp/Endpoint_SlaveEndpointTest_NoAuthorizer_1_wimQkD/http_credentials'
I1114 15:19:56.662278 30977 http.cpp:895] Using default 'basic' HTTP authenticator for realm
'mesos-agent-readonly'
I1114 15:19:56.662403 30977 http.cpp:895] Using default 'basic' HTTP authenticator for realm
'mesos-agent-readwrite'
I1114 15:19:56.663489 30977 slave.cpp:533] Agent resources: cpus(*):2; mem(*):1024; disk(*):1024;
ports(*):[31000-32000]
I1114 15:19:56.663573 30977 slave.cpp:541] Agent attributes: [  ]
I1114 15:19:56.663588 30977 slave.cpp:546] Agent hostname: ecdcfa35689e
I1114 15:19:56.665045 30981 state.cpp:57] Recovering state from '/tmp/Endpoint_SlaveEndpointTest_NoAuthorizer_1_59ECzo/meta'
I1114 15:19:56.665334 30982 status_update_manager.cpp:203] Recovering status update manager
I1114 15:19:56.665519 30977 containerizer.cpp:561] Recovering containerizer
I1114 15:19:56.667366 30976 provisioner.cpp:253] Provisioner recovery complete
I1114 15:19:56.668035 30978 slave.cpp:5411] Finished recovery
I1114 15:19:56.668503 30978 slave.cpp:5585] Querying resource estimator for oversubscribable
resources
I1114 15:19:56.668812 30968 slave.cpp:5599] Received oversubscribable resources {} from the
resource estimator
I1114 15:19:56.670684 30975 process.cpp:3570] Handling HTTP event for process 'slave(648)'
with path: '/slave(648)/monitor/statistics.json'
I1114 15:19:56.671627 30968 http.cpp:847] Authorizing principal 'test-principal' to GET the
'/monitor/statistics.json' endpoint
I1114 15:19:56.674986 30976 slave.cpp:787] Agent terminating
[       OK ] Endpoint/SlaveEndpointTest.NoAuthorizer/1 (29 ms)
[ RUN      ] Endpoint/SlaveEndpointTest.NoAuthorizer/2
I1114 15:19:56.687162 30949 containerizer.cpp:202] Using isolation: posix/cpu,posix/mem,filesystem/posix,network/cni
W1114 15:19:56.687868 30949 backend.cpp:76] Failed to create 'aufs' backend: AufsBackend requires
root privileges, but is running as user mesos
W1114 15:19:56.688004 30949 backend.cpp:76] Failed to create 'bind' backend: BindBackend requires
root privileges
I1114 15:19:56.689148 30949 cluster.cpp:435] Creating default 'local' authorizer
I1114 15:19:56.690474 30978 slave.cpp:208] Mesos agent started on (649)@172.17.0.2:59098
I1114 15:19:56.690495 30978 slave.cpp:209] Flags at startup: --acls="" --appc_simple_discovery_uri_prefix="http://"
--appc_store_dir="/tmp/mesos/store/appc" --authenticate_http_readonly="true" --authenticate_http_readwrite="true"
--authenticatee="crammd5" --authentication_backoff_factor="1secs" --authorizer="local" --cgroups_cpu_enable_pids_and_tids_count="false"
--cgroups_enable_cfs="false" --cgroups_hierarchy="/sys/fs/cgroup" --cgroups_limit_swap="false"
--cgroups_root="mesos" --container_disk_watch_interval="15secs" --containerizers="mesos" --credential="/tmp/Endpoint_SlaveEndpointTest_NoAuthorizer_2_WsHbEA/credential"
--default_role="*" --disk_watch_interval="1mins" --docker="docker" --docker_kill_orphans="true"
--docker_registry="https://registry-1.docker.io" --docker_remove_delay="6hrs" --docker_socket="/var/run/docker.sock"
--docker_stop_timeout="0ns" --docker_store_dir="/tmp/mesos/store/docker" --docker_volume_checkpoint_dir="/var/run/mesos/isolators/docker/volume"
--enforce_container_disk_quota="false" --executor_registration_timeout="1mins" --executor_shutdown_grace_period="5secs"
--fetcher_cache_dir="/tmp/Endpoint_SlaveEndpointTest_NoAuthorizer_2_WsHbEA/fetch" --fetcher_cache_size="2GB"
--frameworks_home="" --gc_delay="1weeks" --gc_disk_headroom="0.1" --hadoop_home="" --help="false"
--hostname_lookup="true" --http_authenticators="basic" --http_command_executor="false" --http_credentials="/tmp/Endpoint_SlaveEndpointTest_NoAuthorizer_2_WsHbEA/http_credentials"
--image_provisioner_backend="copy" --initialize_driver_logging="true" --isolation="posix/cpu,posix/mem"
--launcher="posix" --launcher_dir="/mesos/mesos-1.2.0/_build/src" --logbufsecs="0" --logging_level="INFO"
--max_completed_executors_per_framework="150" --oversubscribed_resources_interval="15secs"
--perf_duration="10secs" --perf_interval="1mins" --qos_correction_interval_min="0ns" --quiet="false"
--recover="reconnect" --recovery_timeout="15mins" --registration_backoff_factor="10ms" --resources="cpus:2;gpus:0;mem:1024;disk:1024;ports:[31000-32000]"
--revocable_cpu_low_priority="true" --runtime_dir="/tmp/Endpoint_SlaveEndpointTest_NoAuthorizer_2_WsHbEA"
--sandbox_directory="/mnt/mesos/sandbox" --strict="true" --switch_user="true" --systemd_enable_support="true"
--systemd_runtime_directory="/run/systemd/system" --version="false" --work_dir="/tmp/Endpoint_SlaveEndpointTest_NoAuthorizer_2_hmo7Nl"
I1114 15:19:56.691001 30978 credentials.hpp:86] Loading credential for authentication from
'/tmp/Endpoint_SlaveEndpointTest_NoAuthorizer_2_WsHbEA/credential'
I1114 15:19:56.691133 30978 slave.cpp:346] Agent using credential for: test-principal
I1114 15:19:56.691151 30978 credentials.hpp:37] Loading credentials for authentication from
'/tmp/Endpoint_SlaveEndpointTest_NoAuthorizer_2_WsHbEA/http_credentials'
I1114 15:19:56.691351 30978 http.cpp:895] Using default 'basic' HTTP authenticator for realm
'mesos-agent-readonly'
I1114 15:19:56.691488 30978 http.cpp:895] Using default 'basic' HTTP authenticator for realm
'mesos-agent-readwrite'
I1114 15:19:56.692817 30978 slave.cpp:533] Agent resources: cpus(*):2; mem(*):1024; disk(*):1024;
ports(*):[31000-32000]
I1114 15:19:56.692920 30978 slave.cpp:541] Agent attributes: [  ]
I1114 15:19:56.692937 30978 slave.cpp:546] Agent hostname: ecdcfa35689e
I1114 15:19:56.694434 30969 state.cpp:57] Recovering state from '/tmp/Endpoint_SlaveEndpointTest_NoAuthorizer_2_hmo7Nl/meta'
I1114 15:19:56.694998 30978 status_update_manager.cpp:203] Recovering status update manager
I1114 15:19:56.695299 30974 containerizer.cpp:561] Recovering containerizer
I1114 15:19:56.696853 30977 provisioner.cpp:253] Provisioner recovery complete
I1114 15:19:56.697394 30971 slave.cpp:5411] Finished recovery
I1114 15:19:56.698004 30971 slave.cpp:5585] Querying resource estimator for oversubscribable
resources
I1114 15:19:56.698283 30980 slave.cpp:5599] Received oversubscribable resources {} from the
resource estimator
I1114 15:19:56.699883 30972 process.cpp:3570] Handling HTTP event for process 'slave(649)'
with path: '/slave(649)/containers'
I1114 15:19:56.700940 30978 http.cpp:847] Authorizing principal 'test-principal' to GET the
'/containers' endpoint
I1114 15:19:56.704394 30970 slave.cpp:787] Agent terminating
[       OK ] Endpoint/SlaveEndpointTest.NoAuthorizer/2 (29 ms)
[----------] 9 tests from Endpoint/SlaveEndpointTest (248 ms total)

[----------] Global test environment tear-down
[==========] 1378 tests from 156 test cases ran. (523444 ms total)
[  PASSED  ] 1376 tests.
[  FAILED  ] 2 tests, listed below:
[  FAILED  ] DefaultExecutorTest.KillTaskGroupOnTaskFailure
[  FAILED  ] MasterTest.MaxCompletedFrameworksFlag

 2 FAILED TESTS
  YOU HAVE 4 DISABLED TESTS

make[4]: *** [check-local] Error 1
make[4]: Leaving directory `/mesos/mesos-1.2.0/_build/src'
make[3]: *** [check-am] Error 2
make[3]: Leaving directory `/mesos/mesos-1.2.0/_build/src'
make[2]: *** [check] Error 2
make[2]: Leaving directory `/mesos/mesos-1.2.0/_build/src'
make[1]: *** [check-recursive] Error 1
make[1]: Leaving directory `/mesos/mesos-1.2.0/_build'
make: *** [distcheck] Error 1
+ docker rmi mesos-1479133916-28501
Untagged: mesos-1479133916-28501:latest
Deleted: sha256:d9d0ad20227acd73eddb9136e7764b78ceab66a71fffa1d74031d068dc01f1ae
Deleted: sha256:e04cfd629aa243d6c4acb7d5275f87f8ebef8705899253dd69fbefa747abcf56
Deleted: sha256:4e425cacee661ed7e7759d34e261803a030bd505365b35f0631e029337f7a2ba
Deleted: sha256:fdbff957eb2c43e04fd6e59a58c79e3b2fd2b706a041df8c2b3734b2faade17b
Deleted: sha256:8f4c576522467babbb81a8c21479199c0772a5549d47e68fa3a3d3a18ab467e4
Deleted: sha256:6c51a3eb4df6c4d0a41b4aa3e246d0d22c6d8d31a4de767b02fdb9f44f986b50
Deleted: sha256:255b1d65e8f036aadcfd94d4fa2d0c678ead2a6387b2bfa81d9c58737f332dc8
Deleted: sha256:b05ab35ae09a3ba3ecef3ecef87710ee3527c494c9ebe738b9a947ba48acdefa
Deleted: sha256:9b880cdb48a34b5f9b5b44a7095de3544c22915bc8a817ef382a9138a0cc740c
Deleted: sha256:368a3bf63b3d1217e7ed3d415df1222e0514cc53248932e6ca721a14ffc3237e
Deleted: sha256:3ae3451fe73a2f9443927f342aac4e706116b4a7b7449036e871835593445a58
Deleted: sha256:ad8eef626752bc05a03706d8fc0b1bc595cb00ef729fd474673dc57eab7bf8ad
Deleted: sha256:e110ba6670a4d9ae2a36369ba44d9a33f4e1c2c1a6a4d58a937cf366c92bc995
Deleted: sha256:6d2db9611c3c278dd08da8b4a4aa99324d254a6faf8441b8cdc1eda8fc28fc93
Deleted: sha256:9355bdc11763d39d9d27a86484a64aa81ac2093561e03951eeb0087c694493fc
Deleted: sha256:1cd93d2f2613ca7f43b65677262bbcf594689b1c076c74ec24b713bb3bf25f8a
Deleted: sha256:c3074178b86a814eff6091662fff417f4dfc5b416c4dfe25d3cc6067e57df077
Deleted: sha256:51bd1b0b80e1c7d82662b1d2cdf7553118a8cbbfd9bd86a89ae9990d5a8d1dd9
Deleted: sha256:a3a774372d226e4a6b3b302d6f6ebd3e8ff25ea3111a94d020c62640f21a368b
Deleted: sha256:ddf37caeba0d6b9223d454bc7992c65532d5a13973509f5ae647804133a6f25a
Deleted: sha256:51ec37734d9e5bdee9278d997fc075950ca2bcdd973920ab62cc79f17c06c7f7
Deleted: sha256:55f1dcaa56f0fa6211ff0fcfc121bbeffff68ebd24bdb4e83c25fae57532724d
Deleted: sha256:903ba6d850151b08f047d34914b1e577be34092160cffa4cde2a6079b7fa2c35
Deleted: sha256:4f0c2bafe98addd4ff6b894a0a268bdefc4c38079f618dc93b051c62ed2b3d1a
Build step 'Execute shell' marked build as failure

Mime
View raw message