mesos-builds mailing list archives

Site index · List index
Message view « Date » · « Thread »
Top « Date » · « Thread »
From Apache Jenkins Server <jenk...@builds.apache.org>
Subject Build failed in Jenkins: Mesos » cmake,gcc,--verbose --enable-libevent --enable-ssl,GLOG_v=1 MESOS_VERBOSE=1,ubuntu:14.04,(docker||Hadoop)&&(!ubuntu-us1)&&(!ubuntu-6) #2895
Date Sat, 05 Nov 2016 10:17:11 GMT
See <https://builds.apache.org/job/Mesos/BUILDTOOL=cmake,COMPILER=gcc,CONFIGURATION=--verbose%20--enable-libevent%20--enable-ssl,ENVIRONMENT=GLOG_v=1%20MESOS_VERBOSE=1,OS=ubuntu%3A14.04,label_exp=(docker%7C%7CHadoop)&&(!ubuntu-us1)&&(!ubuntu-6)/2895/changes>

Changes:

[zhq527725] Fixed a comment in `stat.hpp`.

[zhq527725] Fixed a typo in `executor.hpp`.

[zhq527725] Fixed a typo in the header files of stout.

------------------------------------------
[...truncated 10896 lines...]
make[2]: Leaving directory `/mesos/build'
/usr/bin/cmake -E cmake_progress_report /mesos/build/CMakeFiles 
[ 97%] Built target mesos-fetcher
make -f src/slave/CMakeFiles/mesos-agent.dir/build.make src/slave/CMakeFiles/mesos-agent.dir/depend
make[2]: Entering directory `/mesos/build'
cd /mesos/build && /usr/bin/cmake -E cmake_depends "Unix Makefiles" /mesos /mesos/src/slave /mesos/build /mesos/build/src/slave /mesos/build/src/slave/CMakeFiles/mesos-agent.dir/DependInfo.cmake --color=
Scanning dependencies of target mesos-agent
make[2]: Leaving directory `/mesos/build'
make -f src/slave/CMakeFiles/mesos-agent.dir/build.make src/slave/CMakeFiles/mesos-agent.dir/build
make[2]: Entering directory `/mesos/build'
/usr/bin/cmake -E cmake_progress_report /mesos/build/CMakeFiles 
[ 97%] Building CXX object src/slave/CMakeFiles/mesos-agent.dir/main.cpp.o
cd /mesos/build/src/slave && /usr/bin/g++   -DBUILD_DATE="\"2016-3-3 10:20\"" -DBUILD_FLAGS=\"\" -DBUILD_JAVA_JVM_LIBRARY=\"\" -DBUILD_TIME=\"1111100\" -DBUILD_USER=\"frank\" -DHAS_AUTHENTICATION=1 -DLIBDIR=\"/usr/local/libmesos\" -DPICOJSON_USE_INT64 -DPKGDATADIR=\"/usr/local/share/mesos\" -DPKGLIBEXECDIR=\"/usr/local/libexec/mesos\" -DUSE_STATIC_LIB -DVERSION=\"1.2.0\" -D__STDC_FORMAT_MACROS -std=c++11 -g -I/mesos/include -I/mesos/build/include -I/mesos/build/include/mesos -I/mesos/build/src -I/mesos/src -I/mesos/3rdparty/stout/include -I/usr/include/apr-1.0 -I/mesos/build/3rdparty/boost-1.53.0/src/boost-1.53.0 -I/mesos/build/3rdparty/elfio-3.2/src/elfio-3.2 -I/mesos/build/3rdparty/glog-0.3.3/src/glog-0.3.3-lib/lib/include -I/mesos/build/3rdparty/nvml-352.79/src/nvml-352.79 -I/mesos/build/3rdparty/picojson-1.3.0/src/picojson-1.3.0 -I/mesos/build/3rdparty/protobuf-2.6.1/src/protobuf-2.6.1-lib/lib/include -I/usr/include/subversion-1 -I/mesos/src/src -I/mesos/3rdparty/libprocess/include -I/mesos/build/3rdparty/http_parser-2.6.2/src/http_parser-2.6.2 -I/mesos/build/3rdparty/libevent-2.1.5-beta/src/libevent-2.1.5-beta-lib/lib/include -I/mesos/build/3rdparty/zookeeper-3.4.8/src/zookeeper-3.4.8/src/c/include -I/mesos/build/3rdparty/zookeeper-3.4.8/src/zookeeper-3.4.8/src/c/generated -I/mesos/build/3rdparty/leveldb-1.4/src/leveldb-1.4/include -I/mesos/src/slave/src    -o CMakeFiles/mesos-agent.dir/main.cpp.o -c /mesos/src/slave/main.cpp
make[2]: Leaving directory `/mesos/build'
/usr/bin/cmake -E cmake_progress_report /mesos/build/CMakeFiles  52
[ 97%] Built target mesos-docker-executor
make -f src/slave/CMakeFiles/mesos-logrotate-logger.dir/build.make src/slave/CMakeFiles/mesos-logrotate-logger.dir/depend
make[2]: Entering directory `/mesos/build'
cd /mesos/build && /usr/bin/cmake -E cmake_depends "Unix Makefiles" /mesos /mesos/src/slave /mesos/build /mesos/build/src/slave /mesos/build/src/slave/CMakeFiles/mesos-logrotate-logger.dir/DependInfo.cmake --color=
Scanning dependencies of target mesos-logrotate-logger
make[2]: Leaving directory `/mesos/build'
make -f src/slave/CMakeFiles/mesos-logrotate-logger.dir/build.make src/slave/CMakeFiles/mesos-logrotate-logger.dir/build
make[2]: Entering directory `/mesos/build'
/usr/bin/cmake -E cmake_progress_report /mesos/build/CMakeFiles 
[ 97%] Building CXX object src/slave/CMakeFiles/mesos-logrotate-logger.dir/container_loggers/logrotate.cpp.o
cd /mesos/build/src/slave && /usr/bin/g++   -DBUILD_DATE="\"2016-3-3 10:20\"" -DBUILD_FLAGS=\"\" -DBUILD_JAVA_JVM_LIBRARY=\"\" -DBUILD_TIME=\"1111100\" -DBUILD_USER=\"frank\" -DHAS_AUTHENTICATION=1 -DLIBDIR=\"/usr/local/libmesos\" -DPICOJSON_USE_INT64 -DPKGDATADIR=\"/usr/local/share/mesos\" -DPKGLIBEXECDIR=\"/usr/local/libexec/mesos\" -DUSE_STATIC_LIB -DVERSION=\"1.2.0\" -D__STDC_FORMAT_MACROS -std=c++11 -g -I/mesos/include -I/mesos/build/include -I/mesos/build/include/mesos -I/mesos/build/src -I/mesos/src -I/mesos/3rdparty/stout/include -I/usr/include/apr-1.0 -I/mesos/build/3rdparty/boost-1.53.0/src/boost-1.53.0 -I/mesos/build/3rdparty/elfio-3.2/src/elfio-3.2 -I/mesos/build/3rdparty/glog-0.3.3/src/glog-0.3.3-lib/lib/include -I/mesos/build/3rdparty/nvml-352.79/src/nvml-352.79 -I/mesos/build/3rdparty/picojson-1.3.0/src/picojson-1.3.0 -I/mesos/build/3rdparty/protobuf-2.6.1/src/protobuf-2.6.1-lib/lib/include -I/usr/include/subversion-1 -I/mesos/src/src -I/mesos/3rdparty/libprocess/include -I/mesos/build/3rdparty/http_parser-2.6.2/src/http_parser-2.6.2 -I/mesos/build/3rdparty/libevent-2.1.5-beta/src/libevent-2.1.5-beta-lib/lib/include -I/mesos/build/3rdparty/zookeeper-3.4.8/src/zookeeper-3.4.8/src/c/include -I/mesos/build/3rdparty/zookeeper-3.4.8/src/zookeeper-3.4.8/src/c/generated -I/mesos/build/3rdparty/leveldb-1.4/src/leveldb-1.4/include -I/mesos/src/slave/src    -o CMakeFiles/mesos-logrotate-logger.dir/container_loggers/logrotate.cpp.o -c /mesos/src/slave/container_loggers/logrotate.cpp
Linking CXX executable ../mesos-executor
cd /mesos/build/src/launcher && /usr/bin/cmake -E cmake_link_script CMakeFiles/mesos-executor.dir/link.txt --verbose=1
/usr/bin/g++    -std=c++11 -g    CMakeFiles/mesos-executor.dir/executor.cpp.o CMakeFiles/mesos-executor.dir/posix/executor.cpp.o  -o ../mesos-executor  -L/usr/lib/x86_64-linux-gnu/libapr-1.so  -L/mesos/build/3rdparty/glog-0.3.3/src/glog-0.3.3-lib/lib/lib  -L/mesos/build/3rdparty/protobuf-2.6.1/src/protobuf-2.6.1-lib/lib/lib  -L/usr/lib/x86_64-linux-gnu/libsvn_delta-1.so  -L/usr/lib/x86_64-linux-gnu/libsvn_diff-1.so  -L/usr/lib/x86_64-linux-gnu/libsvn_subr-1.so  -L/mesos/build/3rdparty/http_parser-2.6.2/src/http_parser-2.6.2-build  -L/mesos/build/3rdparty/libevent-2.1.5-beta/src/libevent-2.1.5-beta-lib/lib/lib  -L/mesos/build/3rdparty/zookeeper-3.4.8/src/zookeeper-3.4.8/src/c -rdynamic -lcurl -lglog -lsvn_delta-1 -lsvn_diff-1 -lsvn_subr-1 -lprotobuf -ldl -lapr-1 -lrt -lhttp_parser -levent -lrt -lz -lpthread ../../3rdparty/zookeeper-3.4.8/src/zookeeper-3.4.8/src/c/lib/libzookeeper_mt.a ../../3rdparty/libprocess/src/libprocess-0.0.1.a ../../3rdparty/leveldb-1.4/src/leveldb-1.4/libleveldb.a -lsasl2 -levent ../libmesos-1.2.0.a ../libmesos-protobufs.a ../../3rdparty/zookeeper-3.4.8/src/zookeeper-3.4.8/src/c/lib/libzookeeper_mt.a ../../3rdparty/libprocess/src/libprocess-0.0.1.a -lcurl -lglog -lsvn_delta-1 -lsvn_diff-1 -lsvn_subr-1 -lprotobuf -ldl -lapr-1 ../../3rdparty/leveldb-1.4/src/leveldb-1.4/libleveldb.a -lsasl2 -lrt -lhttp_parser -levent -lrt -lhttp_parser -levent -lz -lpthread -Wl,-rpath,/usr/lib/x86_64-linux-gnu/libapr-1.so:/mesos/build/3rdparty/glog-0.3.3/src/glog-0.3.3-lib/lib/lib:/mesos/build/3rdparty/protobuf-2.6.1/src/protobuf-2.6.1-lib/lib/lib:/usr/lib/x86_64-linux-gnu/libsvn_delta-1.so:/usr/lib/x86_64-linux-gnu/libsvn_diff-1.so:/usr/lib/x86_64-linux-gnu/libsvn_subr-1.so:/mesos/build/3rdparty/http_parser-2.6.2/src/http_parser-2.6.2-build:/mesos/build/3rdparty/libevent-2.1.5-beta/src/libevent-2.1.5-beta-lib/lib/lib:/mesos/build/3rdparty/zookeeper-3.4.8/src/zookeeper-3.4.8/src/c 
Linking CXX executable ../mesos-logrotate-logger
cd /mesos/build/src/slave && /usr/bin/cmake -E cmake_link_script CMakeFiles/mesos-logrotate-logger.dir/link.txt --verbose=1
/usr/bin/g++    -std=c++11 -g    CMakeFiles/mesos-logrotate-logger.dir/container_loggers/logrotate.cpp.o  -o ../mesos-logrotate-logger  -L/usr/lib/x86_64-linux-gnu/libapr-1.so  -L/mesos/build/3rdparty/glog-0.3.3/src/glog-0.3.3-lib/lib/lib  -L/mesos/build/3rdparty/protobuf-2.6.1/src/protobuf-2.6.1-lib/lib/lib  -L/usr/lib/x86_64-linux-gnu/libsvn_delta-1.so  -L/usr/lib/x86_64-linux-gnu/libsvn_diff-1.so  -L/usr/lib/x86_64-linux-gnu/libsvn_subr-1.so  -L/mesos/build/3rdparty/http_parser-2.6.2/src/http_parser-2.6.2-build  -L/mesos/build/3rdparty/libevent-2.1.5-beta/src/libevent-2.1.5-beta-lib/lib/lib  -L/mesos/build/3rdparty/zookeeper-3.4.8/src/zookeeper-3.4.8/src/c -rdynamic -lcurl -lglog -lsvn_delta-1 -lsvn_diff-1 -lsvn_subr-1 -lprotobuf -ldl -lapr-1 -lrt -lhttp_parser -levent -lrt -lz -lpthread ../../3rdparty/zookeeper-3.4.8/src/zookeeper-3.4.8/src/c/lib/libzookeeper_mt.a ../../3rdparty/libprocess/src/libprocess-0.0.1.a ../../3rdparty/leveldb-1.4/src/leveldb-1.4/libleveldb.a -lsasl2 -levent ../libmesos-1.2.0.a ../libmesos-protobufs.a ../../3rdparty/zookeeper-3.4.8/src/zookeeper-3.4.8/src/c/lib/libzookeeper_mt.a ../../3rdparty/libprocess/src/libprocess-0.0.1.a -lcurl -lglog -lsvn_delta-1 -lsvn_diff-1 -lsvn_subr-1 -lprotobuf -ldl -lapr-1 ../../3rdparty/leveldb-1.4/src/leveldb-1.4/libleveldb.a -lsasl2 -lrt -lhttp_parser -levent -lrt -lhttp_parser -levent -lz -lpthread -Wl,-rpath,/usr/lib/x86_64-linux-gnu/libapr-1.so:/mesos/build/3rdparty/glog-0.3.3/src/glog-0.3.3-lib/lib/lib:/mesos/build/3rdparty/protobuf-2.6.1/src/protobuf-2.6.1-lib/lib/lib:/usr/lib/x86_64-linux-gnu/libsvn_delta-1.so:/usr/lib/x86_64-linux-gnu/libsvn_diff-1.so:/usr/lib/x86_64-linux-gnu/libsvn_subr-1.so:/mesos/build/3rdparty/http_parser-2.6.2/src/http_parser-2.6.2-build:/mesos/build/3rdparty/libevent-2.1.5-beta/src/libevent-2.1.5-beta-lib/lib/lib:/mesos/build/3rdparty/zookeeper-3.4.8/src/zookeeper-3.4.8/src/c 
make[2]: Leaving directory `/mesos/build'
/usr/bin/cmake -E cmake_progress_report /mesos/build/CMakeFiles 
[ 97%] Built target mesos-executor
make -f src/slave/qos_controllers/CMakeFiles/load_qos_controller.dir/build.make src/slave/qos_controllers/CMakeFiles/load_qos_controller.dir/depend
make[2]: Entering directory `/mesos/build'
cd /mesos/build && /usr/bin/cmake -E cmake_depends "Unix Makefiles" /mesos /mesos/src/slave/qos_controllers /mesos/build /mesos/build/src/slave/qos_controllers /mesos/build/src/slave/qos_controllers/CMakeFiles/load_qos_controller.dir/DependInfo.cmake --color=
Scanning dependencies of target load_qos_controller
make[2]: Leaving directory `/mesos/build'
make -f src/slave/qos_controllers/CMakeFiles/load_qos_controller.dir/build.make src/slave/qos_controllers/CMakeFiles/load_qos_controller.dir/build
make[2]: Entering directory `/mesos/build'
/usr/bin/cmake -E cmake_progress_report /mesos/build/CMakeFiles 13
[ 98%] Building CXX object src/slave/qos_controllers/CMakeFiles/load_qos_controller.dir/load.cpp.o
cd /mesos/build/src/slave/qos_controllers && /usr/bin/g++   -DBUILD_DATE="\"2016-3-3 10:20\"" -DBUILD_FLAGS=\"\" -DBUILD_JAVA_JVM_LIBRARY=\"\" -DBUILD_TIME=\"1111100\" -DBUILD_USER=\"frank\" -DHAS_AUTHENTICATION=1 -DLIBDIR=\"/usr/local/libmesos\" -DPICOJSON_USE_INT64 -DPKGDATADIR=\"/usr/local/share/mesos\" -DPKGLIBEXECDIR=\"/usr/local/libexec/mesos\" -DUSE_STATIC_LIB -DVERSION=\"1.2.0\" -D__STDC_FORMAT_MACROS -Dload_qos_controller_EXPORTS -std=c++11 -g -fPIC -I/mesos/include -I/mesos/build/include -I/mesos/build/include/mesos -I/mesos/build/src -I/mesos/src -I/mesos/3rdparty/stout/include -I/usr/include/apr-1.0 -I/mesos/build/3rdparty/boost-1.53.0/src/boost-1.53.0 -I/mesos/build/3rdparty/elfio-3.2/src/elfio-3.2 -I/mesos/build/3rdparty/glog-0.3.3/src/glog-0.3.3-lib/lib/include -I/mesos/build/3rdparty/nvml-352.79/src/nvml-352.79 -I/mesos/build/3rdparty/picojson-1.3.0/src/picojson-1.3.0 -I/mesos/build/3rdparty/protobuf-2.6.1/src/protobuf-2.6.1-lib/lib/include -I/usr/include/subversion-1 -I/mesos/src/src -I/mesos/3rdparty/libprocess/include -I/mesos/build/3rdparty/http_parser-2.6.2/src/http_parser-2.6.2 -I/mesos/build/3rdparty/libevent-2.1.5-beta/src/libevent-2.1.5-beta-lib/lib/include -I/mesos/build/3rdparty/zookeeper-3.4.8/src/zookeeper-3.4.8/src/c/include -I/mesos/build/3rdparty/zookeeper-3.4.8/src/zookeeper-3.4.8/src/c/generated -I/mesos/build/3rdparty/leveldb-1.4/src/leveldb-1.4/include    -o CMakeFiles/load_qos_controller.dir/load.cpp.o -c /mesos/src/slave/qos_controllers/load.cpp
make[2]: Leaving directory `/mesos/build'
/usr/bin/cmake -E cmake_progress_report /mesos/build/CMakeFiles 
[ 98%] Built target mesos-logrotate-logger
make -f src/slave/resource_estimators/CMakeFiles/fixed_resource_estimator.dir/build.make src/slave/resource_estimators/CMakeFiles/fixed_resource_estimator.dir/depend
make[2]: Entering directory `/mesos/build'
cd /mesos/build && /usr/bin/cmake -E cmake_depends "Unix Makefiles" /mesos /mesos/src/slave/resource_estimators /mesos/build /mesos/build/src/slave/resource_estimators /mesos/build/src/slave/resource_estimators/CMakeFiles/fixed_resource_estimator.dir/DependInfo.cmake --color=
Scanning dependencies of target fixed_resource_estimator
make[2]: Leaving directory `/mesos/build'
make -f src/slave/resource_estimators/CMakeFiles/fixed_resource_estimator.dir/build.make src/slave/resource_estimators/CMakeFiles/fixed_resource_estimator.dir/build
make[2]: Entering directory `/mesos/build'
/usr/bin/cmake -E cmake_progress_report /mesos/build/CMakeFiles 
[ 98%] Building CXX object src/slave/resource_estimators/CMakeFiles/fixed_resource_estimator.dir/fixed.cpp.o
cd /mesos/build/src/slave/resource_estimators && /usr/bin/g++   -DBUILD_DATE="\"2016-3-3 10:20\"" -DBUILD_FLAGS=\"\" -DBUILD_JAVA_JVM_LIBRARY=\"\" -DBUILD_TIME=\"1111100\" -DBUILD_USER=\"frank\" -DHAS_AUTHENTICATION=1 -DLIBDIR=\"/usr/local/libmesos\" -DPICOJSON_USE_INT64 -DPKGDATADIR=\"/usr/local/share/mesos\" -DPKGLIBEXECDIR=\"/usr/local/libexec/mesos\" -DUSE_STATIC_LIB -DVERSION=\"1.2.0\" -D__STDC_FORMAT_MACROS -Dfixed_resource_estimator_EXPORTS -std=c++11 -g -fPIC -I/mesos/include -I/mesos/build/include -I/mesos/build/include/mesos -I/mesos/build/src -I/mesos/src -I/mesos/3rdparty/stout/include -I/usr/include/apr-1.0 -I/mesos/build/3rdparty/boost-1.53.0/src/boost-1.53.0 -I/mesos/build/3rdparty/elfio-3.2/src/elfio-3.2 -I/mesos/build/3rdparty/glog-0.3.3/src/glog-0.3.3-lib/lib/include -I/mesos/build/3rdparty/nvml-352.79/src/nvml-352.79 -I/mesos/build/3rdparty/picojson-1.3.0/src/picojson-1.3.0 -I/mesos/build/3rdparty/protobuf-2.6.1/src/protobuf-2.6.1-lib/lib/include -I/usr/include/subversion-1 -I/mesos/src/src -I/mesos/3rdparty/libprocess/include -I/mesos/build/3rdparty/http_parser-2.6.2/src/http_parser-2.6.2 -I/mesos/build/3rdparty/libevent-2.1.5-beta/src/libevent-2.1.5-beta-lib/lib/include -I/mesos/build/3rdparty/zookeeper-3.4.8/src/zookeeper-3.4.8/src/c/include -I/mesos/build/3rdparty/zookeeper-3.4.8/src/zookeeper-3.4.8/src/c/generated -I/mesos/build/3rdparty/leveldb-1.4/src/leveldb-1.4/include    -o CMakeFiles/fixed_resource_estimator.dir/fixed.cpp.o -c /mesos/src/slave/resource_estimators/fixed.cpp
Linking CXX executable ../mesos-master
cd /mesos/build/src/master && /usr/bin/cmake -E cmake_link_script CMakeFiles/mesos-master.dir/link.txt --verbose=1
/usr/bin/g++    -std=c++11 -g    CMakeFiles/mesos-master.dir/main.cpp.o  -o ../mesos-master  -L/usr/lib/x86_64-linux-gnu/libapr-1.so  -L/mesos/build/3rdparty/glog-0.3.3/src/glog-0.3.3-lib/lib/lib  -L/mesos/build/3rdparty/protobuf-2.6.1/src/protobuf-2.6.1-lib/lib/lib  -L/usr/lib/x86_64-linux-gnu/libsvn_delta-1.so  -L/usr/lib/x86_64-linux-gnu/libsvn_diff-1.so  -L/usr/lib/x86_64-linux-gnu/libsvn_subr-1.so  -L/mesos/build/3rdparty/http_parser-2.6.2/src/http_parser-2.6.2-build  -L/mesos/build/3rdparty/libevent-2.1.5-beta/src/libevent-2.1.5-beta-lib/lib/lib  -L/mesos/build/3rdparty/zookeeper-3.4.8/src/zookeeper-3.4.8/src/c -rdynamic -lcurl -lglog -lsvn_delta-1 -lsvn_diff-1 -lsvn_subr-1 -lprotobuf -ldl -lapr-1 -lrt -lhttp_parser -levent -lrt -lz -lpthread ../../3rdparty/zookeeper-3.4.8/src/zookeeper-3.4.8/src/c/lib/libzookeeper_mt.a ../../3rdparty/libprocess/src/libprocess-0.0.1.a ../../3rdparty/leveldb-1.4/src/leveldb-1.4/libleveldb.a -lsasl2 -levent ../libmesos-1.2.0.a ../libmesos-protobufs.a ../../3rdparty/zookeeper-3.4.8/src/zookeeper-3.4.8/src/c/lib/libzookeeper_mt.a ../../3rdparty/libprocess/src/libprocess-0.0.1.a -lcurl -lglog -lsvn_delta-1 -lsvn_diff-1 -lsvn_subr-1 -lprotobuf -ldl -lapr-1 ../../3rdparty/leveldb-1.4/src/leveldb-1.4/libleveldb.a -lsasl2 -lrt -lhttp_parser -levent -lrt -lhttp_parser -levent -lz -lpthread -Wl,-rpath,/usr/lib/x86_64-linux-gnu/libapr-1.so:/mesos/build/3rdparty/glog-0.3.3/src/glog-0.3.3-lib/lib/lib:/mesos/build/3rdparty/protobuf-2.6.1/src/protobuf-2.6.1-lib/lib/lib:/usr/lib/x86_64-linux-gnu/libsvn_delta-1.so:/usr/lib/x86_64-linux-gnu/libsvn_diff-1.so:/usr/lib/x86_64-linux-gnu/libsvn_subr-1.so:/mesos/build/3rdparty/http_parser-2.6.2/src/http_parser-2.6.2-build:/mesos/build/3rdparty/libevent-2.1.5-beta/src/libevent-2.1.5-beta-lib/lib/lib:/mesos/build/3rdparty/zookeeper-3.4.8/src/zookeeper-3.4.8/src/c 
Linking CXX executable ../mesos-agent
cd /mesos/build/src/slave && /usr/bin/cmake -E cmake_link_script CMakeFiles/mesos-agent.dir/link.txt --verbose=1
/usr/bin/g++    -std=c++11 -g    CMakeFiles/mesos-agent.dir/main.cpp.o  -o ../mesos-agent  -L/usr/lib/x86_64-linux-gnu/libapr-1.so  -L/mesos/build/3rdparty/glog-0.3.3/src/glog-0.3.3-lib/lib/lib  -L/mesos/build/3rdparty/protobuf-2.6.1/src/protobuf-2.6.1-lib/lib/lib  -L/usr/lib/x86_64-linux-gnu/libsvn_delta-1.so  -L/usr/lib/x86_64-linux-gnu/libsvn_diff-1.so  -L/usr/lib/x86_64-linux-gnu/libsvn_subr-1.so  -L/mesos/build/3rdparty/http_parser-2.6.2/src/http_parser-2.6.2-build  -L/mesos/build/3rdparty/libevent-2.1.5-beta/src/libevent-2.1.5-beta-lib/lib/lib  -L/mesos/build/3rdparty/zookeeper-3.4.8/src/zookeeper-3.4.8/src/c -rdynamic -lcurl -lglog -lsvn_delta-1 -lsvn_diff-1 -lsvn_subr-1 -lprotobuf -ldl -lapr-1 -lrt -lhttp_parser -levent -lrt -lz -lpthread ../../3rdparty/zookeeper-3.4.8/src/zookeeper-3.4.8/src/c/lib/libzookeeper_mt.a ../../3rdparty/libprocess/src/libprocess-0.0.1.a ../../3rdparty/leveldb-1.4/src/leveldb-1.4/libleveldb.a -lsasl2 -levent ../libmesos-1.2.0.a ../libmesos-protobufs.a ../../3rdparty/zookeeper-3.4.8/src/zookeeper-3.4.8/src/c/lib/libzookeeper_mt.a ../../3rdparty/libprocess/src/libprocess-0.0.1.a -lcurl -lglog -lsvn_delta-1 -lsvn_diff-1 -lsvn_subr-1 -lprotobuf -ldl -lapr-1 ../../3rdparty/leveldb-1.4/src/leveldb-1.4/libleveldb.a -lsasl2 -lrt -lhttp_parser -levent -lrt -lhttp_parser -levent -lz -lpthread -Wl,-rpath,/usr/lib/x86_64-linux-gnu/libapr-1.so:/mesos/build/3rdparty/glog-0.3.3/src/glog-0.3.3-lib/lib/lib:/mesos/build/3rdparty/protobuf-2.6.1/src/protobuf-2.6.1-lib/lib/lib:/usr/lib/x86_64-linux-gnu/libsvn_delta-1.so:/usr/lib/x86_64-linux-gnu/libsvn_diff-1.so:/usr/lib/x86_64-linux-gnu/libsvn_subr-1.so:/mesos/build/3rdparty/http_parser-2.6.2/src/http_parser-2.6.2-build:/mesos/build/3rdparty/libevent-2.1.5-beta/src/libevent-2.1.5-beta-lib/lib/lib:/mesos/build/3rdparty/zookeeper-3.4.8/src/zookeeper-3.4.8/src/c 
Linking CXX shared library libload_qos_controller.so
cd /mesos/build/src/slave/qos_controllers && /usr/bin/cmake -E cmake_link_script CMakeFiles/load_qos_controller.dir/link.txt --verbose=1
/usr/bin/g++  -fPIC  -std=c++11 -g   -shared -Wl,-soname,libload_qos_controller.so -o libload_qos_controller.so CMakeFiles/load_qos_controller.dir/load.cpp.o  -L/usr/lib/x86_64-linux-gnu/libapr-1.so  -L/mesos/build/3rdparty/glog-0.3.3/src/glog-0.3.3-lib/lib/lib  -L/mesos/build/3rdparty/protobuf-2.6.1/src/protobuf-2.6.1-lib/lib/lib  -L/usr/lib/x86_64-linux-gnu/libsvn_delta-1.so  -L/usr/lib/x86_64-linux-gnu/libsvn_diff-1.so  -L/usr/lib/x86_64-linux-gnu/libsvn_subr-1.so  -L/mesos/build/3rdparty/http_parser-2.6.2/src/http_parser-2.6.2-build  -L/mesos/build/3rdparty/libevent-2.1.5-beta/src/libevent-2.1.5-beta-lib/lib/lib  -L/mesos/build/3rdparty/zookeeper-3.4.8/src/zookeeper-3.4.8/src/c -lcurl -lglog -lsvn_delta-1 -lsvn_diff-1 -lsvn_subr-1 -lprotobuf -ldl -lapr-1 -lrt -lhttp_parser -levent -lrt -lz -lpthread ../../../3rdparty/zookeeper-3.4.8/src/zookeeper-3.4.8/src/c/lib/libzookeeper_mt.a ../../../3rdparty/libprocess/src/libprocess-0.0.1.a ../../../3rdparty/leveldb-1.4/src/leveldb-1.4/libleveldb.a -lsasl2 -levent ../../libmesos-1.2.0.a ../../libmesos-protobufs.a ../../../3rdparty/zookeeper-3.4.8/src/zookeeper-3.4.8/src/c/lib/libzookeeper_mt.a ../../../3rdparty/libprocess/src/libprocess-0.0.1.a -lcurl -lglog -lsvn_delta-1 -lsvn_diff-1 -lsvn_subr-1 -lprotobuf -ldl -lapr-1 ../../../3rdparty/leveldb-1.4/src/leveldb-1.4/libleveldb.a -lsasl2 -lrt -lhttp_parser -levent -lrt -lhttp_parser -levent -lz -lpthread -Wl,-rpath,/usr/lib/x86_64-linux-gnu/libapr-1.so:/mesos/build/3rdparty/glog-0.3.3/src/glog-0.3.3-lib/lib/lib:/mesos/build/3rdparty/protobuf-2.6.1/src/protobuf-2.6.1-lib/lib/lib:/usr/lib/x86_64-linux-gnu/libsvn_delta-1.so:/usr/lib/x86_64-linux-gnu/libsvn_diff-1.so:/usr/lib/x86_64-linux-gnu/libsvn_subr-1.so:/mesos/build/3rdparty/http_parser-2.6.2/src/http_parser-2.6.2-build:/mesos/build/3rdparty/libevent-2.1.5-beta/src/libevent-2.1.5-beta-lib/lib/lib:/mesos/build/3rdparty/zookeeper-3.4.8/src/zookeeper-3.4.8/src/c 
Linking CXX shared library libfixed_resource_estimator.so
cd /mesos/build/src/slave/resource_estimators && /usr/bin/cmake -E cmake_link_script CMakeFiles/fixed_resource_estimator.dir/link.txt --verbose=1
/usr/bin/g++  -fPIC  -std=c++11 -g   -shared -Wl,-soname,libfixed_resource_estimator.so -o libfixed_resource_estimator.so CMakeFiles/fixed_resource_estimator.dir/fixed.cpp.o  -L/usr/lib/x86_64-linux-gnu/libapr-1.so  -L/mesos/build/3rdparty/glog-0.3.3/src/glog-0.3.3-lib/lib/lib  -L/mesos/build/3rdparty/protobuf-2.6.1/src/protobuf-2.6.1-lib/lib/lib  -L/usr/lib/x86_64-linux-gnu/libsvn_delta-1.so  -L/usr/lib/x86_64-linux-gnu/libsvn_diff-1.so  -L/usr/lib/x86_64-linux-gnu/libsvn_subr-1.so  -L/mesos/build/3rdparty/http_parser-2.6.2/src/http_parser-2.6.2-build  -L/mesos/build/3rdparty/libevent-2.1.5-beta/src/libevent-2.1.5-beta-lib/lib/lib  -L/mesos/build/3rdparty/zookeeper-3.4.8/src/zookeeper-3.4.8/src/c -lcurl -lglog -lsvn_delta-1 -lsvn_diff-1 -lsvn_subr-1 -lprotobuf -ldl -lapr-1 -lrt -lhttp_parser -levent -lrt -lz -lpthread ../../../3rdparty/zookeeper-3.4.8/src/zookeeper-3.4.8/src/c/lib/libzookeeper_mt.a ../../../3rdparty/libprocess/src/libprocess-0.0.1.a ../../../3rdparty/leveldb-1.4/src/leveldb-1.4/libleveldb.a -lsasl2 -levent ../../libmesos-1.2.0.a ../../libmesos-protobufs.a ../../../3rdparty/zookeeper-3.4.8/src/zookeeper-3.4.8/src/c/lib/libzookeeper_mt.a ../../../3rdparty/libprocess/src/libprocess-0.0.1.a -lcurl -lglog -lsvn_delta-1 -lsvn_diff-1 -lsvn_subr-1 -lprotobuf -ldl -lapr-1 ../../../3rdparty/leveldb-1.4/src/leveldb-1.4/libleveldb.a -lsasl2 -lrt -lhttp_parser -levent -lrt -lhttp_parser -levent -lz -lpthread -Wl,-rpath,/usr/lib/x86_64-linux-gnu/libapr-1.so:/mesos/build/3rdparty/glog-0.3.3/src/glog-0.3.3-lib/lib/lib:/mesos/build/3rdparty/protobuf-2.6.1/src/protobuf-2.6.1-lib/lib/lib:/usr/lib/x86_64-linux-gnu/libsvn_delta-1.so:/usr/lib/x86_64-linux-gnu/libsvn_diff-1.so:/usr/lib/x86_64-linux-gnu/libsvn_subr-1.so:/mesos/build/3rdparty/http_parser-2.6.2/src/http_parser-2.6.2-build:/mesos/build/3rdparty/libevent-2.1.5-beta/src/libevent-2.1.5-beta-lib/lib/lib:/mesos/build/3rdparty/zookeeper-3.4.8/src/zookeeper-3.4.8/src/c 
make[2]: Leaving directory `/mesos/build'
/usr/bin/cmake -E cmake_progress_report /mesos/build/CMakeFiles  13
[ 98%] Built target load_qos_controller
make -f src/slave/containerizer/mesos/CMakeFiles/mesos-containerizer.dir/build.make src/slave/containerizer/mesos/CMakeFiles/mesos-containerizer.dir/depend
make[2]: Entering directory `/mesos/build'
cd /mesos/build && /usr/bin/cmake -E cmake_depends "Unix Makefiles" /mesos /mesos/src/slave/containerizer/mesos /mesos/build /mesos/build/src/slave/containerizer/mesos /mesos/build/src/slave/containerizer/mesos/CMakeFiles/mesos-containerizer.dir/DependInfo.cmake --color=
Scanning dependencies of target mesos-containerizer
make[2]: Leaving directory `/mesos/build'
make -f src/slave/containerizer/mesos/CMakeFiles/mesos-containerizer.dir/build.make src/slave/containerizer/mesos/CMakeFiles/mesos-containerizer.dir/build
make[2]: Entering directory `/mesos/build'
/usr/bin/cmake -E cmake_progress_report /mesos/build/CMakeFiles 
[ 98%] Building CXX object src/slave/containerizer/mesos/CMakeFiles/mesos-containerizer.dir/main.cpp.o
cd /mesos/build/src/slave/containerizer/mesos && /usr/bin/g++   -DBUILD_DATE="\"2016-3-3 10:20\"" -DBUILD_FLAGS=\"\" -DBUILD_JAVA_JVM_LIBRARY=\"\" -DBUILD_TIME=\"1111100\" -DBUILD_USER=\"frank\" -DHAS_AUTHENTICATION=1 -DLIBDIR=\"/usr/local/libmesos\" -DPICOJSON_USE_INT64 -DPKGDATADIR=\"/usr/local/share/mesos\" -DPKGLIBEXECDIR=\"/usr/local/libexec/mesos\" -DUSE_STATIC_LIB -DVERSION=\"1.2.0\" -D__STDC_FORMAT_MACROS -std=c++11 -g -I/mesos/include -I/mesos/build/include -I/mesos/build/include/mesos -I/mesos/build/src -I/mesos/src -I/mesos/3rdparty/stout/include -I/usr/include/apr-1.0 -I/mesos/build/3rdparty/boost-1.53.0/src/boost-1.53.0 -I/mesos/build/3rdparty/elfio-3.2/src/elfio-3.2 -I/mesos/build/3rdparty/glog-0.3.3/src/glog-0.3.3-lib/lib/include -I/mesos/build/3rdparty/nvml-352.79/src/nvml-352.79 -I/mesos/build/3rdparty/picojson-1.3.0/src/picojson-1.3.0 -I/mesos/build/3rdparty/protobuf-2.6.1/src/protobuf-2.6.1-lib/lib/include -I/usr/include/subversion-1 -I/mesos/src/src -I/mesos/3rdparty/libprocess/include -I/mesos/build/3rdparty/http_parser-2.6.2/src/http_parser-2.6.2 -I/mesos/build/3rdparty/libevent-2.1.5-beta/src/libevent-2.1.5-beta-lib/lib/include -I/mesos/build/3rdparty/zookeeper-3.4.8/src/zookeeper-3.4.8/src/c/include -I/mesos/build/3rdparty/zookeeper-3.4.8/src/zookeeper-3.4.8/src/c/generated -I/mesos/build/3rdparty/leveldb-1.4/src/leveldb-1.4/include -I/mesos/src/slave/containerizer/mesos/src    -o CMakeFiles/mesos-containerizer.dir/main.cpp.o -c /mesos/src/slave/containerizer/mesos/main.cpp
make[2]: Leaving directory `/mesos/build'
/usr/bin/cmake -E cmake_progress_report /mesos/build/CMakeFiles 
[ 98%] Built target fixed_resource_estimator
make -f src/usage/CMakeFiles/mesos-usage.dir/build.make src/usage/CMakeFiles/mesos-usage.dir/depend
make[2]: Entering directory `/mesos/build'
cd /mesos/build && /usr/bin/cmake -E cmake_depends "Unix Makefiles" /mesos /mesos/src/usage /mesos/build /mesos/build/src/usage /mesos/build/src/usage/CMakeFiles/mesos-usage.dir/DependInfo.cmake --color=
Scanning dependencies of target mesos-usage
make[2]: Leaving directory `/mesos/build'
make -f src/usage/CMakeFiles/mesos-usage.dir/build.make src/usage/CMakeFiles/mesos-usage.dir/build
make[2]: Entering directory `/mesos/build'
/usr/bin/cmake -E cmake_progress_report /mesos/build/CMakeFiles 
[ 98%] Building CXX object src/usage/CMakeFiles/mesos-usage.dir/main.cpp.o
cd /mesos/build/src/usage && /usr/bin/g++   -DBUILD_DATE="\"2016-3-3 10:20\"" -DBUILD_FLAGS=\"\" -DBUILD_JAVA_JVM_LIBRARY=\"\" -DBUILD_TIME=\"1111100\" -DBUILD_USER=\"frank\" -DHAS_AUTHENTICATION=1 -DLIBDIR=\"/usr/local/libmesos\" -DPICOJSON_USE_INT64 -DPKGDATADIR=\"/usr/local/share/mesos\" -DPKGLIBEXECDIR=\"/usr/local/libexec/mesos\" -DUSE_STATIC_LIB -DVERSION=\"1.2.0\" -D__STDC_FORMAT_MACROS -std=c++11 -g -I/mesos/include -I/mesos/build/include -I/mesos/build/include/mesos -I/mesos/build/src -I/mesos/src -I/mesos/3rdparty/stout/include -I/usr/include/apr-1.0 -I/mesos/build/3rdparty/boost-1.53.0/src/boost-1.53.0 -I/mesos/build/3rdparty/elfio-3.2/src/elfio-3.2 -I/mesos/build/3rdparty/glog-0.3.3/src/glog-0.3.3-lib/lib/include -I/mesos/build/3rdparty/nvml-352.79/src/nvml-352.79 -I/mesos/build/3rdparty/picojson-1.3.0/src/picojson-1.3.0 -I/mesos/build/3rdparty/protobuf-2.6.1/src/protobuf-2.6.1-lib/lib/include -I/usr/include/subversion-1 -I/mesos/src/src -I/mesos/3rdparty/libprocess/include -I/mesos/build/3rdparty/http_parser-2.6.2/src/http_parser-2.6.2 -I/mesos/build/3rdparty/libevent-2.1.5-beta/src/libevent-2.1.5-beta-lib/lib/include -I/mesos/build/3rdparty/zookeeper-3.4.8/src/zookeeper-3.4.8/src/c/include -I/mesos/build/3rdparty/zookeeper-3.4.8/src/zookeeper-3.4.8/src/c/generated -I/mesos/build/3rdparty/leveldb-1.4/src/leveldb-1.4/include -I/mesos/src/usage/src    -o CMakeFiles/mesos-usage.dir/main.cpp.o -c /mesos/src/usage/main.cpp
Linking CXX executable ../mesos-usage
cd /mesos/build/src/usage && /usr/bin/cmake -E cmake_link_script CMakeFiles/mesos-usage.dir/link.txt --verbose=1
/usr/bin/g++    -std=c++11 -g    CMakeFiles/mesos-usage.dir/main.cpp.o  -o ../mesos-usage  -L/usr/lib/x86_64-linux-gnu/libapr-1.so  -L/mesos/build/3rdparty/glog-0.3.3/src/glog-0.3.3-lib/lib/lib  -L/mesos/build/3rdparty/protobuf-2.6.1/src/protobuf-2.6.1-lib/lib/lib  -L/usr/lib/x86_64-linux-gnu/libsvn_delta-1.so  -L/usr/lib/x86_64-linux-gnu/libsvn_diff-1.so  -L/usr/lib/x86_64-linux-gnu/libsvn_subr-1.so  -L/mesos/build/3rdparty/http_parser-2.6.2/src/http_parser-2.6.2-build  -L/mesos/build/3rdparty/libevent-2.1.5-beta/src/libevent-2.1.5-beta-lib/lib/lib  -L/mesos/build/3rdparty/zookeeper-3.4.8/src/zookeeper-3.4.8/src/c -rdynamic -lcurl -lglog -lsvn_delta-1 -lsvn_diff-1 -lsvn_subr-1 -lprotobuf -ldl -lapr-1 -lrt -lhttp_parser -levent -lrt -lz -lpthread ../../3rdparty/zookeeper-3.4.8/src/zookeeper-3.4.8/src/c/lib/libzookeeper_mt.a ../../3rdparty/libprocess/src/libprocess-0.0.1.a ../../3rdparty/leveldb-1.4/src/leveldb-1.4/libleveldb.a -lsasl2 -levent ../libmesos-1.2.0.a ../libmesos-protobufs.a ../../3rdparty/zookeeper-3.4.8/src/zookeeper-3.4.8/src/c/lib/libzookeeper_mt.a ../../3rdparty/libprocess/src/libprocess-0.0.1.a -lcurl -lglog -lsvn_delta-1 -lsvn_diff-1 -lsvn_subr-1 -lprotobuf -ldl -lapr-1 ../../3rdparty/leveldb-1.4/src/leveldb-1.4/libleveldb.a -lsasl2 -lrt -lhttp_parser -levent -lrt -lhttp_parser -levent -lz -lpthread -Wl,-rpath,/usr/lib/x86_64-linux-gnu/libapr-1.so:/mesos/build/3rdparty/glog-0.3.3/src/glog-0.3.3-lib/lib/lib:/mesos/build/3rdparty/protobuf-2.6.1/src/protobuf-2.6.1-lib/lib/lib:/usr/lib/x86_64-linux-gnu/libsvn_delta-1.so:/usr/lib/x86_64-linux-gnu/libsvn_diff-1.so:/usr/lib/x86_64-linux-gnu/libsvn_subr-1.so:/mesos/build/3rdparty/http_parser-2.6.2/src/http_parser-2.6.2-build:/mesos/build/3rdparty/libevent-2.1.5-beta/src/libevent-2.1.5-beta-lib/lib/lib:/mesos/build/3rdparty/zookeeper-3.4.8/src/zookeeper-3.4.8/src/c 
make[2]: Leaving directory `/mesos/build'
/usr/bin/cmake -E cmake_progress_report /mesos/build/CMakeFiles 
[ 98%] Built target mesos-master
make -f src/tests/CMakeFiles/test-helper.dir/build.make src/tests/CMakeFiles/test-helper.dir/depend
make[2]: Entering directory `/mesos/build'
cd /mesos/build && /usr/bin/cmake -E cmake_depends "Unix Makefiles" /mesos /mesos/src/tests /mesos/build /mesos/build/src/tests /mesos/build/src/tests/CMakeFiles/test-helper.dir/DependInfo.cmake --color=
Scanning dependencies of target test-helper
make[2]: Leaving directory `/mesos/build'
make -f src/tests/CMakeFiles/test-helper.dir/build.make src/tests/CMakeFiles/test-helper.dir/build
make[2]: Entering directory `/mesos/build'
/usr/bin/cmake -E cmake_progress_report /mesos/build/CMakeFiles 96
[ 99%] Building CXX object src/tests/CMakeFiles/test-helper.dir/active_user_test_helper.cpp.o
cd /mesos/build/src/tests && /usr/bin/g++   -DBUILD_DATE="\"2016-3-3 10:20\"" -DBUILD_DIR=\"/mesos/build\" -DBUILD_FLAGS=\"\" -DBUILD_JAVA_JVM_LIBRARY=\"\" -DBUILD_TIME=\"1111100\" -DBUILD_USER=\"frank\" -DHAS_AUTHENTICATION=1 -DLIBDIR=\"/usr/local/libmesos\" -DPICOJSON_USE_INT64 -DPKGDATADIR=\"/usr/local/share/mesos\" -DPKGLIBEXECDIR=\"/usr/local/libexec/mesos\" -DPKGMODULEDIR=\"\" -DSBINDIR=\"\" -DSOURCE_DIR=\"/mesos\" -DTESTLIBEXECDIR=\"\" -DUSE_STATIC_LIB -DVERSION=\"1.2.0\" -D__STDC_FORMAT_MACROS -std=c++11 -g -I/mesos/include -I/mesos/build/include -I/mesos/build/include/mesos -I/mesos/build/src -I/mesos/src -I/mesos/3rdparty/stout/include -I/usr/include/apr-1.0 -I/mesos/build/3rdparty/boost-1.53.0/src/boost-1.53.0 -I/mesos/build/3rdparty/elfio-3.2/src/elfio-3.2 -I/mesos/build/3rdparty/glog-0.3.3/src/glog-0.3.3-lib/lib/include -I/mesos/build/3rdparty/nvml-352.79/src/nvml-352.79 -I/mesos/build/3rdparty/picojson-1.3.0/src/picojson-1.3.0 -I/mesos/build/3rdparty/protobuf-2.6.1/src/protobuf-2.6.1-lib/lib/include -I/usr/include/subversion-1 -I/mesos/src/src -I/mesos/3rdparty/libprocess/include -I/mesos/build/3rdparty/http_parser-2.6.2/src/http_parser-2.6.2 -I/mesos/build/3rdparty/libevent-2.1.5-beta/src/libevent-2.1.5-beta-lib/lib/include -I/mesos/build/3rdparty/zookeeper-3.4.8/src/zookeeper-3.4.8/src/c/include -I/mesos/build/3rdparty/zookeeper-3.4.8/src/zookeeper-3.4.8/src/c/generated -I/mesos/build/3rdparty/leveldb-1.4/src/leveldb-1.4/include -I/mesos/build/3rdparty/gmock-1.7.0/src/gmock-1.7.0/include -I/mesos/build/3rdparty/gmock-1.7.0/src/gmock-1.7.0/gtest/include    -o CMakeFiles/test-helper.dir/active_user_test_helper.cpp.o -c /mesos/src/tests/active_user_test_helper.cpp
Linking CXX executable ../../../mesos-containerizer
cd /mesos/build/src/slave/containerizer/mesos && /usr/bin/cmake -E cmake_link_script CMakeFiles/mesos-containerizer.dir/link.txt --verbose=1
/usr/bin/g++    -std=c++11 -g    CMakeFiles/mesos-containerizer.dir/main.cpp.o  -o ../../../mesos-containerizer  -L/usr/lib/x86_64-linux-gnu/libapr-1.so  -L/mesos/build/3rdparty/glog-0.3.3/src/glog-0.3.3-lib/lib/lib  -L/mesos/build/3rdparty/protobuf-2.6.1/src/protobuf-2.6.1-lib/lib/lib  -L/usr/lib/x86_64-linux-gnu/libsvn_delta-1.so  -L/usr/lib/x86_64-linux-gnu/libsvn_diff-1.so  -L/usr/lib/x86_64-linux-gnu/libsvn_subr-1.so  -L/mesos/build/3rdparty/http_parser-2.6.2/src/http_parser-2.6.2-build  -L/mesos/build/3rdparty/libevent-2.1.5-beta/src/libevent-2.1.5-beta-lib/lib/lib  -L/mesos/build/3rdparty/zookeeper-3.4.8/src/zookeeper-3.4.8/src/c -rdynamic -lcurl -lglog -lsvn_delta-1 -lsvn_diff-1 -lsvn_subr-1 -lprotobuf -ldl -lapr-1 -lrt -lhttp_parser -levent -lrt -lz -lpthread ../../../../3rdparty/zookeeper-3.4.8/src/zookeeper-3.4.8/src/c/lib/libzookeeper_mt.a ../../../../3rdparty/libprocess/src/libprocess-0.0.1.a ../../../../3rdparty/leveldb-1.4/src/leveldb-1.4/libleveldb.a -lsasl2 -levent ../../../libmesos-1.2.0.a ../../../libmesos-protobufs.a ../../../../3rdparty/zookeeper-3.4.8/src/zookeeper-3.4.8/src/c/lib/libzookeeper_mt.a ../../../../3rdparty/libprocess/src/libprocess-0.0.1.a -lcurl -lglog -lsvn_delta-1 -lsvn_diff-1 -lsvn_subr-1 -lprotobuf -ldl -lapr-1 ../../../../3rdparty/leveldb-1.4/src/leveldb-1.4/libleveldb.a -lsasl2 -lrt -lhttp_parser -levent -lrt -lhttp_parser -levent -lz -lpthread -Wl,-rpath,/usr/lib/x86_64-linux-gnu/libapr-1.so:/mesos/build/3rdparty/glog-0.3.3/src/glog-0.3.3-lib/lib/lib:/mesos/build/3rdparty/protobuf-2.6.1/src/protobuf-2.6.1-lib/lib/lib:/usr/lib/x86_64-linux-gnu/libsvn_delta-1.so:/usr/lib/x86_64-linux-gnu/libsvn_diff-1.so:/usr/lib/x86_64-linux-gnu/libsvn_subr-1.so:/mesos/build/3rdparty/http_parser-2.6.2/src/http_parser-2.6.2-build:/mesos/build/3rdparty/libevent-2.1.5-beta/src/libevent-2.1.5-beta-lib/lib/lib:/mesos/build/3rdparty/zookeeper-3.4.8/src/zookeeper-3.4.8/src/c 
make[2]: Leaving directory `/mesos/build'
/usr/bin/cmake -E cmake_progress_report /mesos/build/CMakeFiles 
[ 99%] Built target mesos-usage
/usr/bin/cmake -E cmake_progress_report /mesos/build/CMakeFiles 
[ 99%] Building CXX object src/tests/CMakeFiles/test-helper.dir/flags.cpp.o
cd /mesos/build/src/tests && /usr/bin/g++   -DBUILD_DATE="\"2016-3-3 10:20\"" -DBUILD_DIR=\"/mesos/build\" -DBUILD_FLAGS=\"\" -DBUILD_JAVA_JVM_LIBRARY=\"\" -DBUILD_TIME=\"1111100\" -DBUILD_USER=\"frank\" -DHAS_AUTHENTICATION=1 -DLIBDIR=\"/usr/local/libmesos\" -DPICOJSON_USE_INT64 -DPKGDATADIR=\"/usr/local/share/mesos\" -DPKGLIBEXECDIR=\"/usr/local/libexec/mesos\" -DPKGMODULEDIR=\"\" -DSBINDIR=\"\" -DSOURCE_DIR=\"/mesos\" -DTESTLIBEXECDIR=\"\" -DUSE_STATIC_LIB -DVERSION=\"1.2.0\" -D__STDC_FORMAT_MACROS -std=c++11 -g -I/mesos/include -I/mesos/build/include -I/mesos/build/include/mesos -I/mesos/build/src -I/mesos/src -I/mesos/3rdparty/stout/include -I/usr/include/apr-1.0 -I/mesos/build/3rdparty/boost-1.53.0/src/boost-1.53.0 -I/mesos/build/3rdparty/elfio-3.2/src/elfio-3.2 -I/mesos/build/3rdparty/glog-0.3.3/src/glog-0.3.3-lib/lib/include -I/mesos/build/3rdparty/nvml-352.79/src/nvml-352.79 -I/mesos/build/3rdparty/picojson-1.3.0/src/picojson-1.3.0 -I/mesos/build/3rdparty/protobuf-2.6.1/src/protobuf-2.6.1-lib/lib/include -I/usr/include/subversion-1 -I/mesos/src/src -I/mesos/3rdparty/libprocess/include -I/mesos/build/3rdparty/http_parser-2.6.2/src/http_parser-2.6.2 -I/mesos/build/3rdparty/libevent-2.1.5-beta/src/libevent-2.1.5-beta-lib/lib/include -I/mesos/build/3rdparty/zookeeper-3.4.8/src/zookeeper-3.4.8/src/c/include -I/mesos/build/3rdparty/zookeeper-3.4.8/src/zookeeper-3.4.8/src/c/generated -I/mesos/build/3rdparty/leveldb-1.4/src/leveldb-1.4/include -I/mesos/build/3rdparty/gmock-1.7.0/src/gmock-1.7.0/include -I/mesos/build/3rdparty/gmock-1.7.0/src/gmock-1.7.0/gtest/include    -o CMakeFiles/test-helper.dir/flags.cpp.o -c /mesos/src/tests/flags.cpp
../libmesos-1.2.0.a(composing.cpp.o): In function `mesos::internal::slave::ComposingContainerizerProcess::launch(mesos::ContainerID const&, mesos::CommandInfo const&, Option<mesos::ContainerInfo> const&, Option<std::string> const&, mesos::SlaveID const&)':
/mesos/src/slave/containerizer/composing.cpp:479: undefined reference to `mesos::internal::slave::getRootContainerId(mesos::ContainerID const&)'
../libmesos-1.2.0.a(containerizer.cpp.o): In function `mesos::internal::slave::MesosContainerizerProcess::recover(Option<mesos::internal::slave::state::SlaveState> const&)':
/mesos/src/slave/containerizer/mesos/containerizer.cpp:707: undefined reference to `mesos::internal::slave::getRootContainerId(mesos::ContainerID const&)'
/mesos/src/slave/containerizer/mesos/containerizer.cpp:737: undefined reference to `mesos::internal::slave::getRootContainerId(mesos::ContainerID const&)'
../libmesos-1.2.0.a(containerizer.cpp.o): In function `mesos::internal::slave::MesosContainerizerProcess::_launch(mesos::ContainerID const&, std::map<std::string, std::string, std::less<std::string>, std::allocator<std::pair<std::string const, std::string> > > const&, mesos::SlaveID const&, bool)':
/mesos/src/slave/containerizer/mesos/containerizer.cpp:1359: undefined reference to `mesos::internal::slave::getRootContainerId(mesos::ContainerID const&)'
../libmesos-1.2.0.a(containerizer.cpp.o): In function `mesos::internal::slave::MesosContainerizerProcess::launch(mesos::ContainerID const&, mesos::CommandInfo const&, Option<mesos::ContainerInfo> const&, Option<std::string> const&, mesos::SlaveID const&)':
/mesos/src/slave/containerizer/mesos/containerizer.cpp:1676: undefined reference to `mesos::internal::slave::getRootContainerId(mesos::ContainerID const&)'
../libmesos-1.2.0.a(store.cpp.o): In function `mesos::internal::slave::docker::StoreProcess::moveLayer(std::string const&, std::string const&)':
/mesos/src/slave/containerizer/mesos/provisioner/docker/store.cpp:345: undefined reference to `mesos::internal::slave::convertWhiteouts(std::string const&)'
../libmesos-1.2.0.a(cgroups.cpp.o): In function `mesos::internal::slave::CgroupsIsolatorProcess::isolate(mesos::ContainerID const&, int)':
/mesos/src/slave/containerizer/mesos/isolators/cgroups/cgroups.cpp:529: undefined reference to `mesos::internal::slave::getRootContainerId(mesos::ContainerID const&)'
../libmesos-1.2.0.a(cni.cpp.o): In function `mesos::internal::slave::NetworkCniIsolatorProcess::prepare(mesos::ContainerID const&, mesos::slave::ContainerConfig const&)':
/mesos/src/slave/containerizer/mesos/isolators/network/cni/cni.cpp:569: undefined reference to `mesos::internal::slave::getRootContainerId(mesos::ContainerID const&)'
../libmesos-1.2.0.a(cni.cpp.o): In function `mesos::internal::slave::NetworkCniIsolatorProcess::isolate(mesos::ContainerID const&, int)':
/mesos/src/slave/containerizer/mesos/isolators/network/cni/cni.cpp:730: undefined reference to `mesos::internal::slave::getRootContainerId(mesos::ContainerID const&)'
collect2: error: ld returned 1 exit status
make[2]: *** [src/mesos-execute] Error 1
make[2]: Leaving directory `/mesos/build'
make[1]: *** [src/cli/CMakeFiles/mesos-execute.dir/all] Error 2
make[1]: /usr/bin/cmake -E cmake_progress_report /mesos/build/CMakeFiles 
*** Waiting for unfinished jobs....
[ 99%] Building CXX object src/tests/CMakeFiles/test-helper.dir/health_check_test_helper.cpp.o
cd /mesos/build/src/tests && /usr/bin/g++   -DBUILD_DATE="\"2016-3-3 10:20\"" -DBUILD_DIR=\"/mesos/build\" -DBUILD_FLAGS=\"\" -DBUILD_JAVA_JVM_LIBRARY=\"\" -DBUILD_TIME=\"1111100\" -DBUILD_USER=\"frank\" -DHAS_AUTHENTICATION=1 -DLIBDIR=\"/usr/local/libmesos\" -DPICOJSON_USE_INT64 -DPKGDATADIR=\"/usr/local/share/mesos\" -DPKGLIBEXECDIR=\"/usr/local/libexec/mesos\" -DPKGMODULEDIR=\"\" -DSBINDIR=\"\" -DSOURCE_DIR=\"/mesos\" -DTESTLIBEXECDIR=\"\" -DUSE_STATIC_LIB -DVERSION=\"1.2.0\" -D__STDC_FORMAT_MACROS -std=c++11 -g -I/mesos/include -I/mesos/build/include -I/mesos/build/include/mesos -I/mesos/build/src -I/mesos/src -I/mesos/3rdparty/stout/include -I/usr/include/apr-1.0 -I/mesos/build/3rdparty/boost-1.53.0/src/boost-1.53.0 -I/mesos/build/3rdparty/elfio-3.2/src/elfio-3.2 -I/mesos/build/3rdparty/glog-0.3.3/src/glog-0.3.3-lib/lib/include -I/mesos/build/3rdparty/nvml-352.79/src/nvml-352.79 -I/mesos/build/3rdparty/picojson-1.3.0/src/picojson-1.3.0 -I/mesos/build/3rdparty/protobuf-2.6.1/src/protobuf-2.6.1-lib/lib/include -I/usr/include/subversion-1 -I/mesos/src/src -I/mesos/3rdparty/libprocess/include -I/mesos/build/3rdparty/http_parser-2.6.2/src/http_parser-2.6.2 -I/mesos/build/3rdparty/libevent-2.1.5-beta/src/libevent-2.1.5-beta-lib/lib/include -I/mesos/build/3rdparty/zookeeper-3.4.8/src/zookeeper-3.4.8/src/c/include -I/mesos/build/3rdparty/zookeeper-3.4.8/src/zookeeper-3.4.8/src/c/generated -I/mesos/build/3rdparty/leveldb-1.4/src/leveldb-1.4/include -I/mesos/build/3rdparty/gmock-1.7.0/src/gmock-1.7.0/include -I/mesos/build/3rdparty/gmock-1.7.0/src/gmock-1.7.0/gtest/include    -o CMakeFiles/test-helper.dir/health_check_test_helper.cpp.o -c /mesos/src/tests/health_check_test_helper.cpp
../libmesos-1.2.0.a(composing.cpp.o): In function `mesos::internal::slave::ComposingContainerizerProcess::launch(mesos::ContainerID const&, mesos::CommandInfo const&, Option<mesos::ContainerInfo> const&, Option<std::string> const&, mesos::SlaveID const&)':
/mesos/src/slave/containerizer/composing.cpp:479: undefined reference to `mesos::internal::slave::getRootContainerId(mesos::ContainerID const&)'
../libmesos-1.2.0.a(containerizer.cpp.o): In function `mesos::internal::slave::MesosContainerizerProcess::recover(Option<mesos::internal::slave::state::SlaveState> const&)':
/mesos/src/slave/containerizer/mesos/containerizer.cpp:707: undefined reference to `mesos::internal::slave::getRootContainerId(mesos::ContainerID const&)'
/mesos/src/slave/containerizer/mesos/containerizer.cpp:737: undefined reference to `mesos::internal::slave::getRootContainerId(mesos::ContainerID const&)'
../libmesos-1.2.0.a(containerizer.cpp.o): In function `mesos::internal::slave::MesosContainerizerProcess::_launch(mesos::ContainerID const&, std::map<std::string, std::string, std::less<std::string>, std::allocator<std::pair<std::string const, std::string> > > const&, mesos::SlaveID const&, bool)':
/mesos/src/slave/containerizer/mesos/containerizer.cpp:1359: undefined reference to `mesos::internal::slave::getRootContainerId(mesos::ContainerID const&)'
../libmesos-1.2.0.a(containerizer.cpp.o): In function `mesos::internal::slave::MesosContainerizerProcess::launch(mesos::ContainerID const&, mesos::CommandInfo const&, Option<mesos::ContainerInfo> const&, Option<std::string> const&, mesos::SlaveID const&)':
/mesos/src/slave/containerizer/mesos/containerizer.cpp:1676: undefined reference to `mesos::internal::slave::getRootContainerId(mesos::ContainerID const&)'
../libmesos-1.2.0.a(store.cpp.o): In function `mesos::internal::slave::docker::StoreProcess::moveLayer(std::string const&, std::string const&)':
/mesos/src/slave/containerizer/mesos/provisioner/docker/store.cpp:345: undefined reference to `mesos::internal::slave::convertWhiteouts(std::string const&)'
../libmesos-1.2.0.a(cgroups.cpp.o): In function `mesos::internal::slave::CgroupsIsolatorProcess::isolate(mesos::ContainerID const&, int)':
/mesos/src/slave/containerizer/mesos/isolators/cgroups/cgroups.cpp:529: undefined reference to `mesos::internal::slave::getRootContainerId(mesos::ContainerID const&)'
../libmesos-1.2.0.a(cni.cpp.o): In function `mesos::internal::slave::NetworkCniIsolatorProcess::prepare(mesos::ContainerID const&, mesos::slave::ContainerConfig const&)':
/mesos/src/slave/containerizer/mesos/isolators/network/cni/cni.cpp:569: undefined reference to `mesos::internal::slave::getRootContainerId(mesos::ContainerID const&)'
../libmesos-1.2.0.a(cni.cpp.o): In function `mesos::internal::slave::NetworkCniIsolatorProcess::isolate(mesos::ContainerID const&, int)':
/mesos/src/slave/containerizer/mesos/isolators/network/cni/cni.cpp:730: undefined reference to `mesos::internal::slave::getRootContainerId(mesos::ContainerID const&)'
collect2: error: ld returned 1 exit status
make[2]: *** [src/mesos-local] Error 1
make[2]: Leaving directory `/mesos/build'
make[1]: *** [src/local/CMakeFiles/mesos-local.dir/all] Error 2
/usr/bin/cmake -E cmake_progress_report /mesos/build/CMakeFiles 
[ 99%] Building CXX object src/tests/CMakeFiles/test-helper.dir/resources_utils.cpp.o
cd /mesos/build/src/tests && /usr/bin/g++   -DBUILD_DATE="\"2016-3-3 10:20\"" -DBUILD_DIR=\"/mesos/build\" -DBUILD_FLAGS=\"\" -DBUILD_JAVA_JVM_LIBRARY=\"\" -DBUILD_TIME=\"1111100\" -DBUILD_USER=\"frank\" -DHAS_AUTHENTICATION=1 -DLIBDIR=\"/usr/local/libmesos\" -DPICOJSON_USE_INT64 -DPKGDATADIR=\"/usr/local/share/mesos\" -DPKGLIBEXECDIR=\"/usr/local/libexec/mesos\" -DPKGMODULEDIR=\"\" -DSBINDIR=\"\" -DSOURCE_DIR=\"/mesos\" -DTESTLIBEXECDIR=\"\" -DUSE_STATIC_LIB -DVERSION=\"1.2.0\" -D__STDC_FORMAT_MACROS -std=c++11 -g -I/mesos/include -I/mesos/build/include -I/mesos/build/include/mesos -I/mesos/build/src -I/mesos/src -I/mesos/3rdparty/stout/include -I/usr/include/apr-1.0 -I/mesos/build/3rdparty/boost-1.53.0/src/boost-1.53.0 -I/mesos/build/3rdparty/elfio-3.2/src/elfio-3.2 -I/mesos/build/3rdparty/glog-0.3.3/src/glog-0.3.3-lib/lib/include -I/mesos/build/3rdparty/nvml-352.79/src/nvml-352.79 -I/mesos/build/3rdparty/picojson-1.3.0/src/picojson-1.3.0 -I/mesos/build/3rdparty/protobuf-2.6.1/src/protobuf-2.6.1-lib/lib/include -I/usr/include/subversion-1 -I/mesos/src/src -I/mesos/3rdparty/libprocess/include -I/mesos/build/3rdparty/http_parser-2.6.2/src/http_parser-2.6.2 -I/mesos/build/3rdparty/libevent-2.1.5-beta/src/libevent-2.1.5-beta-lib/lib/include -I/mesos/build/3rdparty/zookeeper-3.4.8/src/zookeeper-3.4.8/src/c/include -I/mesos/build/3rdparty/zookeeper-3.4.8/src/zookeeper-3.4.8/src/c/generated -I/mesos/build/3rdparty/leveldb-1.4/src/leveldb-1.4/include -I/mesos/build/3rdparty/gmock-1.7.0/src/gmock-1.7.0/include -I/mesos/build/3rdparty/gmock-1.7.0/src/gmock-1.7.0/gtest/include    -o CMakeFiles/test-helper.dir/resources_utils.cpp.o -c /mesos/src/tests/resources_utils.cpp
/usr/bin/cmake -E cmake_progress_report /mesos/build/CMakeFiles 97
[100%] Building CXX object src/tests/CMakeFiles/test-helper.dir/test_helper_main.cpp.o
cd /mesos/build/src/tests && /usr/bin/g++   -DBUILD_DATE="\"2016-3-3 10:20\"" -DBUILD_DIR=\"/mesos/build\" -DBUILD_FLAGS=\"\" -DBUILD_JAVA_JVM_LIBRARY=\"\" -DBUILD_TIME=\"1111100\" -DBUILD_USER=\"frank\" -DHAS_AUTHENTICATION=1 -DLIBDIR=\"/usr/local/libmesos\" -DPICOJSON_USE_INT64 -DPKGDATADIR=\"/usr/local/share/mesos\" -DPKGLIBEXECDIR=\"/usr/local/libexec/mesos\" -DPKGMODULEDIR=\"\" -DSBINDIR=\"\" -DSOURCE_DIR=\"/mesos\" -DTESTLIBEXECDIR=\"\" -DUSE_STATIC_LIB -DVERSION=\"1.2.0\" -D__STDC_FORMAT_MACROS -std=c++11 -g -I/mesos/include -I/mesos/build/include -I/mesos/build/include/mesos -I/mesos/build/src -I/mesos/src -I/mesos/3rdparty/stout/include -I/usr/include/apr-1.0 -I/mesos/build/3rdparty/boost-1.53.0/src/boost-1.53.0 -I/mesos/build/3rdparty/elfio-3.2/src/elfio-3.2 -I/mesos/build/3rdparty/glog-0.3.3/src/glog-0.3.3-lib/lib/include -I/mesos/build/3rdparty/nvml-352.79/src/nvml-352.79 -I/mesos/build/3rdparty/picojson-1.3.0/src/picojson-1.3.0 -I/mesos/build/3rdparty/protobuf-2.6.1/src/protobuf-2.6.1-lib/lib/include -I/usr/include/subversion-1 -I/mesos/src/src -I/mesos/3rdparty/libprocess/include -I/mesos/build/3rdparty/http_parser-2.6.2/src/http_parser-2.6.2 -I/mesos/build/3rdparty/libevent-2.1.5-beta/src/libevent-2.1.5-beta-lib/lib/include -I/mesos/build/3rdparty/zookeeper-3.4.8/src/zookeeper-3.4.8/src/c/include -I/mesos/build/3rdparty/zookeeper-3.4.8/src/zookeeper-3.4.8/src/c/generated -I/mesos/build/3rdparty/leveldb-1.4/src/leveldb-1.4/include -I/mesos/build/3rdparty/gmock-1.7.0/src/gmock-1.7.0/include -I/mesos/build/3rdparty/gmock-1.7.0/src/gmock-1.7.0/gtest/include    -o CMakeFiles/test-helper.dir/test_helper_main.cpp.o -c /mesos/src/tests/test_helper_main.cpp
../../../libmesos-1.2.0.a(cni.cpp.o): In function `mesos::internal::slave::NetworkCniIsolatorProcess::prepare(mesos::ContainerID const&, mesos::slave::ContainerConfig const&)':
/mesos/src/slave/containerizer/mesos/isolators/network/cni/cni.cpp:569: undefined reference to `mesos::internal::slave::getRootContainerId(mesos::ContainerID const&)'
../../../libmesos-1.2.0.a(cni.cpp.o): In function `mesos::internal::slave::NetworkCniIsolatorProcess::isolate(mesos::ContainerID const&, int)':
/mesos/src/slave/containerizer/mesos/isolators/network/cni/cni.cpp:730: undefined reference to `mesos::internal::slave::getRootContainerId(mesos::ContainerID const&)'
collect2: error: ld returned 1 exit status
make[2]: *** [src/mesos-containerizer] Error 1
make[2]: Leaving directory `/mesos/build'
make[1]: *** [src/slave/containerizer/mesos/CMakeFiles/mesos-containerizer.dir/all] Error 2
/usr/bin/cmake -E cmake_progress_report /mesos/build/CMakeFiles 
[100%] Building CXX object src/tests/CMakeFiles/test-helper.dir/utils.cpp.o
cd /mesos/build/src/tests && /usr/bin/g++   -DBUILD_DATE="\"2016-3-3 10:20\"" -DBUILD_DIR=\"/mesos/build\" -DBUILD_FLAGS=\"\" -DBUILD_JAVA_JVM_LIBRARY=\"\" -DBUILD_TIME=\"1111100\" -DBUILD_USER=\"frank\" -DHAS_AUTHENTICATION=1 -DLIBDIR=\"/usr/local/libmesos\" -DPICOJSON_USE_INT64 -DPKGDATADIR=\"/usr/local/share/mesos\" -DPKGLIBEXECDIR=\"/usr/local/libexec/mesos\" -DPKGMODULEDIR=\"\" -DSBINDIR=\"\" -DSOURCE_DIR=\"/mesos\" -DTESTLIBEXECDIR=\"\" -DUSE_STATIC_LIB -DVERSION=\"1.2.0\" -D__STDC_FORMAT_MACROS -std=c++11 -g -I/mesos/include -I/mesos/build/include -I/mesos/build/include/mesos -I/mesos/build/src -I/mesos/src -I/mesos/3rdparty/stout/include -I/usr/include/apr-1.0 -I/mesos/build/3rdparty/boost-1.53.0/src/boost-1.53.0 -I/mesos/build/3rdparty/elfio-3.2/src/elfio-3.2 -I/mesos/build/3rdparty/glog-0.3.3/src/glog-0.3.3-lib/lib/include -I/mesos/build/3rdparty/nvml-352.79/src/nvml-352.79 -I/mesos/build/3rdparty/picojson-1.3.0/src/picojson-1.3.0 -I/mesos/build/3rdparty/protobuf-2.6.1/src/protobuf-2.6.1-lib/lib/include -I/usr/include/subversion-1 -I/mesos/src/src -I/mesos/3rdparty/libprocess/include -I/mesos/build/3rdparty/http_parser-2.6.2/src/http_parser-2.6.2 -I/mesos/build/3rdparty/libevent-2.1.5-beta/src/libevent-2.1.5-beta-lib/lib/include -I/mesos/build/3rdparty/zookeeper-3.4.8/src/zookeeper-3.4.8/src/c/include -I/mesos/build/3rdparty/zookeeper-3.4.8/src/zookeeper-3.4.8/src/c/generated -I/mesos/build/3rdparty/leveldb-1.4/src/leveldb-1.4/include -I/mesos/build/3rdparty/gmock-1.7.0/src/gmock-1.7.0/include -I/mesos/build/3rdparty/gmock-1.7.0/src/gmock-1.7.0/gtest/include    -o CMakeFiles/test-helper.dir/utils.cpp.o -c /mesos/src/tests/utils.cpp
/usr/bin/cmake -E cmake_progress_report /mesos/build/CMakeFiles 
[100%] Building CXX object src/tests/CMakeFiles/test-helper.dir/containerizer/memory_test_helper.cpp.o
cd /mesos/build/src/tests && /usr/bin/g++   -DBUILD_DATE="\"2016-3-3 10:20\"" -DBUILD_DIR=\"/mesos/build\" -DBUILD_FLAGS=\"\" -DBUILD_JAVA_JVM_LIBRARY=\"\" -DBUILD_TIME=\"1111100\" -DBUILD_USER=\"frank\" -DHAS_AUTHENTICATION=1 -DLIBDIR=\"/usr/local/libmesos\" -DPICOJSON_USE_INT64 -DPKGDATADIR=\"/usr/local/share/mesos\" -DPKGLIBEXECDIR=\"/usr/local/libexec/mesos\" -DPKGMODULEDIR=\"\" -DSBINDIR=\"\" -DSOURCE_DIR=\"/mesos\" -DTESTLIBEXECDIR=\"\" -DUSE_STATIC_LIB -DVERSION=\"1.2.0\" -D__STDC_FORMAT_MACROS -std=c++11 -g -I/mesos/include -I/mesos/build/include -I/mesos/build/include/mesos -I/mesos/build/src -I/mesos/src -I/mesos/3rdparty/stout/include -I/usr/include/apr-1.0 -I/mesos/build/3rdparty/boost-1.53.0/src/boost-1.53.0 -I/mesos/build/3rdparty/elfio-3.2/src/elfio-3.2 -I/mesos/build/3rdparty/glog-0.3.3/src/glog-0.3.3-lib/lib/include -I/mesos/build/3rdparty/nvml-352.79/src/nvml-352.79 -I/mesos/build/3rdparty/picojson-1.3.0/src/picojson-1.3.0 -I/mesos/build/3rdparty/protobuf-2.6.1/src/protobuf-2.6.1-lib/lib/include -I/usr/include/subversion-1 -I/mesos/src/src -I/mesos/3rdparty/libprocess/include -I/mesos/build/3rdparty/http_parser-2.6.2/src/http_parser-2.6.2 -I/mesos/build/3rdparty/libevent-2.1.5-beta/src/libevent-2.1.5-beta-lib/lib/include -I/mesos/build/3rdparty/zookeeper-3.4.8/src/zookeeper-3.4.8/src/c/include -I/mesos/build/3rdparty/zookeeper-3.4.8/src/zookeeper-3.4.8/src/c/generated -I/mesos/build/3rdparty/leveldb-1.4/src/leveldb-1.4/include -I/mesos/build/3rdparty/gmock-1.7.0/src/gmock-1.7.0/include -I/mesos/build/3rdparty/gmock-1.7.0/src/gmock-1.7.0/gtest/include    -o CMakeFiles/test-helper.dir/containerizer/memory_test_helper.cpp.o -c /mesos/src/tests/containerizer/memory_test_helper.cpp
/usr/bin/cmake -E cmake_progress_report /mesos/build/CMakeFiles 
[100%] Building CXX object src/tests/CMakeFiles/test-helper.dir/containerizer/capabilities_test_helper.cpp.o
cd /mesos/build/src/tests && /usr/bin/g++   -DBUILD_DATE="\"2016-3-3 10:20\"" -DBUILD_DIR=\"/mesos/build\" -DBUILD_FLAGS=\"\" -DBUILD_JAVA_JVM_LIBRARY=\"\" -DBUILD_TIME=\"1111100\" -DBUILD_USER=\"frank\" -DHAS_AUTHENTICATION=1 -DLIBDIR=\"/usr/local/libmesos\" -DPICOJSON_USE_INT64 -DPKGDATADIR=\"/usr/local/share/mesos\" -DPKGLIBEXECDIR=\"/usr/local/libexec/mesos\" -DPKGMODULEDIR=\"\" -DSBINDIR=\"\" -DSOURCE_DIR=\"/mesos\" -DTESTLIBEXECDIR=\"\" -DUSE_STATIC_LIB -DVERSION=\"1.2.0\" -D__STDC_FORMAT_MACROS -std=c++11 -g -I/mesos/include -I/mesos/build/include -I/mesos/build/include/mesos -I/mesos/build/src -I/mesos/src -I/mesos/3rdparty/stout/include -I/usr/include/apr-1.0 -I/mesos/build/3rdparty/boost-1.53.0/src/boost-1.53.0 -I/mesos/build/3rdparty/elfio-3.2/src/elfio-3.2 -I/mesos/build/3rdparty/glog-0.3.3/src/glog-0.3.3-lib/lib/include -I/mesos/build/3rdparty/nvml-352.79/src/nvml-352.79 -I/mesos/build/3rdparty/picojson-1.3.0/src/picojson-1.3.0 -I/mesos/build/3rdparty/protobuf-2.6.1/src/protobuf-2.6.1-lib/lib/include -I/usr/include/subversion-1 -I/mesos/src/src -I/mesos/3rdparty/libprocess/include -I/mesos/build/3rdparty/http_parser-2.6.2/src/http_parser-2.6.2 -I/mesos/build/3rdparty/libevent-2.1.5-beta/src/libevent-2.1.5-beta-lib/lib/include -I/mesos/build/3rdparty/zookeeper-3.4.8/src/zookeeper-3.4.8/src/c/include -I/mesos/build/3rdparty/zookeeper-3.4.8/src/zookeeper-3.4.8/src/c/generated -I/mesos/build/3rdparty/leveldb-1.4/src/leveldb-1.4/include -I/mesos/build/3rdparty/gmock-1.7.0/src/gmock-1.7.0/include -I/mesos/build/3rdparty/gmock-1.7.0/src/gmock-1.7.0/gtest/include    -o CMakeFiles/test-helper.dir/containerizer/capabilities_test_helper.cpp.o -c /mesos/src/tests/containerizer/capabilities_test_helper.cpp
../libmesos-1.2.0.a(composing.cpp.o): In function `mesos::internal::slave::ComposingContainerizerProcess::launch(mesos::ContainerID const&, mesos::CommandInfo const&, Option<mesos::ContainerInfo> const&, Option<std::string> const&, mesos::SlaveID const&)':
/mesos/src/slave/containerizer/composing.cpp:479: undefined reference to `mesos::internal::slave::getRootContainerId(mesos::ContainerID const&)'
../libmesos-1.2.0.a(containerizer.cpp.o): In function `mesos::internal::slave::MesosContainerizerProcess::recover(Option<mesos::internal::slave::state::SlaveState> const&)':
/mesos/src/slave/containerizer/mesos/containerizer.cpp:707: undefined reference to `mesos::internal::slave::getRootContainerId(mesos::ContainerID const&)'
/mesos/src/slave/containerizer/mesos/containerizer.cpp:737: undefined reference to `mesos::internal::slave::getRootContainerId(mesos::ContainerID const&)'
../libmesos-1.2.0.a(containerizer.cpp.o): In function `mesos::internal::slave::MesosContainerizerProcess::_launch(mesos::ContainerID const&, std::map<std::string, std::string, std::less<std::string>, std::allocator<std::pair<std::string const, std::string> > > const&, mesos::SlaveID const&, bool)':
/mesos/src/slave/containerizer/mesos/containerizer.cpp:1359: undefined reference to `mesos::internal::slave::getRootContainerId(mesos::ContainerID const&)'
../libmesos-1.2.0.a(containerizer.cpp.o): In function `mesos::internal::slave::MesosContainerizerProcess::launch(mesos::ContainerID const&, mesos::CommandInfo const&, Option<mesos::ContainerInfo> const&, Option<std::string> const&, mesos::SlaveID const&)':
/mesos/src/slave/containerizer/mesos/containerizer.cpp:1676: undefined reference to `mesos::internal::slave::getRootContainerId(mesos::ContainerID const&)'
../libmesos-1.2.0.a(store.cpp.o): In function `mesos::internal::slave::docker::StoreProcess::moveLayer(std::string const&, std::string const&)':
/mesos/src/slave/containerizer/mesos/provisioner/docker/store.cpp:345: undefined reference to `mesos::internal::slave::convertWhiteouts(std::string const&)'
../libmesos-1.2.0.a(cgroups.cpp.o): In function `mesos::internal::slave::CgroupsIsolatorProcess::isolate(mesos::ContainerID const&, int)':
/mesos/src/slave/containerizer/mesos/isolators/cgroups/cgroups.cpp:529: undefined reference to `mesos::internal::slave::getRootContainerId(mesos::ContainerID const&)'
../libmesos-1.2.0.a(cni.cpp.o): In function `mesos::internal::slave::NetworkCniIsolatorProcess::prepare(mesos::ContainerID const&, mesos::slave::ContainerConfig const&)':
/mesos/src/slave/containerizer/mesos/isolators/network/cni/cni.cpp:569: undefined reference to `mesos::internal::slave::getRootContainerId(mesos::ContainerID const&)'
../libmesos-1.2.0.a(cni.cpp.o): In function `mesos::internal::slave::NetworkCniIsolatorProcess::isolate(mesos::ContainerID const&, int)':
/mesos/src/slave/containerizer/mesos/isolators/network/cni/cni.cpp:730: undefined reference to `mesos::internal::slave::getRootContainerId(mesos::ContainerID const&)'
collect2: error: ld returned 1 exit status
make[2]: *** [src/mesos-agent] Error 1
make[2]: Leaving directory `/mesos/build'
make[1]: *** [src/slave/CMakeFiles/mesos-agent.dir/all] Error 2
/usr/bin/cmake -E cmake_progress_report /mesos/build/CMakeFiles 
[100%] Building CXX object src/tests/CMakeFiles/test-helper.dir/containerizer/setns_test_helper.cpp.o
cd /mesos/build/src/tests && /usr/bin/g++   -DBUILD_DATE="\"2016-3-3 10:20\"" -DBUILD_DIR=\"/mesos/build\" -DBUILD_FLAGS=\"\" -DBUILD_JAVA_JVM_LIBRARY=\"\" -DBUILD_TIME=\"1111100\" -DBUILD_USER=\"frank\" -DHAS_AUTHENTICATION=1 -DLIBDIR=\"/usr/local/libmesos\" -DPICOJSON_USE_INT64 -DPKGDATADIR=\"/usr/local/share/mesos\" -DPKGLIBEXECDIR=\"/usr/local/libexec/mesos\" -DPKGMODULEDIR=\"\" -DSBINDIR=\"\" -DSOURCE_DIR=\"/mesos\" -DTESTLIBEXECDIR=\"\" -DUSE_STATIC_LIB -DVERSION=\"1.2.0\" -D__STDC_FORMAT_MACROS -std=c++11 -g -I/mesos/include -I/mesos/build/include -I/mesos/build/include/mesos -I/mesos/build/src -I/mesos/src -I/mesos/3rdparty/stout/include -I/usr/include/apr-1.0 -I/mesos/build/3rdparty/boost-1.53.0/src/boost-1.53.0 -I/mesos/build/3rdparty/elfio-3.2/src/elfio-3.2 -I/mesos/build/3rdparty/glog-0.3.3/src/glog-0.3.3-lib/lib/include -I/mesos/build/3rdparty/nvml-352.79/src/nvml-352.79 -I/mesos/build/3rdparty/picojson-1.3.0/src/picojson-1.3.0 -I/mesos/build/3rdparty/protobuf-2.6.1/src/protobuf-2.6.1-lib/lib/include -I/usr/include/subversion-1 -I/mesos/src/src -I/mesos/3rdparty/libprocess/include -I/mesos/build/3rdparty/http_parser-2.6.2/src/http_parser-2.6.2 -I/mesos/build/3rdparty/libevent-2.1.5-beta/src/libevent-2.1.5-beta-lib/lib/include -I/mesos/build/3rdparty/zookeeper-3.4.8/src/zookeeper-3.4.8/src/c/include -I/mesos/build/3rdparty/zookeeper-3.4.8/src/zookeeper-3.4.8/src/c/generated -I/mesos/build/3rdparty/leveldb-1.4/src/leveldb-1.4/include -I/mesos/build/3rdparty/gmock-1.7.0/src/gmock-1.7.0/include -I/mesos/build/3rdparty/gmock-1.7.0/src/gmock-1.7.0/gtest/include    -o CMakeFiles/test-helper.dir/containerizer/setns_test_helper.cpp.o -c /mesos/src/tests/containerizer/setns_test_helper.cpp
Linking CXX executable ../test-helper
cd /mesos/build/src/tests && /usr/bin/cmake -E cmake_link_script CMakeFiles/test-helper.dir/link.txt --verbose=1
/usr/bin/g++    -std=c++11 -g    CMakeFiles/test-helper.dir/active_user_test_helper.cpp.o CMakeFiles/test-helper.dir/flags.cpp.o CMakeFiles/test-helper.dir/health_check_test_helper.cpp.o CMakeFiles/test-helper.dir/resources_utils.cpp.o CMakeFiles/test-helper.dir/test_helper_main.cpp.o CMakeFiles/test-helper.dir/utils.cpp.o CMakeFiles/test-helper.dir/containerizer/memory_test_helper.cpp.o CMakeFiles/test-helper.dir/containerizer/capabilities_test_helper.cpp.o CMakeFiles/test-helper.dir/containerizer/setns_test_helper.cpp.o  -o ../test-helper  -L/usr/lib/x86_64-linux-gnu/libapr-1.so  -L/mesos/build/3rdparty/glog-0.3.3/src/glog-0.3.3-lib/lib/lib  -L/mesos/build/3rdparty/protobuf-2.6.1/src/protobuf-2.6.1-lib/lib/lib  -L/usr/lib/x86_64-linux-gnu/libsvn_delta-1.so  -L/usr/lib/x86_64-linux-gnu/libsvn_diff-1.so  -L/usr/lib/x86_64-linux-gnu/libsvn_subr-1.so  -L/mesos/build/3rdparty/http_parser-2.6.2/src/http_parser-2.6.2-build  -L/mesos/build/3rdparty/libevent-2.1.5-beta/src/libevent-2.1.5-beta-lib/lib/lib  -L/mesos/build/3rdparty/zookeeper-3.4.8/src/zookeeper-3.4.8/src/c  -L/mesos/build/3rdparty/gmock-1.7.0/src/gmock-1.7.0-build/gtest -rdynamic ../libmesos-1.2.0.a ../../3rdparty/libprocess/src/libprocess-0.0.1.a -lgtest ../libmesos-protobufs.a ../../3rdparty/libprocess/src/libprocess-0.0.1.a -lcurl -lglog -lsvn_delta-1 -lsvn_diff-1 -lsvn_subr-1 -lprotobuf -ldl -lapr-1 ../../3rdparty/zookeeper-3.4.8/src/zookeeper-3.4.8/src/c/lib/libzookeeper_mt.a ../../3rdparty/leveldb-1.4/src/leveldb-1.4/libleveldb.a -lsasl2 -lrt -lhttp_parser -levent -lrt -lhttp_parser -levent -lz -lpthread -Wl,-rpath,/usr/lib/x86_64-linux-gnu/libapr-1.so:/mesos/build/3rdparty/glog-0.3.3/src/glog-0.3.3-lib/lib/lib:/mesos/build/3rdparty/protobuf-2.6.1/src/protobuf-2.6.1-lib/lib/lib:/usr/lib/x86_64-linux-gnu/libsvn_delta-1.so:/usr/lib/x86_64-linux-gnu/libsvn_diff-1.so:/usr/lib/x86_64-linux-gnu/libsvn_subr-1.so:/mesos/build/3rdparty/http_parser-2.6.2/src/http_parser-2.6.2-build:/mesos/build/3rdparty/libevent-2.1.5-beta/src/libevent-2.1.5-beta-lib/lib/lib:/mesos/build/3rdparty/zookeeper-3.4.8/src/zookeeper-3.4.8/src/c:/mesos/build/3rdparty/gmock-1.7.0/src/gmock-1.7.0-build/gtest 
make[2]: Leaving directory `/mesos/build'
/usr/bin/cmake -E cmake_progress_report /mesos/build/CMakeFiles  96 97
[100%] Built target test-helper
make[1]: Leaving directory `/mesos/build'
make: *** [all] Error 2
+ docker rmi mesos-1478339640-8898
Untagged: mesos-1478339640-8898:latest
Deleted: sha256:adeb72a74fa4bf232b76f1668a99e204bbdc60a669f4cf54ad635b4cfda6ff4d
Deleted: sha256:ed961ebd0184546ad68b4da13adec0037aca294f740e38afe46ea041c90c4a7d
Deleted: sha256:00b37e9f9fd8cd0c16117052b83a36a4eb7a759bbf672d602561e44cb792ccd2
Deleted: sha256:5a211cc2d9f9c4a06ef9ddcc39c8538765c4fa2d5b9f20e5bf4541ba10f4a4c2
Deleted: sha256:ce68e9e4b254dd9f83728066fe74ac32f1dd6d90740a3868834b9c5cb548bea9
Deleted: sha256:5c38874ea032c66cf559e32596f84adbc33558276b9d52fa6633f8cdec9248e4
Deleted: sha256:4cab35806cc94a05c5b52139736c75e5a8dd8f31d8d7663d746f6ecf8dd5ac29
Deleted: sha256:429e5c9d558c4732c8bc1bdc3a5fc8601cab9541f2bd73e9e51b2e95dc20e1f2
Deleted: sha256:2c04a697fe4c1d77e998c13daa3d1228ad7c6130670486da8bafd0ff0f7d28a4
Deleted: sha256:01ed43220627ac99ab5e804d341cb6ffac25f0f0a385cecff1bdde49ef6b5cef
Deleted: sha256:4db204a0973b81b088b5f88cd5f8afd67aa53efe217f638143eb493b602c66e5
Deleted: sha256:c6e6e02ae19dd4cfa7930ed2fe0d586c32f0742be7d77c714566eb4cb027594d
Deleted: sha256:3723c7ab2aba0795add291144cbf5d16be739f9f69cec71f46051f843d2db8c2
Deleted: sha256:3ed57f6c4fd92c614f299a5518e39fd5c804b446457f1e1570765b9080e61d54
Deleted: sha256:506177f24ec93c3aa8d9a6750a001cb76f31ed871f3fa03679e1100fe1f5302b
Deleted: sha256:0c3b07c524ae1a2a688dc51cfd35b58c79c5869bb2bfa9516069938e6c1b135a
Deleted: sha256:b1494e84d39e56cac24749db525ec8fc1ef0888b008d330aece60de312e0da4d
Deleted: sha256:1699eb908f4b89dbeae92560a79f80143ac98bdc231e43234c2a49294d037a83
Deleted: sha256:f44dbba094e1cb72466be948c745d0789a246818041108eaeb748695406c6b54
Deleted: sha256:b6865bfd6fcebdc1bd92f80122ebe522a3378990f8bbaa219ee1a0fcc0596332
Deleted: sha256:b7700705e86bb8cf3f277056bdec1a74403dcb72b56b4211091a7a936df76518
Deleted: sha256:3ad28c320a5d23b449d487e80ca809e6e2a560ff1aa79ee60dec68fda3c0d3be
Deleted: sha256:0f851e0c0c9823f36cb590d173a524caa61236c3bc197bfa42cc3b4b6e3fcc9c
Deleted: sha256:42a3a75aa8b379cbfd3d70ced386966bce1c76e3b13e70b51482e771f2a531ad
Build step 'Execute shell' marked build as failure

Mime
View raw message