mesos-builds mailing list archives

Site index · List index
Message view « Date » · « Thread »
Top « Date » · « Thread »
From Apache Jenkins Server <jenk...@builds.apache.org>
Subject Build failed in Jenkins: Mesos » cmake,clang,--verbose --enable-libevent --enable-ssl,GLOG_v=1 MESOS_VERBOSE=1,ubuntu:14.04,(docker||Hadoop)&&(!ubuntu-us1)&&(!ubuntu-6)&&(!ubuntu-eu2) #2952
Date Tue, 22 Nov 2016 04:25:16 GMT
See <https://builds.apache.org/job/Mesos/BUILDTOOL=cmake,COMPILER=clang,CONFIGURATION=--verbose%20--enable-libevent%20--enable-ssl,ENVIRONMENT=GLOG_v=1%20MESOS_VERBOSE=1,OS=ubuntu%3A14.04,label_exp=(docker%7C%7CHadoop)&&(!ubuntu-us1)&&(!ubuntu-6)&&(!ubuntu-eu2)/2952/changes>

Changes:

[anand] Moved around the `Request` struct in the file.

[anand] Initialized the POD type in the `Request` struct.

[anand] Introduced a reader member to `Request` to support request streaming.

[anand] Introduced `RouteOptions` to support streaming requests.

[anand] Introduced a `readAll()` helper on `http::Pipe::Reader`.

[anand] Introduced a streaming request decoder in libprocess.

[anand] Removed extraneous socket argument from `DataDecoder` constructor.

[anand] Parameterized existing decoder tests on the type of decoder.

[anand] Wired the libprocess code to use the streaming decoder.

[anand] Removed `convert()` continuations in favor of using `readAll()`.

[anand] Added support for request streaming to the connection abstraction.

[anand] Added a test for request streaming and GZIP compression.

[anand] Disabled tests relying on filtering HTTP events.

[anand] Invoked parent class `SetUpTestCase()` from child test fixtures.

------------------------------------------
[...truncated 7615 lines...]
cd /mesos/build/3rdparty/libprocess/src && /usr/bin/clang++-3.5   -DHAS_AUTHENTICATION=1 -DLIBDIR=\"/usr/local/libmesos\" -DPICOJSON_USE_INT64 -DPKGDATADIR=\"/usr/local/share/mesos\" -DPKGLIBEXECDIR=\"/usr/local/libexec/mesos\" -DVERSION=\"1.2.0\" -D__STDC_FORMAT_MACROS -std=c++11 -g -I/mesos/3rdparty/stout/include -I/usr/include/apr-1.0 -I/mesos/build/3rdparty/boost-1.53.0/src/boost-1.53.0 -I/mesos/build/3rdparty/elfio-3.2/src/elfio-3.2 -I/mesos/build/3rdparty/glog-0.3.3/src/glog-0.3.3-lib/lib/include -I/mesos/build/3rdparty/nvml-352.79/src/nvml-352.79 -I/mesos/build/3rdparty/picojson-1.3.0/src/picojson-1.3.0 -I/mesos/build/3rdparty/protobuf-2.6.1/src/protobuf-2.6.1-lib/lib/include -I/usr/include/subversion-1 -I/mesos/3rdparty/libprocess/src/src -I/mesos/3rdparty/libprocess/include -I/mesos/build/3rdparty/http_parser-2.6.2/src/http_parser-2.6.2 -I/mesos/build/3rdparty/libevent-2.1.5-beta/src/libevent-2.1.5-beta-lib/lib/include    -fPIC -o CMakeFiles/process-0.0.1.dir/authenticator.cpp.o -c /mesos/3rdparty/libprocess/src/authenticator.cpp
Building CXX object 3rdparty/libprocess/src/CMakeFiles/process-0.0.1.dir/firewall.cpp.o
Building CXX object 3rdparty/libprocess/src/CMakeFiles/process-0.0.1.dir/clock.cpp.o
cd /mesos/build/3rdparty/libprocess/src && /usr/bin/clang++-3.5   -DHAS_AUTHENTICATION=1 -DLIBDIR=\"/usr/local/libmesos\" -DPICOJSON_USE_INT64 -DPKGDATADIR=\"/usr/local/share/mesos\" -DPKGLIBEXECDIR=\"/usr/local/libexec/mesos\" -DVERSION=\"1.2.0\" -D__STDC_FORMAT_MACROS -std=c++11 -g -I/mesos/3rdparty/stout/include -I/usr/include/apr-1.0 -I/mesos/build/3rdparty/boost-1.53.0/src/boost-1.53.0 -I/mesos/build/3rdparty/elfio-3.2/src/elfio-3.2 -I/mesos/build/3rdparty/glog-0.3.3/src/glog-0.3.3-lib/lib/include -I/mesos/build/3rdparty/nvml-352.79/src/nvml-352.79 -I/mesos/build/3rdparty/picojson-1.3.0/src/picojson-1.3.0 -I/mesos/build/3rdparty/protobuf-2.6.1/src/protobuf-2.6.1-lib/lib/include -I/usr/include/subversion-1 -I/mesos/3rdparty/libprocess/src/src -I/mesos/3rdparty/libprocess/include -I/mesos/build/3rdparty/http_parser-2.6.2/src/http_parser-2.6.2 -I/mesos/build/3rdparty/libevent-2.1.5-beta/src/libevent-2.1.5-beta-lib/lib/include    -fPIC -o CMakeFiles/process-0.0.1.dir/firewall.cpp.o -c /mesos/3rdparty/libprocess/src/firewall.cpp
cd /mesos/build/3rdparty/libprocess/src && /usr/bin/clang++-3.5   -DHAS_AUTHENTICATION=1 -DLIBDIR=\"/usr/local/libmesos\" -DPICOJSON_USE_INT64 -DPKGDATADIR=\"/usr/local/share/mesos\" -DPKGLIBEXECDIR=\"/usr/local/libexec/mesos\" -DVERSION=\"1.2.0\" -D__STDC_FORMAT_MACROS -std=c++11 -g -I/mesos/3rdparty/stout/include -I/usr/include/apr-1.0 -I/mesos/build/3rdparty/boost-1.53.0/src/boost-1.53.0 -I/mesos/build/3rdparty/elfio-3.2/src/elfio-3.2 -I/mesos/build/3rdparty/glog-0.3.3/src/glog-0.3.3-lib/lib/include -I/mesos/build/3rdparty/nvml-352.79/src/nvml-352.79 -I/mesos/build/3rdparty/picojson-1.3.0/src/picojson-1.3.0 -I/mesos/build/3rdparty/protobuf-2.6.1/src/protobuf-2.6.1-lib/lib/include -I/usr/include/subversion-1 -I/mesos/3rdparty/libprocess/src/src -I/mesos/3rdparty/libprocess/include -I/mesos/build/3rdparty/http_parser-2.6.2/src/http_parser-2.6.2 -I/mesos/build/3rdparty/libevent-2.1.5-beta/src/libevent-2.1.5-beta-lib/lib/include    -fPIC -o CMakeFiles/process-0.0.1.dir/clock.cpp.o -c /mesos/3rdparty/libprocess/src/clock.cpp
make[3]: Entering directory `/mesos/build'
/usr/bin/cmake -E cmake_progress_report /mesos/build/CMakeFiles 86
[ 48%] Building CXX object 3rdparty/stout/tests/CMakeFiles/stout_tests.dir/base64_tests.cpp.o
cd /mesos/build/3rdparty/stout/tests && /usr/bin/clang++-3.5   -DHAS_AUTHENTICATION=1 -DLIBDIR=\"/usr/local/libmesos\" -DPICOJSON_USE_INT64 -DPKGDATADIR=\"/usr/local/share/mesos\" -DPKGLIBEXECDIR=\"/usr/local/libexec/mesos\" -DVERSION=\"1.2.0\" -D__STDC_FORMAT_MACROS -std=c++11 -g -I/mesos/3rdparty/stout/include -I/usr/include/apr-1.0 -I/mesos/build/3rdparty/boost-1.53.0/src/boost-1.53.0 -I/mesos/build/3rdparty/elfio-3.2/src/elfio-3.2 -I/mesos/build/3rdparty/glog-0.3.3/src/glog-0.3.3-lib/lib/include -I/mesos/build/3rdparty/nvml-352.79/src/nvml-352.79 -I/mesos/build/3rdparty/picojson-1.3.0/src/picojson-1.3.0 -I/mesos/build/3rdparty/protobuf-2.6.1/src/protobuf-2.6.1-lib/lib/include -I/usr/include/subversion-1 -I/mesos/3rdparty/stout/tests/src -I/mesos/build/3rdparty/gmock-1.7.0/src/gmock-1.7.0/include -I/mesos/build/3rdparty/gmock-1.7.0/src/gmock-1.7.0/gtest/include    -o CMakeFiles/stout_tests.dir/base64_tests.cpp.o -c /mesos/3rdparty/stout/tests/base64_tests.cpp
/usr/bin/cmake -E cmake_progress_report /mesos/build/CMakeFiles 
[ 48%] Building CXX object 3rdparty/stout/tests/CMakeFiles/stout_tests.dir/bits_tests.cpp.o
cd /mesos/build/3rdparty/stout/tests && /usr/bin/clang++-3.5   -DHAS_AUTHENTICATION=1 -DLIBDIR=\"/usr/local/libmesos\" -DPICOJSON_USE_INT64 -DPKGDATADIR=\"/usr/local/share/mesos\" -DPKGLIBEXECDIR=\"/usr/local/libexec/mesos\" -DVERSION=\"1.2.0\" -D__STDC_FORMAT_MACROS -std=c++11 -g -I/mesos/3rdparty/stout/include -I/usr/include/apr-1.0 -I/mesos/build/3rdparty/boost-1.53.0/src/boost-1.53.0 -I/mesos/build/3rdparty/elfio-3.2/src/elfio-3.2 -I/mesos/build/3rdparty/glog-0.3.3/src/glog-0.3.3-lib/lib/include -I/mesos/build/3rdparty/nvml-352.79/src/nvml-352.79 -I/mesos/build/3rdparty/picojson-1.3.0/src/picojson-1.3.0 -I/mesos/build/3rdparty/protobuf-2.6.1/src/protobuf-2.6.1-lib/lib/include -I/usr/include/subversion-1 -I/mesos/3rdparty/stout/tests/src -I/mesos/build/3rdparty/gmock-1.7.0/src/gmock-1.7.0/include -I/mesos/build/3rdparty/gmock-1.7.0/src/gmock-1.7.0/gtest/include    -o CMakeFiles/stout_tests.dir/bits_tests.cpp.o -c /mesos/3rdparty/stout/tests/bits_tests.cpp
/usr/bin/cmake -E cmake_progress_report /mesos/build/CMakeFiles 
[ 48%] Building CXX object 3rdparty/stout/tests/CMakeFiles/stout_tests.dir/bytes_tests.cpp.o
cd /mesos/build/3rdparty/stout/tests && /usr/bin/clang++-3.5   -DHAS_AUTHENTICATION=1 -DLIBDIR=\"/usr/local/libmesos\" -DPICOJSON_USE_INT64 -DPKGDATADIR=\"/usr/local/share/mesos\" -DPKGLIBEXECDIR=\"/usr/local/libexec/mesos\" -DVERSION=\"1.2.0\" -D__STDC_FORMAT_MACROS -std=c++11 -g -I/mesos/3rdparty/stout/include -I/usr/include/apr-1.0 -I/mesos/build/3rdparty/boost-1.53.0/src/boost-1.53.0 -I/mesos/build/3rdparty/elfio-3.2/src/elfio-3.2 -I/mesos/build/3rdparty/glog-0.3.3/src/glog-0.3.3-lib/lib/include -I/mesos/build/3rdparty/nvml-352.79/src/nvml-352.79 -I/mesos/build/3rdparty/picojson-1.3.0/src/picojson-1.3.0 -I/mesos/build/3rdparty/protobuf-2.6.1/src/protobuf-2.6.1-lib/lib/include -I/usr/include/subversion-1 -I/mesos/3rdparty/stout/tests/src -I/mesos/build/3rdparty/gmock-1.7.0/src/gmock-1.7.0/include -I/mesos/build/3rdparty/gmock-1.7.0/src/gmock-1.7.0/gtest/include    -o CMakeFiles/stout_tests.dir/bytes_tests.cpp.o -c /mesos/3rdparty/stout/tests/bytes_tests.cpp
/usr/bin/cmake -E cmake_progress_report /mesos/build/CMakeFiles 
[ 48%] Building CXX object 3rdparty/libprocess/src/CMakeFiles/process-0.0.1.dir/help.cpp.o
cd /mesos/build/3rdparty/libprocess/src && /usr/bin/clang++-3.5   -DHAS_AUTHENTICATION=1 -DLIBDIR=\"/usr/local/libmesos\" -DPICOJSON_USE_INT64 -DPKGDATADIR=\"/usr/local/share/mesos\" -DPKGLIBEXECDIR=\"/usr/local/libexec/mesos\" -DVERSION=\"1.2.0\" -D__STDC_FORMAT_MACROS -std=c++11 -g -I/mesos/3rdparty/stout/include -I/usr/include/apr-1.0 -I/mesos/build/3rdparty/boost-1.53.0/src/boost-1.53.0 -I/mesos/build/3rdparty/elfio-3.2/src/elfio-3.2 -I/mesos/build/3rdparty/glog-0.3.3/src/glog-0.3.3-lib/lib/include -I/mesos/build/3rdparty/nvml-352.79/src/nvml-352.79 -I/mesos/build/3rdparty/picojson-1.3.0/src/picojson-1.3.0 -I/mesos/build/3rdparty/protobuf-2.6.1/src/protobuf-2.6.1-lib/lib/include -I/usr/include/subversion-1 -I/mesos/3rdparty/libprocess/src/src -I/mesos/3rdparty/libprocess/include -I/mesos/build/3rdparty/http_parser-2.6.2/src/http_parser-2.6.2 -I/mesos/build/3rdparty/libevent-2.1.5-beta/src/libevent-2.1.5-beta-lib/lib/include    -fPIC -o CMakeFiles/process-0.0.1.dir/help.cpp.o -c /mesos/3rdparty/libprocess/src/help.cpp
/usr/bin/cmake -E cmake_progress_report /mesos/build/CMakeFiles 
[ 48%] Building CXX object 3rdparty/stout/tests/CMakeFiles/stout_tests.dir/cache_tests.cpp.o
cd /mesos/build/3rdparty/stout/tests && /usr/bin/clang++-3.5   -DHAS_AUTHENTICATION=1 -DLIBDIR=\"/usr/local/libmesos\" -DPICOJSON_USE_INT64 -DPKGDATADIR=\"/usr/local/share/mesos\" -DPKGLIBEXECDIR=\"/usr/local/libexec/mesos\" -DVERSION=\"1.2.0\" -D__STDC_FORMAT_MACROS -std=c++11 -g -I/mesos/3rdparty/stout/include -I/usr/include/apr-1.0 -I/mesos/build/3rdparty/boost-1.53.0/src/boost-1.53.0 -I/mesos/build/3rdparty/elfio-3.2/src/elfio-3.2 -I/mesos/build/3rdparty/glog-0.3.3/src/glog-0.3.3-lib/lib/include -I/mesos/build/3rdparty/nvml-352.79/src/nvml-352.79 -I/mesos/build/3rdparty/picojson-1.3.0/src/picojson-1.3.0 -I/mesos/build/3rdparty/protobuf-2.6.1/src/protobuf-2.6.1-lib/lib/include -I/usr/include/subversion-1 -I/mesos/3rdparty/stout/tests/src -I/mesos/build/3rdparty/gmock-1.7.0/src/gmock-1.7.0/include -I/mesos/build/3rdparty/gmock-1.7.0/src/gmock-1.7.0/gtest/include    -o CMakeFiles/stout_tests.dir/cache_tests.cpp.o -c /mesos/3rdparty/stout/tests/cache_tests.cpp
/usr/bin/cmake -E cmake_progress_report /mesos/build/CMakeFiles 76
[ 51%] Building CXX object 3rdparty/libprocess/src/CMakeFiles/process-0.0.1.dir/http.cpp.o
cd /mesos/build/3rdparty/libprocess/src && /usr/bin/clang++-3.5   -DHAS_AUTHENTICATION=1 -DLIBDIR=\"/usr/local/libmesos\" -DPICOJSON_USE_INT64 -DPKGDATADIR=\"/usr/local/share/mesos\" -DPKGLIBEXECDIR=\"/usr/local/libexec/mesos\" -DVERSION=\"1.2.0\" -D__STDC_FORMAT_MACROS -std=c++11 -g -I/mesos/3rdparty/stout/include -I/usr/include/apr-1.0 -I/mesos/build/3rdparty/boost-1.53.0/src/boost-1.53.0 -I/mesos/build/3rdparty/elfio-3.2/src/elfio-3.2 -I/mesos/build/3rdparty/glog-0.3.3/src/glog-0.3.3-lib/lib/include -I/mesos/build/3rdparty/nvml-352.79/src/nvml-352.79 -I/mesos/build/3rdparty/picojson-1.3.0/src/picojson-1.3.0 -I/mesos/build/3rdparty/protobuf-2.6.1/src/protobuf-2.6.1-lib/lib/include -I/usr/include/subversion-1 -I/mesos/3rdparty/libprocess/src/src -I/mesos/3rdparty/libprocess/include -I/mesos/build/3rdparty/http_parser-2.6.2/src/http_parser-2.6.2 -I/mesos/build/3rdparty/libevent-2.1.5-beta/src/libevent-2.1.5-beta-lib/lib/include    -fPIC -o CMakeFiles/process-0.0.1.dir/http.cpp.o -c /mesos/3rdparty/libprocess/src/http.cpp
/usr/bin/cmake -E cmake_progress_report /mesos/build/CMakeFiles 87
[ 54%] Building CXX object 3rdparty/stout/tests/CMakeFiles/stout_tests.dir/duration_tests.cpp.o
cd /mesos/build/3rdparty/stout/tests && /usr/bin/clang++-3.5   -DHAS_AUTHENTICATION=1 -DLIBDIR=\"/usr/local/libmesos\" -DPICOJSON_USE_INT64 -DPKGDATADIR=\"/usr/local/share/mesos\" -DPKGLIBEXECDIR=\"/usr/local/libexec/mesos\" -DVERSION=\"1.2.0\" -D__STDC_FORMAT_MACROS -std=c++11 -g -I/mesos/3rdparty/stout/include -I/usr/include/apr-1.0 -I/mesos/build/3rdparty/boost-1.53.0/src/boost-1.53.0 -I/mesos/build/3rdparty/elfio-3.2/src/elfio-3.2 -I/mesos/build/3rdparty/glog-0.3.3/src/glog-0.3.3-lib/lib/include -I/mesos/build/3rdparty/nvml-352.79/src/nvml-352.79 -I/mesos/build/3rdparty/picojson-1.3.0/src/picojson-1.3.0 -I/mesos/build/3rdparty/protobuf-2.6.1/src/protobuf-2.6.1-lib/lib/include -I/usr/include/subversion-1 -I/mesos/3rdparty/stout/tests/src -I/mesos/build/3rdparty/gmock-1.7.0/src/gmock-1.7.0/include -I/mesos/build/3rdparty/gmock-1.7.0/src/gmock-1.7.0/gtest/include    -o CMakeFiles/stout_tests.dir/duration_tests.cpp.o -c /mesos/3rdparty/stout/tests/duration_tests.cpp
/usr/bin/cmake -E cmake_progress_report /mesos/build/CMakeFiles 
[ 54%] Building CXX object 3rdparty/stout/tests/CMakeFiles/stout_tests.dir/dynamiclibrary_tests.cpp.o
cd /mesos/build/3rdparty/stout/tests && /usr/bin/clang++-3.5   -DHAS_AUTHENTICATION=1 -DLIBDIR=\"/usr/local/libmesos\" -DPICOJSON_USE_INT64 -DPKGDATADIR=\"/usr/local/share/mesos\" -DPKGLIBEXECDIR=\"/usr/local/libexec/mesos\" -DVERSION=\"1.2.0\" -D__STDC_FORMAT_MACROS -std=c++11 -g -I/mesos/3rdparty/stout/include -I/usr/include/apr-1.0 -I/mesos/build/3rdparty/boost-1.53.0/src/boost-1.53.0 -I/mesos/build/3rdparty/elfio-3.2/src/elfio-3.2 -I/mesos/build/3rdparty/glog-0.3.3/src/glog-0.3.3-lib/lib/include -I/mesos/build/3rdparty/nvml-352.79/src/nvml-352.79 -I/mesos/build/3rdparty/picojson-1.3.0/src/picojson-1.3.0 -I/mesos/build/3rdparty/protobuf-2.6.1/src/protobuf-2.6.1-lib/lib/include -I/usr/include/subversion-1 -I/mesos/3rdparty/stout/tests/src -I/mesos/build/3rdparty/gmock-1.7.0/src/gmock-1.7.0/include -I/mesos/build/3rdparty/gmock-1.7.0/src/gmock-1.7.0/gtest/include    -o CMakeFiles/stout_tests.dir/dynamiclibrary_tests.cpp.o -c /mesos/3rdparty/stout/tests/dynamiclibrary_tests.cpp
/usr/bin/cmake -E cmake_progress_report /mesos/build/CMakeFiles 
[ 54%] Building CXX object 3rdparty/stout/tests/CMakeFiles/stout_tests.dir/error_tests.cpp.o
cd /mesos/build/3rdparty/stout/tests && /usr/bin/clang++-3.5   -DHAS_AUTHENTICATION=1 -DLIBDIR=\"/usr/local/libmesos\" -DPICOJSON_USE_INT64 -DPKGDATADIR=\"/usr/local/share/mesos\" -DPKGLIBEXECDIR=\"/usr/local/libexec/mesos\" -DVERSION=\"1.2.0\" -D__STDC_FORMAT_MACROS -std=c++11 -g -I/mesos/3rdparty/stout/include -I/usr/include/apr-1.0 -I/mesos/build/3rdparty/boost-1.53.0/src/boost-1.53.0 -I/mesos/build/3rdparty/elfio-3.2/src/elfio-3.2 -I/mesos/build/3rdparty/glog-0.3.3/src/glog-0.3.3-lib/lib/include -I/mesos/build/3rdparty/nvml-352.79/src/nvml-352.79 -I/mesos/build/3rdparty/picojson-1.3.0/src/picojson-1.3.0 -I/mesos/build/3rdparty/protobuf-2.6.1/src/protobuf-2.6.1-lib/lib/include -I/usr/include/subversion-1 -I/mesos/3rdparty/stout/tests/src -I/mesos/build/3rdparty/gmock-1.7.0/src/gmock-1.7.0/include -I/mesos/build/3rdparty/gmock-1.7.0/src/gmock-1.7.0/gtest/include    -o CMakeFiles/stout_tests.dir/error_tests.cpp.o -c /mesos/3rdparty/stout/tests/error_tests.cpp
/usr/bin/cmake -E cmake_progress_report /mesos/build/CMakeFiles 
[ 54%] Building CXX object 3rdparty/libprocess/src/CMakeFiles/process-0.0.1.dir/io.cpp.o
cd /mesos/build/3rdparty/libprocess/src && /usr/bin/clang++-3.5   -DHAS_AUTHENTICATION=1 -DLIBDIR=\"/usr/local/libmesos\" -DPICOJSON_USE_INT64 -DPKGDATADIR=\"/usr/local/share/mesos\" -DPKGLIBEXECDIR=\"/usr/local/libexec/mesos\" -DVERSION=\"1.2.0\" -D__STDC_FORMAT_MACROS -std=c++11 -g -I/mesos/3rdparty/stout/include -I/usr/include/apr-1.0 -I/mesos/build/3rdparty/boost-1.53.0/src/boost-1.53.0 -I/mesos/build/3rdparty/elfio-3.2/src/elfio-3.2 -I/mesos/build/3rdparty/glog-0.3.3/src/glog-0.3.3-lib/lib/include -I/mesos/build/3rdparty/nvml-352.79/src/nvml-352.79 -I/mesos/build/3rdparty/picojson-1.3.0/src/picojson-1.3.0 -I/mesos/build/3rdparty/protobuf-2.6.1/src/protobuf-2.6.1-lib/lib/include -I/usr/include/subversion-1 -I/mesos/3rdparty/libprocess/src/src -I/mesos/3rdparty/libprocess/include -I/mesos/build/3rdparty/http_parser-2.6.2/src/http_parser-2.6.2 -I/mesos/build/3rdparty/libevent-2.1.5-beta/src/libevent-2.1.5-beta-lib/lib/include    -fPIC -o CMakeFiles/process-0.0.1.dir/io.cpp.o -c /mesos/3rdparty/libprocess/src/io.cpp
/usr/bin/cmake -E cmake_progress_report /mesos/build/CMakeFiles 
[ 54%] Building CXX object 3rdparty/stout/tests/CMakeFiles/stout_tests.dir/flags_tests.cpp.o
cd /mesos/build/3rdparty/stout/tests && /usr/bin/clang++-3.5   -DHAS_AUTHENTICATION=1 -DLIBDIR=\"/usr/local/libmesos\" -DPICOJSON_USE_INT64 -DPKGDATADIR=\"/usr/local/share/mesos\" -DPKGLIBEXECDIR=\"/usr/local/libexec/mesos\" -DVERSION=\"1.2.0\" -D__STDC_FORMAT_MACROS -std=c++11 -g -I/mesos/3rdparty/stout/include -I/usr/include/apr-1.0 -I/mesos/build/3rdparty/boost-1.53.0/src/boost-1.53.0 -I/mesos/build/3rdparty/elfio-3.2/src/elfio-3.2 -I/mesos/build/3rdparty/glog-0.3.3/src/glog-0.3.3-lib/lib/include -I/mesos/build/3rdparty/nvml-352.79/src/nvml-352.79 -I/mesos/build/3rdparty/picojson-1.3.0/src/picojson-1.3.0 -I/mesos/build/3rdparty/protobuf-2.6.1/src/protobuf-2.6.1-lib/lib/include -I/usr/include/subversion-1 -I/mesos/3rdparty/stout/tests/src -I/mesos/build/3rdparty/gmock-1.7.0/src/gmock-1.7.0/include -I/mesos/build/3rdparty/gmock-1.7.0/src/gmock-1.7.0/gtest/include    -o CMakeFiles/stout_tests.dir/flags_tests.cpp.o -c /mesos/3rdparty/stout/tests/flags_tests.cpp
/usr/bin/cmake -E cmake_progress_report /mesos/build/CMakeFiles 
[ 54%] Building CXX object 3rdparty/stout/tests/CMakeFiles/stout_tests.dir/gzip_tests.cpp.o
cd /mesos/build/3rdparty/stout/tests && /usr/bin/clang++-3.5   -DHAS_AUTHENTICATION=1 -DLIBDIR=\"/usr/local/libmesos\" -DPICOJSON_USE_INT64 -DPKGDATADIR=\"/usr/local/share/mesos\" -DPKGLIBEXECDIR=\"/usr/local/libexec/mesos\" -DVERSION=\"1.2.0\" -D__STDC_FORMAT_MACROS -std=c++11 -g -I/mesos/3rdparty/stout/include -I/usr/include/apr-1.0 -I/mesos/build/3rdparty/boost-1.53.0/src/boost-1.53.0 -I/mesos/build/3rdparty/elfio-3.2/src/elfio-3.2 -I/mesos/build/3rdparty/glog-0.3.3/src/glog-0.3.3-lib/lib/include -I/mesos/build/3rdparty/nvml-352.79/src/nvml-352.79 -I/mesos/build/3rdparty/picojson-1.3.0/src/picojson-1.3.0 -I/mesos/build/3rdparty/protobuf-2.6.1/src/protobuf-2.6.1-lib/lib/include -I/usr/include/subversion-1 -I/mesos/3rdparty/stout/tests/src -I/mesos/build/3rdparty/gmock-1.7.0/src/gmock-1.7.0/include -I/mesos/build/3rdparty/gmock-1.7.0/src/gmock-1.7.0/gtest/include    -o CMakeFiles/stout_tests.dir/gzip_tests.cpp.o -c /mesos/3rdparty/stout/tests/gzip_tests.cpp
/usr/bin/cmake -E cmake_progress_report /mesos/build/CMakeFiles 88
[ 56%] Building CXX object 3rdparty/stout/tests/CMakeFiles/stout_tests.dir/hashmap_tests.cpp.o
cd /mesos/build/3rdparty/stout/tests && /usr/bin/clang++-3.5   -DHAS_AUTHENTICATION=1 -DLIBDIR=\"/usr/local/libmesos\" -DPICOJSON_USE_INT64 -DPKGDATADIR=\"/usr/local/share/mesos\" -DPKGLIBEXECDIR=\"/usr/local/libexec/mesos\" -DVERSION=\"1.2.0\" -D__STDC_FORMAT_MACROS -std=c++11 -g -I/mesos/3rdparty/stout/include -I/usr/include/apr-1.0 -I/mesos/build/3rdparty/boost-1.53.0/src/boost-1.53.0 -I/mesos/build/3rdparty/elfio-3.2/src/elfio-3.2 -I/mesos/build/3rdparty/glog-0.3.3/src/glog-0.3.3-lib/lib/include -I/mesos/build/3rdparty/nvml-352.79/src/nvml-352.79 -I/mesos/build/3rdparty/picojson-1.3.0/src/picojson-1.3.0 -I/mesos/build/3rdparty/protobuf-2.6.1/src/protobuf-2.6.1-lib/lib/include -I/usr/include/subversion-1 -I/mesos/3rdparty/stout/tests/src -I/mesos/build/3rdparty/gmock-1.7.0/src/gmock-1.7.0/include -I/mesos/build/3rdparty/gmock-1.7.0/src/gmock-1.7.0/gtest/include    -o CMakeFiles/stout_tests.dir/hashmap_tests.cpp.o -c /mesos/3rdparty/stout/tests/hashmap_tests.cpp
/usr/bin/cmake -E cmake_progress_report /mesos/build/CMakeFiles 
[ 56%] Building CXX object 3rdparty/stout/tests/CMakeFiles/stout_tests.dir/hashset_tests.cpp.o
cd /mesos/build/3rdparty/stout/tests && /usr/bin/clang++-3.5   -DHAS_AUTHENTICATION=1 -DLIBDIR=\"/usr/local/libmesos\" -DPICOJSON_USE_INT64 -DPKGDATADIR=\"/usr/local/share/mesos\" -DPKGLIBEXECDIR=\"/usr/local/libexec/mesos\" -DVERSION=\"1.2.0\" -D__STDC_FORMAT_MACROS -std=c++11 -g -I/mesos/3rdparty/stout/include -I/usr/include/apr-1.0 -I/mesos/build/3rdparty/boost-1.53.0/src/boost-1.53.0 -I/mesos/build/3rdparty/elfio-3.2/src/elfio-3.2 -I/mesos/build/3rdparty/glog-0.3.3/src/glog-0.3.3-lib/lib/include -I/mesos/build/3rdparty/nvml-352.79/src/nvml-352.79 -I/mesos/build/3rdparty/picojson-1.3.0/src/picojson-1.3.0 -I/mesos/build/3rdparty/protobuf-2.6.1/src/protobuf-2.6.1-lib/lib/include -I/usr/include/subversion-1 -I/mesos/3rdparty/stout/tests/src -I/mesos/build/3rdparty/gmock-1.7.0/src/gmock-1.7.0/include -I/mesos/build/3rdparty/gmock-1.7.0/src/gmock-1.7.0/gtest/include    -o CMakeFiles/stout_tests.dir/hashset_tests.cpp.o -c /mesos/3rdparty/stout/tests/hashset_tests.cpp
/usr/bin/cmake -E cmake_progress_report /mesos/build/CMakeFiles 
[ 56%] Building CXX object 3rdparty/stout/tests/CMakeFiles/stout_tests.dir/interval_tests.cpp.o
cd /mesos/build/3rdparty/stout/tests && /usr/bin/clang++-3.5   -DHAS_AUTHENTICATION=1 -DLIBDIR=\"/usr/local/libmesos\" -DPICOJSON_USE_INT64 -DPKGDATADIR=\"/usr/local/share/mesos\" -DPKGLIBEXECDIR=\"/usr/local/libexec/mesos\" -DVERSION=\"1.2.0\" -D__STDC_FORMAT_MACROS -std=c++11 -g -I/mesos/3rdparty/stout/include -I/usr/include/apr-1.0 -I/mesos/build/3rdparty/boost-1.53.0/src/boost-1.53.0 -I/mesos/build/3rdparty/elfio-3.2/src/elfio-3.2 -I/mesos/build/3rdparty/glog-0.3.3/src/glog-0.3.3-lib/lib/include -I/mesos/build/3rdparty/nvml-352.79/src/nvml-352.79 -I/mesos/build/3rdparty/picojson-1.3.0/src/picojson-1.3.0 -I/mesos/build/3rdparty/protobuf-2.6.1/src/protobuf-2.6.1-lib/lib/include -I/usr/include/subversion-1 -I/mesos/3rdparty/stout/tests/src -I/mesos/build/3rdparty/gmock-1.7.0/src/gmock-1.7.0/include -I/mesos/build/3rdparty/gmock-1.7.0/src/gmock-1.7.0/gtest/include    -o CMakeFiles/stout_tests.dir/interval_tests.cpp.o -c /mesos/3rdparty/stout/tests/interval_tests.cpp
/usr/bin/cmake -E cmake_progress_report /mesos/build/CMakeFiles 
[ 56%] Building CXX object 3rdparty/libprocess/src/CMakeFiles/process-0.0.1.dir/latch.cpp.o
cd /mesos/build/3rdparty/libprocess/src && /usr/bin/clang++-3.5   -DHAS_AUTHENTICATION=1 -DLIBDIR=\"/usr/local/libmesos\" -DPICOJSON_USE_INT64 -DPKGDATADIR=\"/usr/local/share/mesos\" -DPKGLIBEXECDIR=\"/usr/local/libexec/mesos\" -DVERSION=\"1.2.0\" -D__STDC_FORMAT_MACROS -std=c++11 -g -I/mesos/3rdparty/stout/include -I/usr/include/apr-1.0 -I/mesos/build/3rdparty/boost-1.53.0/src/boost-1.53.0 -I/mesos/build/3rdparty/elfio-3.2/src/elfio-3.2 -I/mesos/build/3rdparty/glog-0.3.3/src/glog-0.3.3-lib/lib/include -I/mesos/build/3rdparty/nvml-352.79/src/nvml-352.79 -I/mesos/build/3rdparty/picojson-1.3.0/src/picojson-1.3.0 -I/mesos/build/3rdparty/protobuf-2.6.1/src/protobuf-2.6.1-lib/lib/include -I/usr/include/subversion-1 -I/mesos/3rdparty/libprocess/src/src -I/mesos/3rdparty/libprocess/include -I/mesos/build/3rdparty/http_parser-2.6.2/src/http_parser-2.6.2 -I/mesos/build/3rdparty/libevent-2.1.5-beta/src/libevent-2.1.5-beta-lib/lib/include    -fPIC -o CMakeFiles/process-0.0.1.dir/latch.cpp.o -c /mesos/3rdparty/libprocess/src/latch.cpp
/usr/bin/cmake -E cmake_progress_report /mesos/build/CMakeFiles 
[ 56%] Building CXX object 3rdparty/libprocess/src/CMakeFiles/process-0.0.1.dir/logging.cpp.o
cd /mesos/build/3rdparty/libprocess/src && /usr/bin/clang++-3.5   -DHAS_AUTHENTICATION=1 -DLIBDIR=\"/usr/local/libmesos\" -DPICOJSON_USE_INT64 -DPKGDATADIR=\"/usr/local/share/mesos\" -DPKGLIBEXECDIR=\"/usr/local/libexec/mesos\" -DVERSION=\"1.2.0\" -D__STDC_FORMAT_MACROS -std=c++11 -g -I/mesos/3rdparty/stout/include -I/usr/include/apr-1.0 -I/mesos/build/3rdparty/boost-1.53.0/src/boost-1.53.0 -I/mesos/build/3rdparty/elfio-3.2/src/elfio-3.2 -I/mesos/build/3rdparty/glog-0.3.3/src/glog-0.3.3-lib/lib/include -I/mesos/build/3rdparty/nvml-352.79/src/nvml-352.79 -I/mesos/build/3rdparty/picojson-1.3.0/src/picojson-1.3.0 -I/mesos/build/3rdparty/protobuf-2.6.1/src/protobuf-2.6.1-lib/lib/include -I/usr/include/subversion-1 -I/mesos/3rdparty/libprocess/src/src -I/mesos/3rdparty/libprocess/include -I/mesos/build/3rdparty/http_parser-2.6.2/src/http_parser-2.6.2 -I/mesos/build/3rdparty/libevent-2.1.5-beta/src/libevent-2.1.5-beta-lib/lib/include    -fPIC -o CMakeFiles/process-0.0.1.dir/logging.cpp.o -c /mesos/3rdparty/libprocess/src/logging.cpp
/usr/bin/cmake -E cmake_progress_report /mesos/build/CMakeFiles 77
[ 59%] Building CXX object 3rdparty/libprocess/src/CMakeFiles/process-0.0.1.dir/metrics/metrics.cpp.o
cd /mesos/build/3rdparty/libprocess/src && /usr/bin/clang++-3.5   -DHAS_AUTHENTICATION=1 -DLIBDIR=\"/usr/local/libmesos\" -DPICOJSON_USE_INT64 -DPKGDATADIR=\"/usr/local/share/mesos\" -DPKGLIBEXECDIR=\"/usr/local/libexec/mesos\" -DVERSION=\"1.2.0\" -D__STDC_FORMAT_MACROS -std=c++11 -g -I/mesos/3rdparty/stout/include -I/usr/include/apr-1.0 -I/mesos/build/3rdparty/boost-1.53.0/src/boost-1.53.0 -I/mesos/build/3rdparty/elfio-3.2/src/elfio-3.2 -I/mesos/build/3rdparty/glog-0.3.3/src/glog-0.3.3-lib/lib/include -I/mesos/build/3rdparty/nvml-352.79/src/nvml-352.79 -I/mesos/build/3rdparty/picojson-1.3.0/src/picojson-1.3.0 -I/mesos/build/3rdparty/protobuf-2.6.1/src/protobuf-2.6.1-lib/lib/include -I/usr/include/subversion-1 -I/mesos/3rdparty/libprocess/src/src -I/mesos/3rdparty/libprocess/include -I/mesos/build/3rdparty/http_parser-2.6.2/src/http_parser-2.6.2 -I/mesos/build/3rdparty/libevent-2.1.5-beta/src/libevent-2.1.5-beta-lib/lib/include    -fPIC -o CMakeFiles/process-0.0.1.dir/metrics/metrics.cpp.o -c /mesos/3rdparty/libprocess/src/metrics/metrics.cpp
/usr/bin/cmake -E cmake_progress_report /mesos/build/CMakeFiles 
[ 59%] Building CXX object 3rdparty/libprocess/src/CMakeFiles/process-0.0.1.dir/pid.cpp.o
cd /mesos/build/3rdparty/libprocess/src && /usr/bin/clang++-3.5   -DHAS_AUTHENTICATION=1 -DLIBDIR=\"/usr/local/libmesos\" -DPICOJSON_USE_INT64 -DPKGDATADIR=\"/usr/local/share/mesos\" -DPKGLIBEXECDIR=\"/usr/local/libexec/mesos\" -DVERSION=\"1.2.0\" -D__STDC_FORMAT_MACROS -std=c++11 -g -I/mesos/3rdparty/stout/include -I/usr/include/apr-1.0 -I/mesos/build/3rdparty/boost-1.53.0/src/boost-1.53.0 -I/mesos/build/3rdparty/elfio-3.2/src/elfio-3.2 -I/mesos/build/3rdparty/glog-0.3.3/src/glog-0.3.3-lib/lib/include -I/mesos/build/3rdparty/nvml-352.79/src/nvml-352.79 -I/mesos/build/3rdparty/picojson-1.3.0/src/picojson-1.3.0 -I/mesos/build/3rdparty/protobuf-2.6.1/src/protobuf-2.6.1-lib/lib/include -I/usr/include/subversion-1 -I/mesos/3rdparty/libprocess/src/src -I/mesos/3rdparty/libprocess/include -I/mesos/build/3rdparty/http_parser-2.6.2/src/http_parser-2.6.2 -I/mesos/build/3rdparty/libevent-2.1.5-beta/src/libevent-2.1.5-beta-lib/lib/include    -fPIC -o CMakeFiles/process-0.0.1.dir/pid.cpp.o -c /mesos/3rdparty/libprocess/src/pid.cpp
/usr/bin/cmake -E cmake_progress_report /mesos/build/CMakeFiles 
[ 59%] Building CXX object 3rdparty/stout/tests/CMakeFiles/stout_tests.dir/ip_tests.cpp.o
cd /mesos/build/3rdparty/stout/tests && /usr/bin/clang++-3.5   -DHAS_AUTHENTICATION=1 -DLIBDIR=\"/usr/local/libmesos\" -DPICOJSON_USE_INT64 -DPKGDATADIR=\"/usr/local/share/mesos\" -DPKGLIBEXECDIR=\"/usr/local/libexec/mesos\" -DVERSION=\"1.2.0\" -D__STDC_FORMAT_MACROS -std=c++11 -g -I/mesos/3rdparty/stout/include -I/usr/include/apr-1.0 -I/mesos/build/3rdparty/boost-1.53.0/src/boost-1.53.0 -I/mesos/build/3rdparty/elfio-3.2/src/elfio-3.2 -I/mesos/build/3rdparty/glog-0.3.3/src/glog-0.3.3-lib/lib/include -I/mesos/build/3rdparty/nvml-352.79/src/nvml-352.79 -I/mesos/build/3rdparty/picojson-1.3.0/src/picojson-1.3.0 -I/mesos/build/3rdparty/protobuf-2.6.1/src/protobuf-2.6.1-lib/lib/include -I/usr/include/subversion-1 -I/mesos/3rdparty/stout/tests/src -I/mesos/build/3rdparty/gmock-1.7.0/src/gmock-1.7.0/include -I/mesos/build/3rdparty/gmock-1.7.0/src/gmock-1.7.0/gtest/include    -o CMakeFiles/stout_tests.dir/ip_tests.cpp.o -c /mesos/3rdparty/stout/tests/ip_tests.cpp
/usr/bin/cmake -E cmake_progress_report /mesos/build/CMakeFiles 89
[ 62%] Building CXX object 3rdparty/stout/tests/CMakeFiles/stout_tests.dir/json_tests.cpp.o
cd /mesos/build/3rdparty/stout/tests && /usr/bin/clang++-3.5   -DHAS_AUTHENTICATION=1 -DLIBDIR=\"/usr/local/libmesos\" -DPICOJSON_USE_INT64 -DPKGDATADIR=\"/usr/local/share/mesos\" -DPKGLIBEXECDIR=\"/usr/local/libexec/mesos\" -DVERSION=\"1.2.0\" -D__STDC_FORMAT_MACROS -std=c++11 -g -I/mesos/3rdparty/stout/include -I/usr/include/apr-1.0 -I/mesos/build/3rdparty/boost-1.53.0/src/boost-1.53.0 -I/mesos/build/3rdparty/elfio-3.2/src/elfio-3.2 -I/mesos/build/3rdparty/glog-0.3.3/src/glog-0.3.3-lib/lib/include -I/mesos/build/3rdparty/nvml-352.79/src/nvml-352.79 -I/mesos/build/3rdparty/picojson-1.3.0/src/picojson-1.3.0 -I/mesos/build/3rdparty/protobuf-2.6.1/src/protobuf-2.6.1-lib/lib/include -I/usr/include/subversion-1 -I/mesos/3rdparty/stout/tests/src -I/mesos/build/3rdparty/gmock-1.7.0/src/gmock-1.7.0/include -I/mesos/build/3rdparty/gmock-1.7.0/src/gmock-1.7.0/gtest/include    -o CMakeFiles/stout_tests.dir/json_tests.cpp.o -c /mesos/3rdparty/stout/tests/json_tests.cpp
/usr/bin/cmake -E cmake_progress_report /mesos/build/CMakeFiles 
[ 62%] Building CXX object 3rdparty/stout/tests/CMakeFiles/stout_tests.dir/jsonify_tests.cpp.o
cd /mesos/build/3rdparty/stout/tests && /usr/bin/clang++-3.5   -DHAS_AUTHENTICATION=1 -DLIBDIR=\"/usr/local/libmesos\" -DPICOJSON_USE_INT64 -DPKGDATADIR=\"/usr/local/share/mesos\" -DPKGLIBEXECDIR=\"/usr/local/libexec/mesos\" -DVERSION=\"1.2.0\" -D__STDC_FORMAT_MACROS -std=c++11 -g -I/mesos/3rdparty/stout/include -I/usr/include/apr-1.0 -I/mesos/build/3rdparty/boost-1.53.0/src/boost-1.53.0 -I/mesos/build/3rdparty/elfio-3.2/src/elfio-3.2 -I/mesos/build/3rdparty/glog-0.3.3/src/glog-0.3.3-lib/lib/include -I/mesos/build/3rdparty/nvml-352.79/src/nvml-352.79 -I/mesos/build/3rdparty/picojson-1.3.0/src/picojson-1.3.0 -I/mesos/build/3rdparty/protobuf-2.6.1/src/protobuf-2.6.1-lib/lib/include -I/usr/include/subversion-1 -I/mesos/3rdparty/stout/tests/src -I/mesos/build/3rdparty/gmock-1.7.0/src/gmock-1.7.0/include -I/mesos/build/3rdparty/gmock-1.7.0/src/gmock-1.7.0/gtest/include    -o CMakeFiles/stout_tests.dir/jsonify_tests.cpp.o -c /mesos/3rdparty/stout/tests/jsonify_tests.cpp
/usr/bin/cmake -E cmake_progress_report /mesos/build/CMakeFiles 
[ 62%] Building CXX object 3rdparty/stout/tests/CMakeFiles/stout_tests.dir/linkedhashmap_tests.cpp.o
cd /mesos/build/3rdparty/stout/tests && /usr/bin/clang++-3.5   -DHAS_AUTHENTICATION=1 -DLIBDIR=\"/usr/local/libmesos\" -DPICOJSON_USE_INT64 -DPKGDATADIR=\"/usr/local/share/mesos\" -DPKGLIBEXECDIR=\"/usr/local/libexec/mesos\" -DVERSION=\"1.2.0\" -D__STDC_FORMAT_MACROS -std=c++11 -g -I/mesos/3rdparty/stout/include -I/usr/include/apr-1.0 -I/mesos/build/3rdparty/boost-1.53.0/src/boost-1.53.0 -I/mesos/build/3rdparty/elfio-3.2/src/elfio-3.2 -I/mesos/build/3rdparty/glog-0.3.3/src/glog-0.3.3-lib/lib/include -I/mesos/build/3rdparty/nvml-352.79/src/nvml-352.79 -I/mesos/build/3rdparty/picojson-1.3.0/src/picojson-1.3.0 -I/mesos/build/3rdparty/protobuf-2.6.1/src/protobuf-2.6.1-lib/lib/include -I/usr/include/subversion-1 -I/mesos/3rdparty/stout/tests/src -I/mesos/build/3rdparty/gmock-1.7.0/src/gmock-1.7.0/include -I/mesos/build/3rdparty/gmock-1.7.0/src/gmock-1.7.0/gtest/include    -o CMakeFiles/stout_tests.dir/linkedhashmap_tests.cpp.o -c /mesos/3rdparty/stout/tests/linkedhashmap_tests.cpp
/usr/bin/cmake -E cmake_progress_report /mesos/build/CMakeFiles 
[ 62%] Building CXX object 3rdparty/stout/tests/CMakeFiles/stout_tests.dir/mac_tests.cpp.o
cd /mesos/build/3rdparty/stout/tests && /usr/bin/clang++-3.5   -DHAS_AUTHENTICATION=1 -DLIBDIR=\"/usr/local/libmesos\" -DPICOJSON_USE_INT64 -DPKGDATADIR=\"/usr/local/share/mesos\" -DPKGLIBEXECDIR=\"/usr/local/libexec/mesos\" -DVERSION=\"1.2.0\" -D__STDC_FORMAT_MACROS -std=c++11 -g -I/mesos/3rdparty/stout/include -I/usr/include/apr-1.0 -I/mesos/build/3rdparty/boost-1.53.0/src/boost-1.53.0 -I/mesos/build/3rdparty/elfio-3.2/src/elfio-3.2 -I/mesos/build/3rdparty/glog-0.3.3/src/glog-0.3.3-lib/lib/include -I/mesos/build/3rdparty/nvml-352.79/src/nvml-352.79 -I/mesos/build/3rdparty/picojson-1.3.0/src/picojson-1.3.0 -I/mesos/build/3rdparty/protobuf-2.6.1/src/protobuf-2.6.1-lib/lib/include -I/usr/include/subversion-1 -I/mesos/3rdparty/stout/tests/src -I/mesos/build/3rdparty/gmock-1.7.0/src/gmock-1.7.0/include -I/mesos/build/3rdparty/gmock-1.7.0/src/gmock-1.7.0/gtest/include    -o CMakeFiles/stout_tests.dir/mac_tests.cpp.o -c /mesos/3rdparty/stout/tests/mac_tests.cpp
/usr/bin/cmake -E cmake_progress_report /mesos/build/CMakeFiles 
[ 62%] Building CXX object 3rdparty/libprocess/src/CMakeFiles/process-0.0.1.dir/poll_socket.cpp.o
cd /mesos/build/3rdparty/libprocess/src && /usr/bin/clang++-3.5   -DHAS_AUTHENTICATION=1 -DLIBDIR=\"/usr/local/libmesos\" -DPICOJSON_USE_INT64 -DPKGDATADIR=\"/usr/local/share/mesos\" -DPKGLIBEXECDIR=\"/usr/local/libexec/mesos\" -DVERSION=\"1.2.0\" -D__STDC_FORMAT_MACROS -std=c++11 -g -I/mesos/3rdparty/stout/include -I/usr/include/apr-1.0 -I/mesos/build/3rdparty/boost-1.53.0/src/boost-1.53.0 -I/mesos/build/3rdparty/elfio-3.2/src/elfio-3.2 -I/mesos/build/3rdparty/glog-0.3.3/src/glog-0.3.3-lib/lib/include -I/mesos/build/3rdparty/nvml-352.79/src/nvml-352.79 -I/mesos/build/3rdparty/picojson-1.3.0/src/picojson-1.3.0 -I/mesos/build/3rdparty/protobuf-2.6.1/src/protobuf-2.6.1-lib/lib/include -I/usr/include/subversion-1 -I/mesos/3rdparty/libprocess/src/src -I/mesos/3rdparty/libprocess/include -I/mesos/build/3rdparty/http_parser-2.6.2/src/http_parser-2.6.2 -I/mesos/build/3rdparty/libevent-2.1.5-beta/src/libevent-2.1.5-beta-lib/lib/include    -fPIC -o CMakeFiles/process-0.0.1.dir/poll_socket.cpp.o -c /mesos/3rdparty/libprocess/src/poll_socket.cpp
/usr/bin/cmake -E cmake_progress_report /mesos/build/CMakeFiles 
[ 62%] Building CXX object 3rdparty/libprocess/src/CMakeFiles/process-0.0.1.dir/profiler.cpp.o
cd /mesos/build/3rdparty/libprocess/src && /usr/bin/clang++-3.5   -DHAS_AUTHENTICATION=1 -DLIBDIR=\"/usr/local/libmesos\" -DPICOJSON_USE_INT64 -DPKGDATADIR=\"/usr/local/share/mesos\" -DPKGLIBEXECDIR=\"/usr/local/libexec/mesos\" -DVERSION=\"1.2.0\" -D__STDC_FORMAT_MACROS -std=c++11 -g -I/mesos/3rdparty/stout/include -I/usr/include/apr-1.0 -I/mesos/build/3rdparty/boost-1.53.0/src/boost-1.53.0 -I/mesos/build/3rdparty/elfio-3.2/src/elfio-3.2 -I/mesos/build/3rdparty/glog-0.3.3/src/glog-0.3.3-lib/lib/include -I/mesos/build/3rdparty/nvml-352.79/src/nvml-352.79 -I/mesos/build/3rdparty/picojson-1.3.0/src/picojson-1.3.0 -I/mesos/build/3rdparty/protobuf-2.6.1/src/protobuf-2.6.1-lib/lib/include -I/usr/include/subversion-1 -I/mesos/3rdparty/libprocess/src/src -I/mesos/3rdparty/libprocess/include -I/mesos/build/3rdparty/http_parser-2.6.2/src/http_parser-2.6.2 -I/mesos/build/3rdparty/libevent-2.1.5-beta/src/libevent-2.1.5-beta-lib/lib/include    -fPIC -o CMakeFiles/process-0.0.1.dir/profiler.cpp.o -c /mesos/3rdparty/libprocess/src/profiler.cpp
/usr/bin/cmake -E cmake_progress_report /mesos/build/CMakeFiles 
[ 62%] Building CXX object 3rdparty/stout/tests/CMakeFiles/stout_tests.dir/main.cpp.o
cd /mesos/build/3rdparty/stout/tests && /usr/bin/clang++-3.5   -DHAS_AUTHENTICATION=1 -DLIBDIR=\"/usr/local/libmesos\" -DPICOJSON_USE_INT64 -DPKGDATADIR=\"/usr/local/share/mesos\" -DPKGLIBEXECDIR=\"/usr/local/libexec/mesos\" -DVERSION=\"1.2.0\" -D__STDC_FORMAT_MACROS -std=c++11 -g -I/mesos/3rdparty/stout/include -I/usr/include/apr-1.0 -I/mesos/build/3rdparty/boost-1.53.0/src/boost-1.53.0 -I/mesos/build/3rdparty/elfio-3.2/src/elfio-3.2 -I/mesos/build/3rdparty/glog-0.3.3/src/glog-0.3.3-lib/lib/include -I/mesos/build/3rdparty/nvml-352.79/src/nvml-352.79 -I/mesos/build/3rdparty/picojson-1.3.0/src/picojson-1.3.0 -I/mesos/build/3rdparty/protobuf-2.6.1/src/protobuf-2.6.1-lib/lib/include -I/usr/include/subversion-1 -I/mesos/3rdparty/stout/tests/src -I/mesos/build/3rdparty/gmock-1.7.0/src/gmock-1.7.0/include -I/mesos/build/3rdparty/gmock-1.7.0/src/gmock-1.7.0/gtest/include    -o CMakeFiles/stout_tests.dir/main.cpp.o -c /mesos/3rdparty/stout/tests/main.cpp
/usr/bin/cmake -E cmake_progress_report /mesos/build/CMakeFiles 
[ 62%] Building CXX object 3rdparty/libprocess/src/CMakeFiles/process-0.0.1.dir/process.cpp.o
cd /mesos/build/3rdparty/libprocess/src && /usr/bin/clang++-3.5   -DHAS_AUTHENTICATION=1 -DLIBDIR=\"/usr/local/libmesos\" -DPICOJSON_USE_INT64 -DPKGDATADIR=\"/usr/local/share/mesos\" -DPKGLIBEXECDIR=\"/usr/local/libexec/mesos\" -DVERSION=\"1.2.0\" -D__STDC_FORMAT_MACROS -std=c++11 -g -I/mesos/3rdparty/stout/include -I/usr/include/apr-1.0 -I/mesos/build/3rdparty/boost-1.53.0/src/boost-1.53.0 -I/mesos/build/3rdparty/elfio-3.2/src/elfio-3.2 -I/mesos/build/3rdparty/glog-0.3.3/src/glog-0.3.3-lib/lib/include -I/mesos/build/3rdparty/nvml-352.79/src/nvml-352.79 -I/mesos/build/3rdparty/picojson-1.3.0/src/picojson-1.3.0 -I/mesos/build/3rdparty/protobuf-2.6.1/src/protobuf-2.6.1-lib/lib/include -I/usr/include/subversion-1 -I/mesos/3rdparty/libprocess/src/src -I/mesos/3rdparty/libprocess/include -I/mesos/build/3rdparty/http_parser-2.6.2/src/http_parser-2.6.2 -I/mesos/build/3rdparty/libevent-2.1.5-beta/src/libevent-2.1.5-beta-lib/lib/include    -fPIC -o CMakeFiles/process-0.0.1.dir/process.cpp.o -c /mesos/3rdparty/libprocess/src/process.cpp
/usr/bin/cmake -E cmake_progress_report /mesos/build/CMakeFiles 78
[ 64%] Building CXX object 3rdparty/libprocess/src/CMakeFiles/process-0.0.1.dir/reap.cpp.o
cd /mesos/build/3rdparty/libprocess/src && /usr/bin/clang++-3.5   -DHAS_AUTHENTICATION=1 -DLIBDIR=\"/usr/local/libmesos\" -DPICOJSON_USE_INT64 -DPKGDATADIR=\"/usr/local/share/mesos\" -DPKGLIBEXECDIR=\"/usr/local/libexec/mesos\" -DVERSION=\"1.2.0\" -D__STDC_FORMAT_MACROS -std=c++11 -g -I/mesos/3rdparty/stout/include -I/usr/include/apr-1.0 -I/mesos/build/3rdparty/boost-1.53.0/src/boost-1.53.0 -I/mesos/build/3rdparty/elfio-3.2/src/elfio-3.2 -I/mesos/build/3rdparty/glog-0.3.3/src/glog-0.3.3-lib/lib/include -I/mesos/build/3rdparty/nvml-352.79/src/nvml-352.79 -I/mesos/build/3rdparty/picojson-1.3.0/src/picojson-1.3.0 -I/mesos/build/3rdparty/protobuf-2.6.1/src/protobuf-2.6.1-lib/lib/include -I/usr/include/subversion-1 -I/mesos/3rdparty/libprocess/src/src -I/mesos/3rdparty/libprocess/include -I/mesos/build/3rdparty/http_parser-2.6.2/src/http_parser-2.6.2 -I/mesos/build/3rdparty/libevent-2.1.5-beta/src/libevent-2.1.5-beta-lib/lib/include    -fPIC -o CMakeFiles/process-0.0.1.dir/reap.cpp.o -c /mesos/3rdparty/libprocess/src/reap.cpp
/usr/bin/cmake -E cmake_progress_report /mesos/build/CMakeFiles 90
[ 67%] Building CXX object 3rdparty/stout/tests/CMakeFiles/stout_tests.dir/multimap_tests.cpp.o
cd /mesos/build/3rdparty/stout/tests && /usr/bin/clang++-3.5   -DHAS_AUTHENTICATION=1 -DLIBDIR=\"/usr/local/libmesos\" -DPICOJSON_USE_INT64 -DPKGDATADIR=\"/usr/local/share/mesos\" -DPKGLIBEXECDIR=\"/usr/local/libexec/mesos\" -DVERSION=\"1.2.0\" -D__STDC_FORMAT_MACROS -std=c++11 -g -I/mesos/3rdparty/stout/include -I/usr/include/apr-1.0 -I/mesos/build/3rdparty/boost-1.53.0/src/boost-1.53.0 -I/mesos/build/3rdparty/elfio-3.2/src/elfio-3.2 -I/mesos/build/3rdparty/glog-0.3.3/src/glog-0.3.3-lib/lib/include -I/mesos/build/3rdparty/nvml-352.79/src/nvml-352.79 -I/mesos/build/3rdparty/picojson-1.3.0/src/picojson-1.3.0 -I/mesos/build/3rdparty/protobuf-2.6.1/src/protobuf-2.6.1-lib/lib/include -I/usr/include/subversion-1 -I/mesos/3rdparty/stout/tests/src -I/mesos/build/3rdparty/gmock-1.7.0/src/gmock-1.7.0/include -I/mesos/build/3rdparty/gmock-1.7.0/src/gmock-1.7.0/gtest/include    -o CMakeFiles/stout_tests.dir/multimap_tests.cpp.o -c /mesos/3rdparty/stout/tests/multimap_tests.cpp
/usr/bin/cmake -E cmake_progress_report /mesos/build/CMakeFiles 
[ 67%] Building CXX object 3rdparty/libprocess/src/CMakeFiles/process-0.0.1.dir/socket.cpp.o
cd /mesos/build/3rdparty/libprocess/src && /usr/bin/clang++-3.5   -DHAS_AUTHENTICATION=1 -DLIBDIR=\"/usr/local/libmesos\" -DPICOJSON_USE_INT64 -DPKGDATADIR=\"/usr/local/share/mesos\" -DPKGLIBEXECDIR=\"/usr/local/libexec/mesos\" -DVERSION=\"1.2.0\" -D__STDC_FORMAT_MACROS -std=c++11 -g -I/mesos/3rdparty/stout/include -I/usr/include/apr-1.0 -I/mesos/build/3rdparty/boost-1.53.0/src/boost-1.53.0 -I/mesos/build/3rdparty/elfio-3.2/src/elfio-3.2 -I/mesos/build/3rdparty/glog-0.3.3/src/glog-0.3.3-lib/lib/include -I/mesos/build/3rdparty/nvml-352.79/src/nvml-352.79 -I/mesos/build/3rdparty/picojson-1.3.0/src/picojson-1.3.0 -I/mesos/build/3rdparty/protobuf-2.6.1/src/protobuf-2.6.1-lib/lib/include -I/usr/include/subversion-1 -I/mesos/3rdparty/libprocess/src/src -I/mesos/3rdparty/libprocess/include -I/mesos/build/3rdparty/http_parser-2.6.2/src/http_parser-2.6.2 -I/mesos/build/3rdparty/libevent-2.1.5-beta/src/libevent-2.1.5-beta-lib/lib/include    -fPIC -o CMakeFiles/process-0.0.1.dir/socket.cpp.o -c /mesos/3rdparty/libprocess/src/socket.cpp
/usr/bin/cmake -E cmake_progress_report /mesos/build/CMakeFiles 
[ 67%] Building CXX object 3rdparty/stout/tests/CMakeFiles/stout_tests.dir/none_tests.cpp.o
cd /mesos/build/3rdparty/stout/tests && /usr/bin/clang++-3.5   -DHAS_AUTHENTICATION=1 -DLIBDIR=\"/usr/local/libmesos\" -DPICOJSON_USE_INT64 -DPKGDATADIR=\"/usr/local/share/mesos\" -DPKGLIBEXECDIR=\"/usr/local/libexec/mesos\" -DVERSION=\"1.2.0\" -D__STDC_FORMAT_MACROS -std=c++11 -g -I/mesos/3rdparty/stout/include -I/usr/include/apr-1.0 -I/mesos/build/3rdparty/boost-1.53.0/src/boost-1.53.0 -I/mesos/build/3rdparty/elfio-3.2/src/elfio-3.2 -I/mesos/build/3rdparty/glog-0.3.3/src/glog-0.3.3-lib/lib/include -I/mesos/build/3rdparty/nvml-352.79/src/nvml-352.79 -I/mesos/build/3rdparty/picojson-1.3.0/src/picojson-1.3.0 -I/mesos/build/3rdparty/protobuf-2.6.1/src/protobuf-2.6.1-lib/lib/include -I/usr/include/subversion-1 -I/mesos/3rdparty/stout/tests/src -I/mesos/build/3rdparty/gmock-1.7.0/src/gmock-1.7.0/include -I/mesos/build/3rdparty/gmock-1.7.0/src/gmock-1.7.0/gtest/include    -o CMakeFiles/stout_tests.dir/none_tests.cpp.o -c /mesos/3rdparty/stout/tests/none_tests.cpp
/usr/bin/cmake -E cmake_progress_report /mesos/build/CMakeFiles 
[ 67%] Building CXX object 3rdparty/libprocess/src/CMakeFiles/process-0.0.1.dir/subprocess.cpp.o
cd /mesos/build/3rdparty/libprocess/src && /usr/bin/clang++-3.5   -DHAS_AUTHENTICATION=1 -DLIBDIR=\"/usr/local/libmesos\" -DPICOJSON_USE_INT64 -DPKGDATADIR=\"/usr/local/share/mesos\" -DPKGLIBEXECDIR=\"/usr/local/libexec/mesos\" -DVERSION=\"1.2.0\" -D__STDC_FORMAT_MACROS -std=c++11 -g -I/mesos/3rdparty/stout/include -I/usr/include/apr-1.0 -I/mesos/build/3rdparty/boost-1.53.0/src/boost-1.53.0 -I/mesos/build/3rdparty/elfio-3.2/src/elfio-3.2 -I/mesos/build/3rdparty/glog-0.3.3/src/glog-0.3.3-lib/lib/include -I/mesos/build/3rdparty/nvml-352.79/src/nvml-352.79 -I/mesos/build/3rdparty/picojson-1.3.0/src/picojson-1.3.0 -I/mesos/build/3rdparty/protobuf-2.6.1/src/protobuf-2.6.1-lib/lib/include -I/usr/include/subversion-1 -I/mesos/3rdparty/libprocess/src/src -I/mesos/3rdparty/libprocess/include -I/mesos/build/3rdparty/http_parser-2.6.2/src/http_parser-2.6.2 -I/mesos/build/3rdparty/libevent-2.1.5-beta/src/libevent-2.1.5-beta-lib/lib/include    -fPIC -o CMakeFiles/process-0.0.1.dir/subprocess.cpp.o -c /mesos/3rdparty/libprocess/src/subprocess.cpp
/usr/bin/cmake -E cmake_progress_report /mesos/build/CMakeFiles 
[ 67%] Building CXX object 3rdparty/stout/tests/CMakeFiles/stout_tests.dir/numify_tests.cpp.o
cd /mesos/build/3rdparty/stout/tests && /usr/bin/clang++-3.5   -DHAS_AUTHENTICATION=1 -DLIBDIR=\"/usr/local/libmesos\" -DPICOJSON_USE_INT64 -DPKGDATADIR=\"/usr/local/share/mesos\" -DPKGLIBEXECDIR=\"/usr/local/libexec/mesos\" -DVERSION=\"1.2.0\" -D__STDC_FORMAT_MACROS -std=c++11 -g -I/mesos/3rdparty/stout/include -I/usr/include/apr-1.0 -I/mesos/build/3rdparty/boost-1.53.0/src/boost-1.53.0 -I/mesos/build/3rdparty/elfio-3.2/src/elfio-3.2 -I/mesos/build/3rdparty/glog-0.3.3/src/glog-0.3.3-lib/lib/include -I/mesos/build/3rdparty/nvml-352.79/src/nvml-352.79 -I/mesos/build/3rdparty/picojson-1.3.0/src/picojson-1.3.0 -I/mesos/build/3rdparty/protobuf-2.6.1/src/protobuf-2.6.1-lib/lib/include -I/usr/include/subversion-1 -I/mesos/3rdparty/stout/tests/src -I/mesos/build/3rdparty/gmock-1.7.0/src/gmock-1.7.0/include -I/mesos/build/3rdparty/gmock-1.7.0/src/gmock-1.7.0/gtest/include    -o CMakeFiles/stout_tests.dir/numify_tests.cpp.o -c /mesos/3rdparty/stout/tests/numify_tests.cpp
/usr/bin/cmake -E cmake_progress_report /mesos/build/CMakeFiles 
[ 67%] Building CXX object 3rdparty/libprocess/src/CMakeFiles/process-0.0.1.dir/time.cpp.o
cd /mesos/build/3rdparty/libprocess/src && /usr/bin/clang++-3.5   -DHAS_AUTHENTICATION=1 -DLIBDIR=\"/usr/local/libmesos\" -DPICOJSON_USE_INT64 -DPKGDATADIR=\"/usr/local/share/mesos\" -DPKGLIBEXECDIR=\"/usr/local/libexec/mesos\" -DVERSION=\"1.2.0\" -D__STDC_FORMAT_MACROS -std=c++11 -g -I/mesos/3rdparty/stout/include -I/usr/include/apr-1.0 -I/mesos/build/3rdparty/boost-1.53.0/src/boost-1.53.0 -I/mesos/build/3rdparty/elfio-3.2/src/elfio-3.2 -I/mesos/build/3rdparty/glog-0.3.3/src/glog-0.3.3-lib/lib/include -I/mesos/build/3rdparty/nvml-352.79/src/nvml-352.79 -I/mesos/build/3rdparty/picojson-1.3.0/src/picojson-1.3.0 -I/mesos/build/3rdparty/protobuf-2.6.1/src/protobuf-2.6.1-lib/lib/include -I/usr/include/subversion-1 -I/mesos/3rdparty/libprocess/src/src -I/mesos/3rdparty/libprocess/include -I/mesos/build/3rdparty/http_parser-2.6.2/src/http_parser-2.6.2 -I/mesos/build/3rdparty/libevent-2.1.5-beta/src/libevent-2.1.5-beta-lib/lib/include    -fPIC -o CMakeFiles/process-0.0.1.dir/time.cpp.o -c /mesos/3rdparty/libprocess/src/time.cpp
/usr/bin/cmake -E cmake_progress_report /mesos/build/CMakeFiles 
[ 67%] Building CXX object 3rdparty/stout/tests/CMakeFiles/stout_tests.dir/option_tests.cpp.o
cd /mesos/build/3rdparty/stout/tests && /usr/bin/clang++-3.5   -DHAS_AUTHENTICATION=1 -DLIBDIR=\"/usr/local/libmesos\" -DPICOJSON_USE_INT64 -DPKGDATADIR=\"/usr/local/share/mesos\" -DPKGLIBEXECDIR=\"/usr/local/libexec/mesos\" -DVERSION=\"1.2.0\" -D__STDC_FORMAT_MACROS -std=c++11 -g -I/mesos/3rdparty/stout/include -I/usr/include/apr-1.0 -I/mesos/build/3rdparty/boost-1.53.0/src/boost-1.53.0 -I/mesos/build/3rdparty/elfio-3.2/src/elfio-3.2 -I/mesos/build/3rdparty/glog-0.3.3/src/glog-0.3.3-lib/lib/include -I/mesos/build/3rdparty/nvml-352.79/src/nvml-352.79 -I/mesos/build/3rdparty/picojson-1.3.0/src/picojson-1.3.0 -I/mesos/build/3rdparty/protobuf-2.6.1/src/protobuf-2.6.1-lib/lib/include -I/usr/include/subversion-1 -I/mesos/3rdparty/stout/tests/src -I/mesos/build/3rdparty/gmock-1.7.0/src/gmock-1.7.0/include -I/mesos/build/3rdparty/gmock-1.7.0/src/gmock-1.7.0/gtest/include    -o CMakeFiles/stout_tests.dir/option_tests.cpp.o -c /mesos/3rdparty/stout/tests/option_tests.cpp
/usr/bin/cmake -E cmake_progress_report /mesos/build/CMakeFiles 91
[ 70%] Building CXX object 3rdparty/stout/tests/CMakeFiles/stout_tests.dir/os_tests.cpp.o
cd /mesos/build/3rdparty/stout/tests && /usr/bin/clang++-3.5   -DHAS_AUTHENTICATION=1 -DLIBDIR=\"/usr/local/libmesos\" -DPICOJSON_USE_INT64 -DPKGDATADIR=\"/usr/local/share/mesos\" -DPKGLIBEXECDIR=\"/usr/local/libexec/mesos\" -DVERSION=\"1.2.0\" -D__STDC_FORMAT_MACROS -std=c++11 -g -I/mesos/3rdparty/stout/include -I/usr/include/apr-1.0 -I/mesos/build/3rdparty/boost-1.53.0/src/boost-1.53.0 -I/mesos/build/3rdparty/elfio-3.2/src/elfio-3.2 -I/mesos/build/3rdparty/glog-0.3.3/src/glog-0.3.3-lib/lib/include -I/mesos/build/3rdparty/nvml-352.79/src/nvml-352.79 -I/mesos/build/3rdparty/picojson-1.3.0/src/picojson-1.3.0 -I/mesos/build/3rdparty/protobuf-2.6.1/src/protobuf-2.6.1-lib/lib/include -I/usr/include/subversion-1 -I/mesos/3rdparty/stout/tests/src -I/mesos/build/3rdparty/gmock-1.7.0/src/gmock-1.7.0/include -I/mesos/build/3rdparty/gmock-1.7.0/src/gmock-1.7.0/gtest/include    -o CMakeFiles/stout_tests.dir/os_tests.cpp.o -c /mesos/3rdparty/stout/tests/os_tests.cpp
In file included from /mesos/3rdparty/libprocess/src/process.cpp:64:
In file included from /mesos/3rdparty/libprocess/include/process/check.hpp:21:
/mesos/3rdparty/libprocess/include/process/future.hpp:918:3: error: no matching member function for call to 'set'
  set(u);
  ^~~
/mesos/3rdparty/libprocess/src/process.cpp:678:10: note: in instantiation of function template specialization 'process::Future<process::Owned<process::http::Request> >::Future<process::Future<const process::Owned<process::http::Request> > >' requested here
  return pipeRequest->reader->readAll()
         ^
/mesos/3rdparty/libprocess/include/process/future.hpp:463:8: note: candidate function not viable: no known conversion from 'const process::Future<const process::Owned<process::http::Request> >' to 'const process::Owned<process::http::Request>' for 1st argument
  bool set(const T& _t);
       ^
/mesos/3rdparty/libprocess/include/process/future.hpp:464:8: note: candidate function not viable: no known conversion from 'const process::Future<const process::Owned<process::http::Request> >' to 'process::Owned<process::http::Request>' for 1st argument
  bool set(T&& _t);
       ^
/usr/bin/cmake -E cmake_progress_report /mesos/build/CMakeFiles 79
[ 72%] Building CXX object 3rdparty/libprocess/src/CMakeFiles/process-0.0.1.dir/timeseries.cpp.o
cd /mesos/build/3rdparty/libprocess/src && /usr/bin/clang++-3.5   -DHAS_AUTHENTICATION=1 -DLIBDIR=\"/usr/local/libmesos\" -DPICOJSON_USE_INT64 -DPKGDATADIR=\"/usr/local/share/mesos\" -DPKGLIBEXECDIR=\"/usr/local/libexec/mesos\" -DVERSION=\"1.2.0\" -D__STDC_FORMAT_MACROS -std=c++11 -g -I/mesos/3rdparty/stout/include -I/usr/include/apr-1.0 -I/mesos/build/3rdparty/boost-1.53.0/src/boost-1.53.0 -I/mesos/build/3rdparty/elfio-3.2/src/elfio-3.2 -I/mesos/build/3rdparty/glog-0.3.3/src/glog-0.3.3-lib/lib/include -I/mesos/build/3rdparty/nvml-352.79/src/nvml-352.79 -I/mesos/build/3rdparty/picojson-1.3.0/src/picojson-1.3.0 -I/mesos/build/3rdparty/protobuf-2.6.1/src/protobuf-2.6.1-lib/lib/include -I/usr/include/subversion-1 -I/mesos/3rdparty/libprocess/src/src -I/mesos/3rdparty/libprocess/include -I/mesos/build/3rdparty/http_parser-2.6.2/src/http_parser-2.6.2 -I/mesos/build/3rdparty/libevent-2.1.5-beta/src/libevent-2.1.5-beta-lib/lib/include    -fPIC -o CMakeFiles/process-0.0.1.dir/timeseries.cpp.o -c /mesos/3rdparty/libprocess/src/timeseries.cpp
/usr/bin/cmake -E cmake_progress_report /mesos/build/CMakeFiles 
[ 72%] Building CXX object 3rdparty/libprocess/src/CMakeFiles/process-0.0.1.dir/libevent.cpp.o
cd /mesos/build/3rdparty/libprocess/src && /usr/bin/clang++-3.5   -DHAS_AUTHENTICATION=1 -DLIBDIR=\"/usr/local/libmesos\" -DPICOJSON_USE_INT64 -DPKGDATADIR=\"/usr/local/share/mesos\" -DPKGLIBEXECDIR=\"/usr/local/libexec/mesos\" -DVERSION=\"1.2.0\" -D__STDC_FORMAT_MACROS -std=c++11 -g -I/mesos/3rdparty/stout/include -I/usr/include/apr-1.0 -I/mesos/build/3rdparty/boost-1.53.0/src/boost-1.53.0 -I/mesos/build/3rdparty/elfio-3.2/src/elfio-3.2 -I/mesos/build/3rdparty/glog-0.3.3/src/glog-0.3.3-lib/lib/include -I/mesos/build/3rdparty/nvml-352.79/src/nvml-352.79 -I/mesos/build/3rdparty/picojson-1.3.0/src/picojson-1.3.0 -I/mesos/build/3rdparty/protobuf-2.6.1/src/protobuf-2.6.1-lib/lib/include -I/usr/include/subversion-1 -I/mesos/3rdparty/libprocess/src/src -I/mesos/3rdparty/libprocess/include -I/mesos/build/3rdparty/http_parser-2.6.2/src/http_parser-2.6.2 -I/mesos/build/3rdparty/libevent-2.1.5-beta/src/libevent-2.1.5-beta-lib/lib/include    -fPIC -o CMakeFiles/process-0.0.1.dir/libevent.cpp.o -c /mesos/3rdparty/libprocess/src/libevent.cpp
/usr/bin/cmake -E cmake_progress_report /mesos/build/CMakeFiles 
[ 72%] Building CXX object 3rdparty/libprocess/src/CMakeFiles/process-0.0.1.dir/libevent_poll.cpp.o
cd /mesos/build/3rdparty/libprocess/src && /usr/bin/clang++-3.5   -DHAS_AUTHENTICATION=1 -DLIBDIR=\"/usr/local/libmesos\" -DPICOJSON_USE_INT64 -DPKGDATADIR=\"/usr/local/share/mesos\" -DPKGLIBEXECDIR=\"/usr/local/libexec/mesos\" -DVERSION=\"1.2.0\" -D__STDC_FORMAT_MACROS -std=c++11 -g -I/mesos/3rdparty/stout/include -I/usr/include/apr-1.0 -I/mesos/build/3rdparty/boost-1.53.0/src/boost-1.53.0 -I/mesos/build/3rdparty/elfio-3.2/src/elfio-3.2 -I/mesos/build/3rdparty/glog-0.3.3/src/glog-0.3.3-lib/lib/include -I/mesos/build/3rdparty/nvml-352.79/src/nvml-352.79 -I/mesos/build/3rdparty/picojson-1.3.0/src/picojson-1.3.0 -I/mesos/build/3rdparty/protobuf-2.6.1/src/protobuf-2.6.1-lib/lib/include -I/usr/include/subversion-1 -I/mesos/3rdparty/libprocess/src/src -I/mesos/3rdparty/libprocess/include -I/mesos/build/3rdparty/http_parser-2.6.2/src/http_parser-2.6.2 -I/mesos/build/3rdparty/libevent-2.1.5-beta/src/libevent-2.1.5-beta-lib/lib/include    -fPIC -o CMakeFiles/process-0.0.1.dir/libevent_poll.cpp.o -c /mesos/3rdparty/libprocess/src/libevent_poll.cpp
1 error generated.
/usr/bin/cmake -E cmake_progress_report /mesos/build/CMakeFiles 
make[3]: *** [3rdparty/libprocess/src/CMakeFiles/process-0.0.1.dir/process.cpp.o] Error 1
make[3]: *** Waiting for unfinished jobs....
[ 72%] Building CXX object 3rdparty/stout/tests/CMakeFiles/stout_tests.dir/os/env_tests.cpp.o
cd /mesos/build/3rdparty/stout/tests && /usr/bin/clang++-3.5   -DHAS_AUTHENTICATION=1 -DLIBDIR=\"/usr/local/libmesos\" -DPICOJSON_USE_INT64 -DPKGDATADIR=\"/usr/local/share/mesos\" -DPKGLIBEXECDIR=\"/usr/local/libexec/mesos\" -DVERSION=\"1.2.0\" -D__STDC_FORMAT_MACROS -std=c++11 -g -I/mesos/3rdparty/stout/include -I/usr/include/apr-1.0 -I/mesos/build/3rdparty/boost-1.53.0/src/boost-1.53.0 -I/mesos/build/3rdparty/elfio-3.2/src/elfio-3.2 -I/mesos/build/3rdparty/glog-0.3.3/src/glog-0.3.3-lib/lib/include -I/mesos/build/3rdparty/nvml-352.79/src/nvml-352.79 -I/mesos/build/3rdparty/picojson-1.3.0/src/picojson-1.3.0 -I/mesos/build/3rdparty/protobuf-2.6.1/src/protobuf-2.6.1-lib/lib/include -I/usr/include/subversion-1 -I/mesos/3rdparty/stout/tests/src -I/mesos/build/3rdparty/gmock-1.7.0/src/gmock-1.7.0/include -I/mesos/build/3rdparty/gmock-1.7.0/src/gmock-1.7.0/gtest/include    -o CMakeFiles/stout_tests.dir/os/env_tests.cpp.o -c /mesos/3rdparty/stout/tests/os/env_tests.cpp
/usr/bin/cmake -E cmake_progress_report /mesos/build/CMakeFiles 
[ 72%] Building CXX object 3rdparty/stout/tests/CMakeFiles/stout_tests.dir/os/filesystem_tests.cpp.o
cd /mesos/build/3rdparty/stout/tests && /usr/bin/clang++-3.5   -DHAS_AUTHENTICATION=1 -DLIBDIR=\"/usr/local/libmesos\" -DPICOJSON_USE_INT64 -DPKGDATADIR=\"/usr/local/share/mesos\" -DPKGLIBEXECDIR=\"/usr/local/libexec/mesos\" -DVERSION=\"1.2.0\" -D__STDC_FORMAT_MACROS -std=c++11 -g -I/mesos/3rdparty/stout/include -I/usr/include/apr-1.0 -I/mesos/build/3rdparty/boost-1.53.0/src/boost-1.53.0 -I/mesos/build/3rdparty/elfio-3.2/src/elfio-3.2 -I/mesos/build/3rdparty/glog-0.3.3/src/glog-0.3.3-lib/lib/include -I/mesos/build/3rdparty/nvml-352.79/src/nvml-352.79 -I/mesos/build/3rdparty/picojson-1.3.0/src/picojson-1.3.0 -I/mesos/build/3rdparty/protobuf-2.6.1/src/protobuf-2.6.1-lib/lib/include -I/usr/include/subversion-1 -I/mesos/3rdparty/stout/tests/src -I/mesos/build/3rdparty/gmock-1.7.0/src/gmock-1.7.0/include -I/mesos/build/3rdparty/gmock-1.7.0/src/gmock-1.7.0/gtest/include    -o CMakeFiles/stout_tests.dir/os/filesystem_tests.cpp.o -c /mesos/3rdparty/stout/tests/os/filesystem_tests.cpp
/usr/bin/cmake -E cmake_progress_report /mesos/build/CMakeFiles 
[ 72%] Building CXX object 3rdparty/stout/tests/CMakeFiles/stout_tests.dir/os/process_tests.cpp.o
cd /mesos/build/3rdparty/stout/tests && /usr/bin/clang++-3.5   -DHAS_AUTHENTICATION=1 -DLIBDIR=\"/usr/local/libmesos\" -DPICOJSON_USE_INT64 -DPKGDATADIR=\"/usr/local/share/mesos\" -DPKGLIBEXECDIR=\"/usr/local/libexec/mesos\" -DVERSION=\"1.2.0\" -D__STDC_FORMAT_MACROS -std=c++11 -g -I/mesos/3rdparty/stout/include -I/usr/include/apr-1.0 -I/mesos/build/3rdparty/boost-1.53.0/src/boost-1.53.0 -I/mesos/build/3rdparty/elfio-3.2/src/elfio-3.2 -I/mesos/build/3rdparty/glog-0.3.3/src/glog-0.3.3-lib/lib/include -I/mesos/build/3rdparty/nvml-352.79/src/nvml-352.79 -I/mesos/build/3rdparty/picojson-1.3.0/src/picojson-1.3.0 -I/mesos/build/3rdparty/protobuf-2.6.1/src/protobuf-2.6.1-lib/lib/include -I/usr/include/subversion-1 -I/mesos/3rdparty/stout/tests/src -I/mesos/build/3rdparty/gmock-1.7.0/src/gmock-1.7.0/include -I/mesos/build/3rdparty/gmock-1.7.0/src/gmock-1.7.0/gtest/include    -o CMakeFiles/stout_tests.dir/os/process_tests.cpp.o -c /mesos/3rdparty/stout/tests/os/process_tests.cpp
/usr/bin/cmake -E cmake_progress_report /mesos/build/CMakeFiles 
[ 72%] Building CXX object 3rdparty/stout/tests/CMakeFiles/stout_tests.dir/os/rmdir_tests.cpp.o
cd /mesos/build/3rdparty/stout/tests && /usr/bin/clang++-3.5   -DHAS_AUTHENTICATION=1 -DLIBDIR=\"/usr/local/libmesos\" -DPICOJSON_USE_INT64 -DPKGDATADIR=\"/usr/local/share/mesos\" -DPKGLIBEXECDIR=\"/usr/local/libexec/mesos\" -DVERSION=\"1.2.0\" -D__STDC_FORMAT_MACROS -std=c++11 -g -I/mesos/3rdparty/stout/include -I/usr/include/apr-1.0 -I/mesos/build/3rdparty/boost-1.53.0/src/boost-1.53.0 -I/mesos/build/3rdparty/elfio-3.2/src/elfio-3.2 -I/mesos/build/3rdparty/glog-0.3.3/src/glog-0.3.3-lib/lib/include -I/mesos/build/3rdparty/nvml-352.79/src/nvml-352.79 -I/mesos/build/3rdparty/picojson-1.3.0/src/picojson-1.3.0 -I/mesos/build/3rdparty/protobuf-2.6.1/src/protobuf-2.6.1-lib/lib/include -I/usr/include/subversion-1 -I/mesos/3rdparty/stout/tests/src -I/mesos/build/3rdparty/gmock-1.7.0/src/gmock-1.7.0/include -I/mesos/build/3rdparty/gmock-1.7.0/src/gmock-1.7.0/gtest/include    -o CMakeFiles/stout_tests.dir/os/rmdir_tests.cpp.o -c /mesos/3rdparty/stout/tests/os/rmdir_tests.cpp
make[3]: Leaving directory `/mesos/build'
make[2]: *** [3rdparty/libprocess/src/CMakeFiles/process-0.0.1.dir/all] Error 2
make[2]: *** Waiting for unfinished jobs....
/usr/bin/cmake -E cmake_progress_report /mesos/build/CMakeFiles 92
[ 75%] Building CXX object 3rdparty/stout/tests/CMakeFiles/stout_tests.dir/os/socket_tests.cpp.o
cd /mesos/build/3rdparty/stout/tests && /usr/bin/clang++-3.5   -DHAS_AUTHENTICATION=1 -DLIBDIR=\"/usr/local/libmesos\" -DPICOJSON_USE_INT64 -DPKGDATADIR=\"/usr/local/share/mesos\" -DPKGLIBEXECDIR=\"/usr/local/libexec/mesos\" -DVERSION=\"1.2.0\" -D__STDC_FORMAT_MACROS -std=c++11 -g -I/mesos/3rdparty/stout/include -I/usr/include/apr-1.0 -I/mesos/build/3rdparty/boost-1.53.0/src/boost-1.53.0 -I/mesos/build/3rdparty/elfio-3.2/src/elfio-3.2 -I/mesos/build/3rdparty/glog-0.3.3/src/glog-0.3.3-lib/lib/include -I/mesos/build/3rdparty/nvml-352.79/src/nvml-352.79 -I/mesos/build/3rdparty/picojson-1.3.0/src/picojson-1.3.0 -I/mesos/build/3rdparty/protobuf-2.6.1/src/protobuf-2.6.1-lib/lib/include -I/usr/include/subversion-1 -I/mesos/3rdparty/stout/tests/src -I/mesos/build/3rdparty/gmock-1.7.0/src/gmock-1.7.0/include -I/mesos/build/3rdparty/gmock-1.7.0/src/gmock-1.7.0/gtest/include    -o CMakeFiles/stout_tests.dir/os/socket_tests.cpp.o -c /mesos/3rdparty/stout/tests/os/socket_tests.cpp
/usr/bin/cmake -E cmake_progress_report /mesos/build/CMakeFiles 
[ 75%] Building CXX object 3rdparty/stout/tests/CMakeFiles/stout_tests.dir/os/strerror_tests.cpp.o
cd /mesos/build/3rdparty/stout/tests && /usr/bin/clang++-3.5   -DHAS_AUTHENTICATION=1 -DLIBDIR=\"/usr/local/libmesos\" -DPICOJSON_USE_INT64 -DPKGDATADIR=\"/usr/local/share/mesos\" -DPKGLIBEXECDIR=\"/usr/local/libexec/mesos\" -DVERSION=\"1.2.0\" -D__STDC_FORMAT_MACROS -std=c++11 -g -I/mesos/3rdparty/stout/include -I/usr/include/apr-1.0 -I/mesos/build/3rdparty/boost-1.53.0/src/boost-1.53.0 -I/mesos/build/3rdparty/elfio-3.2/src/elfio-3.2 -I/mesos/build/3rdparty/glog-0.3.3/src/glog-0.3.3-lib/lib/include -I/mesos/build/3rdparty/nvml-352.79/src/nvml-352.79 -I/mesos/build/3rdparty/picojson-1.3.0/src/picojson-1.3.0 -I/mesos/build/3rdparty/protobuf-2.6.1/src/protobuf-2.6.1-lib/lib/include -I/usr/include/subversion-1 -I/mesos/3rdparty/stout/tests/src -I/mesos/build/3rdparty/gmock-1.7.0/src/gmock-1.7.0/include -I/mesos/build/3rdparty/gmock-1.7.0/src/gmock-1.7.0/gtest/include    -o CMakeFiles/stout_tests.dir/os/strerror_tests.cpp.o -c /mesos/3rdparty/stout/tests/os/strerror_tests.cpp
/usr/bin/cmake -E cmake_progress_report /mesos/build/CMakeFiles 
[ 75%] Building CXX object 3rdparty/stout/tests/CMakeFiles/stout_tests.dir/os/systems_tests.cpp.o
cd /mesos/build/3rdparty/stout/tests && /usr/bin/clang++-3.5   -DHAS_AUTHENTICATION=1 -DLIBDIR=\"/usr/local/libmesos\" -DPICOJSON_USE_INT64 -DPKGDATADIR=\"/usr/local/share/mesos\" -DPKGLIBEXECDIR=\"/usr/local/libexec/mesos\" -DVERSION=\"1.2.0\" -D__STDC_FORMAT_MACROS -std=c++11 -g -I/mesos/3rdparty/stout/include -I/usr/include/apr-1.0 -I/mesos/build/3rdparty/boost-1.53.0/src/boost-1.53.0 -I/mesos/build/3rdparty/elfio-3.2/src/elfio-3.2 -I/mesos/build/3rdparty/glog-0.3.3/src/glog-0.3.3-lib/lib/include -I/mesos/build/3rdparty/nvml-352.79/src/nvml-352.79 -I/mesos/build/3rdparty/picojson-1.3.0/src/picojson-1.3.0 -I/mesos/build/3rdparty/protobuf-2.6.1/src/protobuf-2.6.1-lib/lib/include -I/usr/include/subversion-1 -I/mesos/3rdparty/stout/tests/src -I/mesos/build/3rdparty/gmock-1.7.0/src/gmock-1.7.0/include -I/mesos/build/3rdparty/gmock-1.7.0/src/gmock-1.7.0/gtest/include    -o CMakeFiles/stout_tests.dir/os/systems_tests.cpp.o -c /mesos/3rdparty/stout/tests/os/systems_tests.cpp
/usr/bin/cmake -E cmake_progress_report /mesos/build/CMakeFiles 
[ 75%] Building CXX object 3rdparty/stout/tests/CMakeFiles/stout_tests.dir/recordio_tests.cpp.o
cd /mesos/build/3rdparty/stout/tests && /usr/bin/clang++-3.5   -DHAS_AUTHENTICATION=1 -DLIBDIR=\"/usr/local/libmesos\" -DPICOJSON_USE_INT64 -DPKGDATADIR=\"/usr/local/share/mesos\" -DPKGLIBEXECDIR=\"/usr/local/libexec/mesos\" -DVERSION=\"1.2.0\" -D__STDC_FORMAT_MACROS -std=c++11 -g -I/mesos/3rdparty/stout/include -I/usr/include/apr-1.0 -I/mesos/build/3rdparty/boost-1.53.0/src/boost-1.53.0 -I/mesos/build/3rdparty/elfio-3.2/src/elfio-3.2 -I/mesos/build/3rdparty/glog-0.3.3/src/glog-0.3.3-lib/lib/include -I/mesos/build/3rdparty/nvml-352.79/src/nvml-352.79 -I/mesos/build/3rdparty/picojson-1.3.0/src/picojson-1.3.0 -I/mesos/build/3rdparty/protobuf-2.6.1/src/protobuf-2.6.1-lib/lib/include -I/usr/include/subversion-1 -I/mesos/3rdparty/stout/tests/src -I/mesos/build/3rdparty/gmock-1.7.0/src/gmock-1.7.0/include -I/mesos/build/3rdparty/gmock-1.7.0/src/gmock-1.7.0/gtest/include    -o CMakeFiles/stout_tests.dir/recordio_tests.cpp.o -c /mesos/3rdparty/stout/tests/recordio_tests.cpp
/usr/bin/cmake -E cmake_progress_report /mesos/build/CMakeFiles 93
[ 78%] Building CXX object 3rdparty/stout/tests/CMakeFiles/stout_tests.dir/result_tests.cpp.o
cd /mesos/build/3rdparty/stout/tests && /usr/bin/clang++-3.5   -DHAS_AUTHENTICATION=1 -DLIBDIR=\"/usr/local/libmesos\" -DPICOJSON_USE_INT64 -DPKGDATADIR=\"/usr/local/share/mesos\" -DPKGLIBEXECDIR=\"/usr/local/libexec/mesos\" -DVERSION=\"1.2.0\" -D__STDC_FORMAT_MACROS -std=c++11 -g -I/mesos/3rdparty/stout/include -I/usr/include/apr-1.0 -I/mesos/build/3rdparty/boost-1.53.0/src/boost-1.53.0 -I/mesos/build/3rdparty/elfio-3.2/src/elfio-3.2 -I/mesos/build/3rdparty/glog-0.3.3/src/glog-0.3.3-lib/lib/include -I/mesos/build/3rdparty/nvml-352.79/src/nvml-352.79 -I/mesos/build/3rdparty/picojson-1.3.0/src/picojson-1.3.0 -I/mesos/build/3rdparty/protobuf-2.6.1/src/protobuf-2.6.1-lib/lib/include -I/usr/include/subversion-1 -I/mesos/3rdparty/stout/tests/src -I/mesos/build/3rdparty/gmock-1.7.0/src/gmock-1.7.0/include -I/mesos/build/3rdparty/gmock-1.7.0/src/gmock-1.7.0/gtest/include    -o CMakeFiles/stout_tests.dir/result_tests.cpp.o -c /mesos/3rdparty/stout/tests/result_tests.cpp
/usr/bin/cmake -E cmake_progress_report /mesos/build/CMakeFiles 
[ 78%] Building CXX object 3rdparty/stout/tests/CMakeFiles/stout_tests.dir/some_tests.cpp.o
cd /mesos/build/3rdparty/stout/tests && /usr/bin/clang++-3.5   -DHAS_AUTHENTICATION=1 -DLIBDIR=\"/usr/local/libmesos\" -DPICOJSON_USE_INT64 -DPKGDATADIR=\"/usr/local/share/mesos\" -DPKGLIBEXECDIR=\"/usr/local/libexec/mesos\" -DVERSION=\"1.2.0\" -D__STDC_FORMAT_MACROS -std=c++11 -g -I/mesos/3rdparty/stout/include -I/usr/include/apr-1.0 -I/mesos/build/3rdparty/boost-1.53.0/src/boost-1.53.0 -I/mesos/build/3rdparty/elfio-3.2/src/elfio-3.2 -I/mesos/build/3rdparty/glog-0.3.3/src/glog-0.3.3-lib/lib/include -I/mesos/build/3rdparty/nvml-352.79/src/nvml-352.79 -I/mesos/build/3rdparty/picojson-1.3.0/src/picojson-1.3.0 -I/mesos/build/3rdparty/protobuf-2.6.1/src/protobuf-2.6.1-lib/lib/include -I/usr/include/subversion-1 -I/mesos/3rdparty/stout/tests/src -I/mesos/build/3rdparty/gmock-1.7.0/src/gmock-1.7.0/include -I/mesos/build/3rdparty/gmock-1.7.0/src/gmock-1.7.0/gtest/include    -o CMakeFiles/stout_tests.dir/some_tests.cpp.o -c /mesos/3rdparty/stout/tests/some_tests.cpp
/usr/bin/cmake -E cmake_progress_report /mesos/build/CMakeFiles 
[ 78%] Building CXX object 3rdparty/stout/tests/CMakeFiles/stout_tests.dir/strings_tests.cpp.o
cd /mesos/build/3rdparty/stout/tests && /usr/bin/clang++-3.5   -DHAS_AUTHENTICATION=1 -DLIBDIR=\"/usr/local/libmesos\" -DPICOJSON_USE_INT64 -DPKGDATADIR=\"/usr/local/share/mesos\" -DPKGLIBEXECDIR=\"/usr/local/libexec/mesos\" -DVERSION=\"1.2.0\" -D__STDC_FORMAT_MACROS -std=c++11 -g -I/mesos/3rdparty/stout/include -I/usr/include/apr-1.0 -I/mesos/build/3rdparty/boost-1.53.0/src/boost-1.53.0 -I/mesos/build/3rdparty/elfio-3.2/src/elfio-3.2 -I/mesos/build/3rdparty/glog-0.3.3/src/glog-0.3.3-lib/lib/include -I/mesos/build/3rdparty/nvml-352.79/src/nvml-352.79 -I/mesos/build/3rdparty/picojson-1.3.0/src/picojson-1.3.0 -I/mesos/build/3rdparty/protobuf-2.6.1/src/protobuf-2.6.1-lib/lib/include -I/usr/include/subversion-1 -I/mesos/3rdparty/stout/tests/src -I/mesos/build/3rdparty/gmock-1.7.0/src/gmock-1.7.0/include -I/mesos/build/3rdparty/gmock-1.7.0/src/gmock-1.7.0/gtest/include    -o CMakeFiles/stout_tests.dir/strings_tests.cpp.o -c /mesos/3rdparty/stout/tests/strings_tests.cpp
/usr/bin/cmake -E cmake_progress_report /mesos/build/CMakeFiles 
[ 78%] Building CXX object 3rdparty/stout/tests/CMakeFiles/stout_tests.dir/subcommand_tests.cpp.o
cd /mesos/build/3rdparty/stout/tests && /usr/bin/clang++-3.5   -DHAS_AUTHENTICATION=1 -DLIBDIR=\"/usr/local/libmesos\" -DPICOJSON_USE_INT64 -DPKGDATADIR=\"/usr/local/share/mesos\" -DPKGLIBEXECDIR=\"/usr/local/libexec/mesos\" -DVERSION=\"1.2.0\" -D__STDC_FORMAT_MACROS -std=c++11 -g -I/mesos/3rdparty/stout/include -I/usr/include/apr-1.0 -I/mesos/build/3rdparty/boost-1.53.0/src/boost-1.53.0 -I/mesos/build/3rdparty/elfio-3.2/src/elfio-3.2 -I/mesos/build/3rdparty/glog-0.3.3/src/glog-0.3.3-lib/lib/include -I/mesos/build/3rdparty/nvml-352.79/src/nvml-352.79 -I/mesos/build/3rdparty/picojson-1.3.0/src/picojson-1.3.0 -I/mesos/build/3rdparty/protobuf-2.6.1/src/protobuf-2.6.1-lib/lib/include -I/usr/include/subversion-1 -I/mesos/3rdparty/stout/tests/src -I/mesos/build/3rdparty/gmock-1.7.0/src/gmock-1.7.0/include -I/mesos/build/3rdparty/gmock-1.7.0/src/gmock-1.7.0/gtest/include    -o CMakeFiles/stout_tests.dir/subcommand_tests.cpp.o -c /mesos/3rdparty/stout/tests/subcommand_tests.cpp
/usr/bin/cmake -E cmake_progress_report /mesos/build/CMakeFiles 
[ 78%] Building CXX object 3rdparty/stout/tests/CMakeFiles/stout_tests.dir/try_tests.cpp.o
cd /mesos/build/3rdparty/stout/tests && /usr/bin/clang++-3.5   -DHAS_AUTHENTICATION=1 -DLIBDIR=\"/usr/local/libmesos\" -DPICOJSON_USE_INT64 -DPKGDATADIR=\"/usr/local/share/mesos\" -DPKGLIBEXECDIR=\"/usr/local/libexec/mesos\" -DVERSION=\"1.2.0\" -D__STDC_FORMAT_MACROS -std=c++11 -g -I/mesos/3rdparty/stout/include -I/usr/include/apr-1.0 -I/mesos/build/3rdparty/boost-1.53.0/src/boost-1.53.0 -I/mesos/build/3rdparty/elfio-3.2/src/elfio-3.2 -I/mesos/build/3rdparty/glog-0.3.3/src/glog-0.3.3-lib/lib/include -I/mesos/build/3rdparty/nvml-352.79/src/nvml-352.79 -I/mesos/build/3rdparty/picojson-1.3.0/src/picojson-1.3.0 -I/mesos/build/3rdparty/protobuf-2.6.1/src/protobuf-2.6.1-lib/lib/include -I/usr/include/subversion-1 -I/mesos/3rdparty/stout/tests/src -I/mesos/build/3rdparty/gmock-1.7.0/src/gmock-1.7.0/include -I/mesos/build/3rdparty/gmock-1.7.0/src/gmock-1.7.0/gtest/include    -o CMakeFiles/stout_tests.dir/try_tests.cpp.o -c /mesos/3rdparty/stout/tests/try_tests.cpp
/usr/bin/cmake -E cmake_progress_report /mesos/build/CMakeFiles 94
[ 81%] Building CXX object 3rdparty/stout/tests/CMakeFiles/stout_tests.dir/uuid_tests.cpp.o
cd /mesos/build/3rdparty/stout/tests && /usr/bin/clang++-3.5   -DHAS_AUTHENTICATION=1 -DLIBDIR=\"/usr/local/libmesos\" -DPICOJSON_USE_INT64 -DPKGDATADIR=\"/usr/local/share/mesos\" -DPKGLIBEXECDIR=\"/usr/local/libexec/mesos\" -DVERSION=\"1.2.0\" -D__STDC_FORMAT_MACROS -std=c++11 -g -I/mesos/3rdparty/stout/include -I/usr/include/apr-1.0 -I/mesos/build/3rdparty/boost-1.53.0/src/boost-1.53.0 -I/mesos/build/3rdparty/elfio-3.2/src/elfio-3.2 -I/mesos/build/3rdparty/glog-0.3.3/src/glog-0.3.3-lib/lib/include -I/mesos/build/3rdparty/nvml-352.79/src/nvml-352.79 -I/mesos/build/3rdparty/picojson-1.3.0/src/picojson-1.3.0 -I/mesos/build/3rdparty/protobuf-2.6.1/src/protobuf-2.6.1-lib/lib/include -I/usr/include/subversion-1 -I/mesos/3rdparty/stout/tests/src -I/mesos/build/3rdparty/gmock-1.7.0/src/gmock-1.7.0/include -I/mesos/build/3rdparty/gmock-1.7.0/src/gmock-1.7.0/gtest/include    -o CMakeFiles/stout_tests.dir/uuid_tests.cpp.o -c /mesos/3rdparty/stout/tests/uuid_tests.cpp
/usr/bin/cmake -E cmake_progress_report /mesos/build/CMakeFiles 
[ 81%] Building CXX object 3rdparty/stout/tests/CMakeFiles/stout_tests.dir/version_tests.cpp.o
cd /mesos/build/3rdparty/stout/tests && /usr/bin/clang++-3.5   -DHAS_AUTHENTICATION=1 -DLIBDIR=\"/usr/local/libmesos\" -DPICOJSON_USE_INT64 -DPKGDATADIR=\"/usr/local/share/mesos\" -DPKGLIBEXECDIR=\"/usr/local/libexec/mesos\" -DVERSION=\"1.2.0\" -D__STDC_FORMAT_MACROS -std=c++11 -g -I/mesos/3rdparty/stout/include -I/usr/include/apr-1.0 -I/mesos/build/3rdparty/boost-1.53.0/src/boost-1.53.0 -I/mesos/build/3rdparty/elfio-3.2/src/elfio-3.2 -I/mesos/build/3rdparty/glog-0.3.3/src/glog-0.3.3-lib/lib/include -I/mesos/build/3rdparty/nvml-352.79/src/nvml-352.79 -I/mesos/build/3rdparty/picojson-1.3.0/src/picojson-1.3.0 -I/mesos/build/3rdparty/protobuf-2.6.1/src/protobuf-2.6.1-lib/lib/include -I/usr/include/subversion-1 -I/mesos/3rdparty/stout/tests/src -I/mesos/build/3rdparty/gmock-1.7.0/src/gmock-1.7.0/include -I/mesos/build/3rdparty/gmock-1.7.0/src/gmock-1.7.0/gtest/include    -o CMakeFiles/stout_tests.dir/version_tests.cpp.o -c /mesos/3rdparty/stout/tests/version_tests.cpp
/usr/bin/cmake -E cmake_progress_report /mesos/build/CMakeFiles 
[ 81%] Building CXX object 3rdparty/stout/tests/CMakeFiles/stout_tests.dir/path_tests.cpp.o
cd /mesos/build/3rdparty/stout/tests && /usr/bin/clang++-3.5   -DHAS_AUTHENTICATION=1 -DLIBDIR=\"/usr/local/libmesos\" -DPICOJSON_USE_INT64 -DPKGDATADIR=\"/usr/local/share/mesos\" -DPKGLIBEXECDIR=\"/usr/local/libexec/mesos\" -DVERSION=\"1.2.0\" -D__STDC_FORMAT_MACROS -std=c++11 -g -I/mesos/3rdparty/stout/include -I/usr/include/apr-1.0 -I/mesos/build/3rdparty/boost-1.53.0/src/boost-1.53.0 -I/mesos/build/3rdparty/elfio-3.2/src/elfio-3.2 -I/mesos/build/3rdparty/glog-0.3.3/src/glog-0.3.3-lib/lib/include -I/mesos/build/3rdparty/nvml-352.79/src/nvml-352.79 -I/mesos/build/3rdparty/picojson-1.3.0/src/picojson-1.3.0 -I/mesos/build/3rdparty/protobuf-2.6.1/src/protobuf-2.6.1-lib/lib/include -I/usr/include/subversion-1 -I/mesos/3rdparty/stout/tests/src -I/mesos/build/3rdparty/gmock-1.7.0/src/gmock-1.7.0/include -I/mesos/build/3rdparty/gmock-1.7.0/src/gmock-1.7.0/gtest/include    -o CMakeFiles/stout_tests.dir/path_tests.cpp.o -c /mesos/3rdparty/stout/tests/path_tests.cpp
/usr/bin/cmake -E cmake_progress_report /mesos/build/CMakeFiles 
[ 81%] Building CXX object 3rdparty/stout/tests/CMakeFiles/stout_tests.dir/protobuf_tests.cpp.o
cd /mesos/build/3rdparty/stout/tests && /usr/bin/clang++-3.5   -DHAS_AUTHENTICATION=1 -DLIBDIR=\"/usr/local/libmesos\" -DPICOJSON_USE_INT64 -DPKGDATADIR=\"/usr/local/share/mesos\" -DPKGLIBEXECDIR=\"/usr/local/libexec/mesos\" -DVERSION=\"1.2.0\" -D__STDC_FORMAT_MACROS -std=c++11 -g -I/mesos/3rdparty/stout/include -I/usr/include/apr-1.0 -I/mesos/build/3rdparty/boost-1.53.0/src/boost-1.53.0 -I/mesos/build/3rdparty/elfio-3.2/src/elfio-3.2 -I/mesos/build/3rdparty/glog-0.3.3/src/glog-0.3.3-lib/lib/include -I/mesos/build/3rdparty/nvml-352.79/src/nvml-352.79 -I/mesos/build/3rdparty/picojson-1.3.0/src/picojson-1.3.0 -I/mesos/build/3rdparty/protobuf-2.6.1/src/protobuf-2.6.1-lib/lib/include -I/usr/include/subversion-1 -I/mesos/3rdparty/stout/tests/src -I/mesos/build/3rdparty/gmock-1.7.0/src/gmock-1.7.0/include -I/mesos/build/3rdparty/gmock-1.7.0/src/gmock-1.7.0/gtest/include    -o CMakeFiles/stout_tests.dir/protobuf_tests.cpp.o -c /mesos/3rdparty/stout/tests/protobuf_tests.cpp
/usr/bin/cmake -E cmake_progress_report /mesos/build/CMakeFiles 95
[ 83%] Building CXX object 3rdparty/stout/tests/CMakeFiles/stout_tests.dir/protobuf_tests.pb.cc.o
cd /mesos/build/3rdparty/stout/tests && /usr/bin/clang++-3.5   -DHAS_AUTHENTICATION=1 -DLIBDIR=\"/usr/local/libmesos\" -DPICOJSON_USE_INT64 -DPKGDATADIR=\"/usr/local/share/mesos\" -DPKGLIBEXECDIR=\"/usr/local/libexec/mesos\" -DVERSION=\"1.2.0\" -D__STDC_FORMAT_MACROS -std=c++11 -g -I/mesos/3rdparty/stout/include -I/usr/include/apr-1.0 -I/mesos/build/3rdparty/boost-1.53.0/src/boost-1.53.0 -I/mesos/build/3rdparty/elfio-3.2/src/elfio-3.2 -I/mesos/build/3rdparty/glog-0.3.3/src/glog-0.3.3-lib/lib/include -I/mesos/build/3rdparty/nvml-352.79/src/nvml-352.79 -I/mesos/build/3rdparty/picojson-1.3.0/src/picojson-1.3.0 -I/mesos/build/3rdparty/protobuf-2.6.1/src/protobuf-2.6.1-lib/lib/include -I/usr/include/subversion-1 -I/mesos/3rdparty/stout/tests/src -I/mesos/build/3rdparty/gmock-1.7.0/src/gmock-1.7.0/include -I/mesos/build/3rdparty/gmock-1.7.0/src/gmock-1.7.0/gtest/include    -o CMakeFiles/stout_tests.dir/protobuf_tests.pb.cc.o -c /mesos/3rdparty/stout/tests/protobuf_tests.pb.cc
/usr/bin/cmake -E cmake_progress_report /mesos/build/CMakeFiles 
[ 83%] Building CXX object 3rdparty/stout/tests/CMakeFiles/stout_tests.dir/svn_tests.cpp.o
cd /mesos/build/3rdparty/stout/tests && /usr/bin/clang++-3.5   -DHAS_AUTHENTICATION=1 -DLIBDIR=\"/usr/local/libmesos\" -DPICOJSON_USE_INT64 -DPKGDATADIR=\"/usr/local/share/mesos\" -DPKGLIBEXECDIR=\"/usr/local/libexec/mesos\" -DVERSION=\"1.2.0\" -D__STDC_FORMAT_MACROS -std=c++11 -g -I/mesos/3rdparty/stout/include -I/usr/include/apr-1.0 -I/mesos/build/3rdparty/boost-1.53.0/src/boost-1.53.0 -I/mesos/build/3rdparty/elfio-3.2/src/elfio-3.2 -I/mesos/build/3rdparty/glog-0.3.3/src/glog-0.3.3-lib/lib/include -I/mesos/build/3rdparty/nvml-352.79/src/nvml-352.79 -I/mesos/build/3rdparty/picojson-1.3.0/src/picojson-1.3.0 -I/mesos/build/3rdparty/protobuf-2.6.1/src/protobuf-2.6.1-lib/lib/include -I/usr/include/subversion-1 -I/mesos/3rdparty/stout/tests/src -I/mesos/build/3rdparty/gmock-1.7.0/src/gmock-1.7.0/include -I/mesos/build/3rdparty/gmock-1.7.0/src/gmock-1.7.0/gtest/include    -o CMakeFiles/stout_tests.dir/svn_tests.cpp.o -c /mesos/3rdparty/stout/tests/svn_tests.cpp
/usr/bin/cmake -E cmake_progress_report /mesos/build/CMakeFiles 
[ 83%] Building CXX object 3rdparty/stout/tests/CMakeFiles/stout_tests.dir/os/sendfile_tests.cpp.o
cd /mesos/build/3rdparty/stout/tests && /usr/bin/clang++-3.5   -DHAS_AUTHENTICATION=1 -DLIBDIR=\"/usr/local/libmesos\" -DPICOJSON_USE_INT64 -DPKGDATADIR=\"/usr/local/share/mesos\" -DPKGLIBEXECDIR=\"/usr/local/libexec/mesos\" -DVERSION=\"1.2.0\" -D__STDC_FORMAT_MACROS -std=c++11 -g -I/mesos/3rdparty/stout/include -I/usr/include/apr-1.0 -I/mesos/build/3rdparty/boost-1.53.0/src/boost-1.53.0 -I/mesos/build/3rdparty/elfio-3.2/src/elfio-3.2 -I/mesos/build/3rdparty/glog-0.3.3/src/glog-0.3.3-lib/lib/include -I/mesos/build/3rdparty/nvml-352.79/src/nvml-352.79 -I/mesos/build/3rdparty/picojson-1.3.0/src/picojson-1.3.0 -I/mesos/build/3rdparty/protobuf-2.6.1/src/protobuf-2.6.1-lib/lib/include -I/usr/include/subversion-1 -I/mesos/3rdparty/stout/tests/src -I/mesos/build/3rdparty/gmock-1.7.0/src/gmock-1.7.0/include -I/mesos/build/3rdparty/gmock-1.7.0/src/gmock-1.7.0/gtest/include    -o CMakeFiles/stout_tests.dir/os/sendfile_tests.cpp.o -c /mesos/3rdparty/stout/tests/os/sendfile_tests.cpp
/usr/bin/cmake -E cmake_progress_report /mesos/build/CMakeFiles 
[ 83%] Building CXX object 3rdparty/stout/tests/CMakeFiles/stout_tests.dir/os/signals_tests.cpp.o
cd /mesos/build/3rdparty/stout/tests && /usr/bin/clang++-3.5   -DHAS_AUTHENTICATION=1 -DLIBDIR=\"/usr/local/libmesos\" -DPICOJSON_USE_INT64 -DPKGDATADIR=\"/usr/local/share/mesos\" -DPKGLIBEXECDIR=\"/usr/local/libexec/mesos\" -DVERSION=\"1.2.0\" -D__STDC_FORMAT_MACROS -std=c++11 -g -I/mesos/3rdparty/stout/include -I/usr/include/apr-1.0 -I/mesos/build/3rdparty/boost-1.53.0/src/boost-1.53.0 -I/mesos/build/3rdparty/elfio-3.2/src/elfio-3.2 -I/mesos/build/3rdparty/glog-0.3.3/src/glog-0.3.3-lib/lib/include -I/mesos/build/3rdparty/nvml-352.79/src/nvml-352.79 -I/mesos/build/3rdparty/picojson-1.3.0/src/picojson-1.3.0 -I/mesos/build/3rdparty/protobuf-2.6.1/src/protobuf-2.6.1-lib/lib/include -I/usr/include/subversion-1 -I/mesos/3rdparty/stout/tests/src -I/mesos/build/3rdparty/gmock-1.7.0/src/gmock-1.7.0/include -I/mesos/build/3rdparty/gmock-1.7.0/src/gmock-1.7.0/gtest/include    -o CMakeFiles/stout_tests.dir/os/signals_tests.cpp.o -c /mesos/3rdparty/stout/tests/os/signals_tests.cpp
/usr/bin/cmake -E cmake_progress_report /mesos/build/CMakeFiles 
[ 83%] Building CXX object 3rdparty/stout/tests/CMakeFiles/stout_tests.dir/proc_tests.cpp.o
cd /mesos/build/3rdparty/stout/tests && /usr/bin/clang++-3.5   -DHAS_AUTHENTICATION=1 -DLIBDIR=\"/usr/local/libmesos\" -DPICOJSON_USE_INT64 -DPKGDATADIR=\"/usr/local/share/mesos\" -DPKGLIBEXECDIR=\"/usr/local/libexec/mesos\" -DVERSION=\"1.2.0\" -D__STDC_FORMAT_MACROS -std=c++11 -g -I/mesos/3rdparty/stout/include -I/usr/include/apr-1.0 -I/mesos/build/3rdparty/boost-1.53.0/src/boost-1.53.0 -I/mesos/build/3rdparty/elfio-3.2/src/elfio-3.2 -I/mesos/build/3rdparty/glog-0.3.3/src/glog-0.3.3-lib/lib/include -I/mesos/build/3rdparty/nvml-352.79/src/nvml-352.79 -I/mesos/build/3rdparty/picojson-1.3.0/src/picojson-1.3.0 -I/mesos/build/3rdparty/protobuf-2.6.1/src/protobuf-2.6.1-lib/lib/include -I/usr/include/subversion-1 -I/mesos/3rdparty/stout/tests/src -I/mesos/build/3rdparty/gmock-1.7.0/src/gmock-1.7.0/include -I/mesos/build/3rdparty/gmock-1.7.0/src/gmock-1.7.0/gtest/include    -o CMakeFiles/stout_tests.dir/proc_tests.cpp.o -c /mesos/3rdparty/stout/tests/proc_tests.cpp
Linking CXX executable stout_tests
cd /mesos/build/3rdparty/stout/tests && /usr/bin/cmake -E cmake_link_script CMakeFiles/stout_tests.dir/link.txt --verbose=1
/usr/bin/clang++-3.5    -std=c++11 -g    CMakeFiles/stout_tests.dir/base64_tests.cpp.o CMakeFiles/stout_tests.dir/bits_tests.cpp.o CMakeFiles/stout_tests.dir/bytes_tests.cpp.o CMakeFiles/stout_tests.dir/cache_tests.cpp.o CMakeFiles/stout_tests.dir/duration_tests.cpp.o CMakeFiles/stout_tests.dir/dynamiclibrary_tests.cpp.o CMakeFiles/stout_tests.dir/error_tests.cpp.o CMakeFiles/stout_tests.dir/flags_tests.cpp.o CMakeFiles/stout_tests.dir/gzip_tests.cpp.o CMakeFiles/stout_tests.dir/hashmap_tests.cpp.o CMakeFiles/stout_tests.dir/hashset_tests.cpp.o CMakeFiles/stout_tests.dir/interval_tests.cpp.o CMakeFiles/stout_tests.dir/ip_tests.cpp.o CMakeFiles/stout_tests.dir/json_tests.cpp.o CMakeFiles/stout_tests.dir/jsonify_tests.cpp.o CMakeFiles/stout_tests.dir/linkedhashmap_tests.cpp.o CMakeFiles/stout_tests.dir/mac_tests.cpp.o CMakeFiles/stout_tests.dir/main.cpp.o CMakeFiles/stout_tests.dir/multimap_tests.cpp.o CMakeFiles/stout_tests.dir/none_tests.cpp.o CMakeFiles/stout_tests.dir/numify_tests.cpp.o CMakeFiles/stout_tests.dir/option_tests.cpp.o CMakeFiles/stout_tests.dir/os_tests.cpp.o CMakeFiles/stout_tests.dir/os/env_tests.cpp.o CMakeFiles/stout_tests.dir/os/filesystem_tests.cpp.o CMakeFiles/stout_tests.dir/os/process_tests.cpp.o CMakeFiles/stout_tests.dir/os/rmdir_tests.cpp.o CMakeFiles/stout_tests.dir/os/socket_tests.cpp.o CMakeFiles/stout_tests.dir/os/strerror_tests.cpp.o CMakeFiles/stout_tests.dir/os/systems_tests.cpp.o CMakeFiles/stout_tests.dir/recordio_tests.cpp.o CMakeFiles/stout_tests.dir/result_tests.cpp.o CMakeFiles/stout_tests.dir/some_tests.cpp.o CMakeFiles/stout_tests.dir/strings_tests.cpp.o CMakeFiles/stout_tests.dir/subcommand_tests.cpp.o CMakeFiles/stout_tests.dir/try_tests.cpp.o CMakeFiles/stout_tests.dir/uuid_tests.cpp.o CMakeFiles/stout_tests.dir/version_tests.cpp.o CMakeFiles/stout_tests.dir/path_tests.cpp.o CMakeFiles/stout_tests.dir/protobuf_tests.cpp.o CMakeFiles/stout_tests.dir/protobuf_tests.pb.cc.o CMakeFiles/stout_tests.dir/svn_tests.cpp.o CMakeFiles/stout_tests.dir/os/sendfile_tests.cpp.o CMakeFiles/stout_tests.dir/os/signals_tests.cpp.o CMakeFiles/stout_tests.dir/proc_tests.cpp.o  -o stout_tests  -L/usr/lib/x86_64-linux-gnu/libapr-1.so  -L/mesos/build/3rdparty/glog-0.3.3/src/glog-0.3.3-lib/lib/lib  -L/mesos/build/3rdparty/protobuf-2.6.1/src/protobuf-2.6.1-lib/lib/lib  -L/usr/lib/x86_64-linux-gnu/libsvn_delta-1.so  -L/usr/lib/x86_64-linux-gnu/libsvn_diff-1.so  -L/usr/lib/x86_64-linux-gnu/libsvn_subr-1.so  -L/mesos/build/3rdparty/gmock-1.7.0/src/gmock-1.7.0-lib/lib  -L/mesos/build/3rdparty/gmock-1.7.0/src/gmock-1.7.0-build/gtest/lib/.libs -rdynamic -lcurl -lglog -lsvn_delta-1 -lsvn_diff-1 -lsvn_subr-1 -lprotobuf -ldl -lapr-1 -lrt -lpthread -lcurl -lglog -lsvn_delta-1 -lsvn_diff-1 -lsvn_subr-1 -lsvn_delta-1 -lsvn_diff-1 -lsvn_subr-1 -lprotobuf -ldl -lapr-1 -lrt -lpthread -lcurl -lglog -lsvn_delta-1 -lsvn_diff-1 -lsvn_subr-1 -lsvn_delta-1 -lsvn_diff-1 -lsvn_subr-1 -lsvn_delta-1 -lsvn_diff-1 -lsvn_subr-1 -lsvn_delta-1 -lsvn_diff-1 -lsvn_subr-1 -lprotobuf -ldl -lapr-1 -lrt -lpthread -lcurl -lglog -lsvn_delta-1 -lsvn_diff-1 -lsvn_subr-1 -lsvn_delta-1 -lsvn_diff-1 -lsvn_subr-1 -lsvn_delta-1 -lsvn_diff-1 -lsvn_subr-1 -lsvn_delta-1 -lsvn_diff-1 -lsvn_subr-1 -lsvn_delta-1 -lsvn_diff-1 -lsvn_subr-1 -lsvn_delta-1 -lsvn_diff-1 -lsvn_subr-1 -lprotobuf -ldl -lapr-1 -lrt -lgmock -lgtest -lpthread -lgmock -lgtest -Wl,-rpath,/usr/lib/x86_64-linux-gnu/libapr-1.so:/mesos/build/3rdparty/glog-0.3.3/src/glog-0.3.3-lib/lib/lib:/mesos/build/3rdparty/protobuf-2.6.1/src/protobuf-2.6.1-lib/lib/lib:/usr/lib/x86_64-linux-gnu/libsvn_delta-1.so:/usr/lib/x86_64-linux-gnu/libsvn_diff-1.so:/usr/lib/x86_64-linux-gnu/libsvn_subr-1.so:/mesos/build/3rdparty/gmock-1.7.0/src/gmock-1.7.0-lib/lib:/mesos/build/3rdparty/gmock-1.7.0/src/gmock-1.7.0-build/gtest/lib/.libs 
make[3]: Leaving directory `/mesos/build'
/usr/bin/cmake -E cmake_progress_report /mesos/build/CMakeFiles  86 87 88 89 90 91 92 93 94 95
[ 83%] Built target stout_tests
make[2]: Leaving directory `/mesos/build'
make[1]: Leaving directory `/mesos/build'
make[1]: *** [CMakeFiles/check.dir/rule] Error 2
make: *** [check] Error 2
+ docker rmi mesos-1479788205-17919
Untagged: mesos-1479788205-17919:latest
Deleted: sha256:8d8c0257b34d0bc1a8f485c494d61f3fdc9c3de4f8ab5f2f2efff3c4908ec971
Deleted: sha256:5c875d15b44c4f9f9d5997dfa286e71b32b8f8f6cd085b382bae66394b803f0d
Deleted: sha256:9fc58a17df126454ba0657211825ea0b2ce561aa34a664a9ee9e124e256d2baa
Deleted: sha256:448992daeefc883086f26f7c867c161fbb508062c2ae445d4dffe13375c68225
Deleted: sha256:6c9e8644c146ec4d1319d4c91a0cbf7efd54bba9cbf0bda34762a95f3eb27442
Deleted: sha256:0c313b56acf038e4dc75f1193ec8485167938e40642f3dd5668723469aee239e
Deleted: sha256:9a564a7e88750f00cab65e145f111d1072c4f43b224833d86123f8bfc72c9481
Deleted: sha256:d3c66d5de5977201c3250766a4fe165f82f4c18f911cc3c14c02c6583dafcfa7
Deleted: sha256:4a1fa32e2e18d566768db7eb92a6d00e9c21d0d09773a457318251ed4aabea4d
Deleted: sha256:1c6af4863fe50beb1eeaecc3ceb57b6bcafb592d79c31ab7da0c8d1b3f354620
Deleted: sha256:6b8c226e7b4303102d7feed956249e822611d194f8a1d16b4f2596f7d187d844
Deleted: sha256:816c28dd2d6734cd43602065b672fbc0a8071fa83a6f4bc8bac0f7041c92ed2d
Deleted: sha256:8c40b7be7ac0af51b0ebf89d1714c1d34cbcd21e623a6495ebb4c7662ea1497f
Deleted: sha256:aa7c40103396950559c5e4f703b179a2044bf3b0ddf154e63750b1cbfb1a6306
Deleted: sha256:f62109be711ead854a25a27d4468ff0c60f40d720064c86234547fcebbe01860
Deleted: sha256:bf6f1b05862bddcf53af439c8d579b695d6a334023a0b721bd4835b27792d93f
Deleted: sha256:052255b93c666d22ef61cf45f2111dfc24986bc3a12ecbb051bc490aa5567a79
Deleted: sha256:de99fb0c69148fad99822e908c8666fdae037d2cee526ca685ff93841275d7e3
Deleted: sha256:a6903d6dc6c34fd03e0f38842418ed3e45382b057bc3f92ece0aa0ac2050a29f
Deleted: sha256:9d875ac468937dce3014957ac7a3d2158092becc1b87bceddd1660572bf8fb1b
Deleted: sha256:804070397d2e4b99f1ccc7a6a600e802423e19d82a7c8a50b1a42417ea5cd62e
Deleted: sha256:8761096238eb035405857feff114d9f745d32e1d4da11761447ec0316a5da506
Deleted: sha256:94cad7d3f3140498aa2ede2d00f28199b32d35bc7fb09d5e62ac32b6ae009bee
Deleted: sha256:99fbcb8a879b20b350fa7a3a854d78c505e6605e3019967633cb1b85efd7f9c3
Build step 'Execute shell' marked build as failure

Mime
View raw message