mesos-builds mailing list archives

Site index · List index
Message view « Date » · « Thread »
Top « Date » · « Thread »
From Apache Jenkins Server <jenk...@builds.apache.org>
Subject Build failed in Jenkins: Mesos » autotools,gcc,--verbose --enable-libevent --enable-ssl,GLOG_v=1 MESOS_VERBOSE=1,centos:7,(docker||Hadoop)&&(!ubuntu-us1)&&(!ubuntu-6)&&(!ubuntu-eu2) #2937
Date Thu, 17 Nov 2016 01:39:00 GMT
See <https://builds.apache.org/job/Mesos/BUILDTOOL=autotools,COMPILER=gcc,CONFIGURATION=--verbose%20--enable-libevent%20--enable-ssl,ENVIRONMENT=GLOG_v=1%20MESOS_VERBOSE=1,OS=centos%3A7,label_exp=(docker%7C%7CHadoop)&&(!ubuntu-us1)&&(!ubuntu-6)&&(!ubuntu-eu2)/2937/changes>

Changes:

[mpark] Tweaked parameter names in stout.

[mpark] Tweaked parameter names in libprocess.

[mpark] Tweaked parameter names in mesos.

------------------------------------------
[...truncated 222221 lines...]
W1117 01:37:25.333667 31933 backend.cpp:76] Failed to create 'bind' backend: BindBackend requires
root privileges
I1117 01:37:25.337463 31967 slave.cpp:208] Mesos agent started on (643)@172.17.0.2:32956
I1117 01:37:25.337497 31967 slave.cpp:209] Flags at startup: --acls="" --appc_simple_discovery_uri_prefix="http://"
--appc_store_dir="/tmp/mesos/store/appc" --authenticate_http_readonly="true" --authenticate_http_readwrite="true"
--authenticatee="crammd5" --authentication_backoff_factor="1secs" --authorizer="local" --cgroups_cpu_enable_pids_and_tids_count="false"
--cgroups_enable_cfs="false" --cgroups_hierarchy="/sys/fs/cgroup" --cgroups_limit_swap="false"
--cgroups_root="mesos" --container_disk_watch_interval="15secs" --containerizers="mesos" --credential="/tmp/Endpoint_SlaveEndpointTest_AuthorizedRequest_1_ba0My2/credential"
--default_role="*" --disk_watch_interval="1mins" --docker="docker" --docker_kill_orphans="true"
--docker_registry="https://registry-1.docker.io" --docker_remove_delay="6hrs" --docker_socket="/var/run/docker.sock"
--docker_stop_timeout="0ns" --docker_store_dir="/tmp/mesos/store/docker" --docker_volume_checkpoint_dir="/var/run/mesos/isolators/docker/volume"
--enforce_container_disk_quota="false" --executor_registration_timeout="1mins" --executor_shutdown_grace_period="5secs"
--fetcher_cache_dir="/tmp/Endpoint_SlaveEndpointTest_AuthorizedRequest_1_ba0My2/fetch" --fetcher_cache_size="2GB"
--frameworks_home="" --gc_delay="1weeks" --gc_disk_headroom="0.1" --hadoop_home="" --help="false"
--hostname_lookup="true" --http_authenticators="basic" --http_command_executor="false" --http_credentials="/tmp/Endpoint_SlaveEndpointTest_AuthorizedRequest_1_ba0My2/http_credentials"
--image_provisioner_backend="copy" --initialize_driver_logging="true" --isolation="posix/cpu,posix/mem"
--launcher="posix" --launcher_dir="/mesos/mesos-1.2.0/_build/src" --logbufsecs="0" --logging_level="INFO"
--max_completed_executors_per_framework="150" --oversubscribed_resources_interval="15secs"
--perf_duration="10secs" --perf_interval="1mins" --qos_correction_interval_min="0ns" --quiet="false"
--recover="reconnect" --recovery_timeout="15mins" --registration_backoff_factor="10ms" --resources="cpus:2;gpus:0;mem:1024;disk:1024;ports:[31000-32000]"
--revocable_cpu_low_priority="true" --runtime_dir="/tmp/Endpoint_SlaveEndpointTest_AuthorizedRequest_1_ba0My2"
--sandbox_directory="/mnt/mesos/sandbox" --strict="true" --switch_user="true" --systemd_enable_support="true"
--systemd_runtime_directory="/run/systemd/system" --version="false" --work_dir="/tmp/Endpoint_SlaveEndpointTest_AuthorizedRequest_1_2ASl80"
I1117 01:37:25.338426 31967 credentials.hpp:86] Loading credential for authentication from
'/tmp/Endpoint_SlaveEndpointTest_AuthorizedRequest_1_ba0My2/credential'
I1117 01:37:25.338681 31967 slave.cpp:346] Agent using credential for: test-principal
I1117 01:37:25.338717 31967 credentials.hpp:37] Loading credentials for authentication from
'/tmp/Endpoint_SlaveEndpointTest_AuthorizedRequest_1_ba0My2/http_credentials'
I1117 01:37:25.339117 31967 http.cpp:895] Using default 'basic' HTTP authenticator for realm
'mesos-agent-readonly'
I1117 01:37:25.339277 31967 http.cpp:895] Using default 'basic' HTTP authenticator for realm
'mesos-agent-readwrite'
I1117 01:37:25.340904 31967 slave.cpp:533] Agent resources: cpus(*):2; mem(*):1024; disk(*):1024;
ports(*):[31000-32000]
I1117 01:37:25.341007 31967 slave.cpp:541] Agent attributes: [  ]
I1117 01:37:25.341022 31967 slave.cpp:546] Agent hostname: 699184c85fed
I1117 01:37:25.342726 31963 state.cpp:57] Recovering state from '/tmp/Endpoint_SlaveEndpointTest_AuthorizedRequest_1_2ASl80/meta'
I1117 01:37:25.343152 31962 status_update_manager.cpp:203] Recovering status update manager
I1117 01:37:25.343507 31954 containerizer.cpp:561] Recovering containerizer
I1117 01:37:25.345259 31955 provisioner.cpp:253] Provisioner recovery complete
I1117 01:37:25.345727 31960 slave.cpp:5411] Finished recovery
I1117 01:37:25.346328 31960 slave.cpp:5585] Querying resource estimator for oversubscribable
resources
I1117 01:37:25.346851 31953 slave.cpp:5599] Received oversubscribable resources {} from the
resource estimator
I1117 01:37:25.348965 31952 process.cpp:3570] Handling HTTP event for process 'slave(643)'
with path: '/slave(643)/monitor/statistics.json'
I1117 01:37:25.350287 31953 http.cpp:847] Authorizing principal 'test-principal' to GET the
'/monitor/statistics.json' endpoint
I1117 01:37:25.353828 31957 slave.cpp:787] Agent terminating
[       OK ] Endpoint/SlaveEndpointTest.AuthorizedRequest/1 (32 ms)
[ RUN      ] Endpoint/SlaveEndpointTest.AuthorizedRequest/2
I1117 01:37:25.364953 31933 containerizer.cpp:202] Using isolation: posix/cpu,posix/mem,filesystem/posix,network/cni
W1117 01:37:25.365618 31933 backend.cpp:76] Failed to create 'aufs' backend: AufsBackend requires
root privileges, but is running as user mesos
W1117 01:37:25.365792 31933 backend.cpp:76] Failed to create 'bind' backend: BindBackend requires
root privileges
I1117 01:37:25.369040 31965 slave.cpp:208] Mesos agent started on (644)@172.17.0.2:32956
I1117 01:37:25.369069 31965 slave.cpp:209] Flags at startup: --acls="" --appc_simple_discovery_uri_prefix="http://"
--appc_store_dir="/tmp/mesos/store/appc" --authenticate_http_readonly="true" --authenticate_http_readwrite="true"
--authenticatee="crammd5" --authentication_backoff_factor="1secs" --authorizer="local" --cgroups_cpu_enable_pids_and_tids_count="false"
--cgroups_enable_cfs="false" --cgroups_hierarchy="/sys/fs/cgroup" --cgroups_limit_swap="false"
--cgroups_root="mesos" --container_disk_watch_interval="15secs" --containerizers="mesos" --credential="/tmp/Endpoint_SlaveEndpointTest_AuthorizedRequest_2_fT7Ay8/credential"
--default_role="*" --disk_watch_interval="1mins" --docker="docker" --docker_kill_orphans="true"
--docker_registry="https://registry-1.docker.io" --docker_remove_delay="6hrs" --docker_socket="/var/run/docker.sock"
--docker_stop_timeout="0ns" --docker_store_dir="/tmp/mesos/store/docker" --docker_volume_checkpoint_dir="/var/run/mesos/isolators/docker/volume"
--enforce_container_disk_quota="false" --executor_registration_timeout="1mins" --executor_shutdown_grace_period="5secs"
--fetcher_cache_dir="/tmp/Endpoint_SlaveEndpointTest_AuthorizedRequest_2_fT7Ay8/fetch" --fetcher_cache_size="2GB"
--frameworks_home="" --gc_delay="1weeks" --gc_disk_headroom="0.1" --hadoop_home="" --help="false"
--hostname_lookup="true" --http_authenticators="basic" --http_command_executor="false" --http_credentials="/tmp/Endpoint_SlaveEndpointTest_AuthorizedRequest_2_fT7Ay8/http_credentials"
--image_provisioner_backend="copy" --initialize_driver_logging="true" --isolation="posix/cpu,posix/mem"
--launcher="posix" --launcher_dir="/mesos/mesos-1.2.0/_build/src" --logbufsecs="0" --logging_level="INFO"
--max_completed_executors_per_framework="150" --oversubscribed_resources_interval="15secs"
--perf_duration="10secs" --perf_interval="1mins" --qos_correction_interval_min="0ns" --quiet="false"
--recover="reconnect" --recovery_timeout="15mins" --registration_backoff_factor="10ms" --resources="cpus:2;gpus:0;mem:1024;disk:1024;ports:[31000-32000]"
--revocable_cpu_low_priority="true" --runtime_dir="/tmp/Endpoint_SlaveEndpointTest_AuthorizedRequest_2_fT7Ay8"
--sandbox_directory="/mnt/mesos/sandbox" --strict="true" --switch_user="true" --systemd_enable_support="true"
--systemd_runtime_directory="/run/systemd/system" --version="false" --work_dir="/tmp/Endpoint_SlaveEndpointTest_AuthorizedRequest_2_0GrT26"
I1117 01:37:25.369658 31965 credentials.hpp:86] Loading credential for authentication from
'/tmp/Endpoint_SlaveEndpointTest_AuthorizedRequest_2_fT7Ay8/credential'
I1117 01:37:25.369822 31965 slave.cpp:346] Agent using credential for: test-principal
I1117 01:37:25.369849 31965 credentials.hpp:37] Loading credentials for authentication from
'/tmp/Endpoint_SlaveEndpointTest_AuthorizedRequest_2_fT7Ay8/http_credentials'
I1117 01:37:25.370112 31965 http.cpp:895] Using default 'basic' HTTP authenticator for realm
'mesos-agent-readonly'
I1117 01:37:25.370254 31965 http.cpp:895] Using default 'basic' HTTP authenticator for realm
'mesos-agent-readwrite'
I1117 01:37:25.371726 31965 slave.cpp:533] Agent resources: cpus(*):2; mem(*):1024; disk(*):1024;
ports(*):[31000-32000]
I1117 01:37:25.371829 31965 slave.cpp:541] Agent attributes: [  ]
I1117 01:37:25.371842 31965 slave.cpp:546] Agent hostname: 699184c85fed
I1117 01:37:25.373513 31959 state.cpp:57] Recovering state from '/tmp/Endpoint_SlaveEndpointTest_AuthorizedRequest_2_0GrT26/meta'
I1117 01:37:25.373862 31957 status_update_manager.cpp:203] Recovering status update manager
I1117 01:37:25.374277 31961 containerizer.cpp:561] Recovering containerizer
I1117 01:37:25.375879 31961 provisioner.cpp:253] Provisioner recovery complete
I1117 01:37:25.376468 31960 slave.cpp:5411] Finished recovery
I1117 01:37:25.376991 31960 slave.cpp:5585] Querying resource estimator for oversubscribable
resources
I1117 01:37:25.377382 31959 slave.cpp:5599] Received oversubscribable resources {} from the
resource estimator
I1117 01:37:25.379365 31952 process.cpp:3570] Handling HTTP event for process 'slave(644)'
with path: '/slave(644)/containers'
I1117 01:37:25.380489 31967 http.cpp:847] Authorizing principal 'test-principal' to GET the
'/containers' endpoint
I1117 01:37:25.384536 31962 slave.cpp:787] Agent terminating
[       OK ] Endpoint/SlaveEndpointTest.AuthorizedRequest/2 (30 ms)
[ RUN      ] Endpoint/SlaveEndpointTest.UnauthorizedRequest/0
I1117 01:37:25.396468 31933 containerizer.cpp:202] Using isolation: posix/cpu,posix/mem,filesystem/posix,network/cni
W1117 01:37:25.397156 31933 backend.cpp:76] Failed to create 'aufs' backend: AufsBackend requires
root privileges, but is running as user mesos
W1117 01:37:25.397330 31933 backend.cpp:76] Failed to create 'bind' backend: BindBackend requires
root privileges
I1117 01:37:25.401010 31954 slave.cpp:208] Mesos agent started on (645)@172.17.0.2:32956
I1117 01:37:25.401041 31954 slave.cpp:209] Flags at startup: --acls="" --appc_simple_discovery_uri_prefix="http://"
--appc_store_dir="/tmp/mesos/store/appc" --authenticate_http_readonly="true" --authenticate_http_readwrite="true"
--authenticatee="crammd5" --authentication_backoff_factor="1secs" --authorizer="local" --cgroups_cpu_enable_pids_and_tids_count="false"
--cgroups_enable_cfs="false" --cgroups_hierarchy="/sys/fs/cgroup" --cgroups_limit_swap="false"
--cgroups_root="mesos" --container_disk_watch_interval="15secs" --containerizers="mesos" --credential="/tmp/Endpoint_SlaveEndpointTest_UnauthorizedRequest_0_94xFSe/credential"
--default_role="*" --disk_watch_interval="1mins" --docker="docker" --docker_kill_orphans="true"
--docker_registry="https://registry-1.docker.io" --docker_remove_delay="6hrs" --docker_socket="/var/run/docker.sock"
--docker_stop_timeout="0ns" --docker_store_dir="/tmp/mesos/store/docker" --docker_volume_checkpoint_dir="/var/run/mesos/isolators/docker/volume"
--enforce_container_disk_quota="false" --executor_registration_timeout="1mins" --executor_shutdown_grace_period="5secs"
--fetcher_cache_dir="/tmp/Endpoint_SlaveEndpointTest_UnauthorizedRequest_0_94xFSe/fetch" --fetcher_cache_size="2GB"
--frameworks_home="" --gc_delay="1weeks" --gc_disk_headroom="0.1" --hadoop_home="" --help="false"
--hostname_lookup="true" --http_authenticators="basic" --http_command_executor="false" --http_credentials="/tmp/Endpoint_SlaveEndpointTest_UnauthorizedRequest_0_94xFSe/http_credentials"
--image_provisioner_backend="copy" --initialize_driver_logging="true" --isolation="posix/cpu,posix/mem"
--launcher="posix" --launcher_dir="/mesos/mesos-1.2.0/_build/src" --logbufsecs="0" --logging_level="INFO"
--max_completed_executors_per_framework="150" --oversubscribed_resources_interval="15secs"
--perf_duration="10secs" --perf_interval="1mins" --qos_correction_interval_min="0ns" --quiet="false"
--recover="reconnect" --recovery_timeout="15mins" --registration_backoff_factor="10ms" --resources="cpus:2;gpus:0;mem:1024;disk:1024;ports:[31000-32000]"
--revocable_cpu_low_priority="true" --runtime_dir="/tmp/Endpoint_SlaveEndpointTest_UnauthorizedRequest_0_94xFSe"
--sandbox_directory="/mnt/mesos/sandbox" --strict="true" --switch_user="true" --systemd_enable_support="true"
--systemd_runtime_directory="/run/systemd/system" --version="false" --work_dir="/tmp/Endpoint_SlaveEndpointTest_UnauthorizedRequest_0_WtiShd"
I1117 01:37:25.401692 31954 credentials.hpp:86] Loading credential for authentication from
'/tmp/Endpoint_SlaveEndpointTest_UnauthorizedRequest_0_94xFSe/credential'
I1117 01:37:25.401856 31954 slave.cpp:346] Agent using credential for: test-principal
I1117 01:37:25.401882 31954 credentials.hpp:37] Loading credentials for authentication from
'/tmp/Endpoint_SlaveEndpointTest_UnauthorizedRequest_0_94xFSe/http_credentials'
I1117 01:37:25.402148 31954 http.cpp:895] Using default 'basic' HTTP authenticator for realm
'mesos-agent-readonly'
I1117 01:37:25.402307 31954 http.cpp:895] Using default 'basic' HTTP authenticator for realm
'mesos-agent-readwrite'
I1117 01:37:25.404240 31954 slave.cpp:533] Agent resources: cpus(*):2; mem(*):1024; disk(*):1024;
ports(*):[31000-32000]
I1117 01:37:25.404342 31954 slave.cpp:541] Agent attributes: [  ]
I1117 01:37:25.404359 31954 slave.cpp:546] Agent hostname: 699184c85fed
I1117 01:37:25.406055 31964 state.cpp:57] Recovering state from '/tmp/Endpoint_SlaveEndpointTest_UnauthorizedRequest_0_WtiShd/meta'
I1117 01:37:25.406425 31964 status_update_manager.cpp:203] Recovering status update manager
I1117 01:37:25.406766 31953 containerizer.cpp:561] Recovering containerizer
I1117 01:37:25.408231 31954 provisioner.cpp:253] Provisioner recovery complete
I1117 01:37:25.408614 31959 slave.cpp:5411] Finished recovery
I1117 01:37:25.409167 31959 slave.cpp:5585] Querying resource estimator for oversubscribable
resources
I1117 01:37:25.409440 31953 slave.cpp:5599] Received oversubscribable resources {} from the
resource estimator
I1117 01:37:25.411255 31954 process.cpp:3570] Handling HTTP event for process 'slave(645)'
with path: '/slave(645)/monitor/statistics'
I1117 01:37:25.412434 31962 http.cpp:847] Authorizing principal 'test-principal' to GET the
'/monitor/statistics' endpoint
I1117 01:37:25.416506 31967 slave.cpp:787] Agent terminating
[       OK ] Endpoint/SlaveEndpointTest.UnauthorizedRequest/0 (30 ms)
[ RUN      ] Endpoint/SlaveEndpointTest.UnauthorizedRequest/1
I1117 01:37:25.427202 31933 containerizer.cpp:202] Using isolation: posix/cpu,posix/mem,filesystem/posix,network/cni
W1117 01:37:25.427680 31933 backend.cpp:76] Failed to create 'aufs' backend: AufsBackend requires
root privileges, but is running as user mesos
W1117 01:37:25.427801 31933 backend.cpp:76] Failed to create 'bind' backend: BindBackend requires
root privileges
I1117 01:37:25.430189 31966 slave.cpp:208] Mesos agent started on (646)@172.17.0.2:32956
I1117 01:37:25.430207 31966 slave.cpp:209] Flags at startup: --acls="" --appc_simple_discovery_uri_prefix="http://"
--appc_store_dir="/tmp/mesos/store/appc" --authenticate_http_readonly="true" --authenticate_http_readwrite="true"
--authenticatee="crammd5" --authentication_backoff_factor="1secs" --authorizer="local" --cgroups_cpu_enable_pids_and_tids_count="false"
--cgroups_enable_cfs="false" --cgroups_hierarchy="/sys/fs/cgroup" --cgroups_limit_swap="false"
--cgroups_root="mesos" --container_disk_watch_interval="15secs" --containerizers="mesos" --credential="/tmp/Endpoint_SlaveEndpointTest_UnauthorizedRequest_1_bM97wl/credential"
--default_role="*" --disk_watch_interval="1mins" --docker="docker" --docker_kill_orphans="true"
--docker_registry="https://registry-1.docker.io" --docker_remove_delay="6hrs" --docker_socket="/var/run/docker.sock"
--docker_stop_timeout="0ns" --docker_store_dir="/tmp/mesos/store/docker" --docker_volume_checkpoint_dir="/var/run/mesos/isolators/docker/volume"
--enforce_container_disk_quota="false" --executor_registration_timeout="1mins" --executor_shutdown_grace_period="5secs"
--fetcher_cache_dir="/tmp/Endpoint_SlaveEndpointTest_UnauthorizedRequest_1_bM97wl/fetch" --fetcher_cache_size="2GB"
--frameworks_home="" --gc_delay="1weeks" --gc_disk_headroom="0.1" --hadoop_home="" --help="false"
--hostname_lookup="true" --http_authenticators="basic" --http_command_executor="false" --http_credentials="/tmp/Endpoint_SlaveEndpointTest_UnauthorizedRequest_1_bM97wl/http_credentials"
--image_provisioner_backend="copy" --initialize_driver_logging="true" --isolation="posix/cpu,posix/mem"
--launcher="posix" --launcher_dir="/mesos/mesos-1.2.0/_build/src" --logbufsecs="0" --logging_level="INFO"
--max_completed_executors_per_framework="150" --oversubscribed_resources_interval="15secs"
--perf_duration="10secs" --perf_interval="1mins" --qos_correction_interval_min="0ns" --quiet="false"
--recover="reconnect" --recovery_timeout="15mins" --registration_backoff_factor="10ms" --resources="cpus:2;gpus:0;mem:1024;disk:1024;ports:[31000-32000]"
--revocable_cpu_low_priority="true" --runtime_dir="/tmp/Endpoint_SlaveEndpointTest_UnauthorizedRequest_1_bM97wl"
--sandbox_directory="/mnt/mesos/sandbox" --strict="true" --switch_user="true" --systemd_enable_support="true"
--systemd_runtime_directory="/run/systemd/system" --version="false" --work_dir="/tmp/Endpoint_SlaveEndpointTest_UnauthorizedRequest_1_8oyhRj"
I1117 01:37:25.430698 31966 credentials.hpp:86] Loading credential for authentication from
'/tmp/Endpoint_SlaveEndpointTest_UnauthorizedRequest_1_bM97wl/credential'
I1117 01:37:25.430816 31966 slave.cpp:346] Agent using credential for: test-principal
I1117 01:37:25.430835 31966 credentials.hpp:37] Loading credentials for authentication from
'/tmp/Endpoint_SlaveEndpointTest_UnauthorizedRequest_1_bM97wl/http_credentials'
I1117 01:37:25.431020 31966 http.cpp:895] Using default 'basic' HTTP authenticator for realm
'mesos-agent-readonly'
I1117 01:37:25.431253 31966 http.cpp:895] Using default 'basic' HTTP authenticator for realm
'mesos-agent-readwrite'
I1117 01:37:25.432960 31966 slave.cpp:533] Agent resources: cpus(*):2; mem(*):1024; disk(*):1024;
ports(*):[31000-32000]
I1117 01:37:25.433061 31966 slave.cpp:541] Agent attributes: [  ]
I1117 01:37:25.433079 31966 slave.cpp:546] Agent hostname: 699184c85fed
I1117 01:37:25.434679 31959 state.cpp:57] Recovering state from '/tmp/Endpoint_SlaveEndpointTest_UnauthorizedRequest_1_8oyhRj/meta'
I1117 01:37:25.435163 31955 status_update_manager.cpp:203] Recovering status update manager
I1117 01:37:25.435387 31963 containerizer.cpp:561] Recovering containerizer
I1117 01:37:25.436883 31960 provisioner.cpp:253] Provisioner recovery complete
I1117 01:37:25.437314 31966 slave.cpp:5411] Finished recovery
I1117 01:37:25.437877 31966 slave.cpp:5585] Querying resource estimator for oversubscribable
resources
I1117 01:37:25.438256 31963 slave.cpp:5599] Received oversubscribable resources {} from the
resource estimator
I1117 01:37:25.439899 31964 process.cpp:3570] Handling HTTP event for process 'slave(646)'
with path: '/slave(646)/monitor/statistics.json'
I1117 01:37:25.441004 31964 http.cpp:847] Authorizing principal 'test-principal' to GET the
'/monitor/statistics.json' endpoint
I1117 01:37:25.443264 31959 slave.cpp:787] Agent terminating
[       OK ] Endpoint/SlaveEndpointTest.UnauthorizedRequest/1 (26 ms)
[ RUN      ] Endpoint/SlaveEndpointTest.UnauthorizedRequest/2
I1117 01:37:25.454002 31933 containerizer.cpp:202] Using isolation: posix/cpu,posix/mem,filesystem/posix,network/cni
W1117 01:37:25.454627 31933 backend.cpp:76] Failed to create 'aufs' backend: AufsBackend requires
root privileges, but is running as user mesos
W1117 01:37:25.454807 31933 backend.cpp:76] Failed to create 'bind' backend: BindBackend requires
root privileges
I1117 01:37:25.457887 31961 slave.cpp:208] Mesos agent started on (647)@172.17.0.2:32956
I1117 01:37:25.457916 31961 slave.cpp:209] Flags at startup: --acls="" --appc_simple_discovery_uri_prefix="http://"
--appc_store_dir="/tmp/mesos/store/appc" --authenticate_http_readonly="true" --authenticate_http_readwrite="true"
--authenticatee="crammd5" --authentication_backoff_factor="1secs" --authorizer="local" --cgroups_cpu_enable_pids_and_tids_count="false"
--cgroups_enable_cfs="false" --cgroups_hierarchy="/sys/fs/cgroup" --cgroups_limit_swap="false"
--cgroups_root="mesos" --container_disk_watch_interval="15secs" --containerizers="mesos" --credential="/tmp/Endpoint_SlaveEndpointTest_UnauthorizedRequest_2_fTZnts/credential"
--default_role="*" --disk_watch_interval="1mins" --docker="docker" --docker_kill_orphans="true"
--docker_registry="https://registry-1.docker.io" --docker_remove_delay="6hrs" --docker_socket="/var/run/docker.sock"
--docker_stop_timeout="0ns" --docker_store_dir="/tmp/mesos/store/docker" --docker_volume_checkpoint_dir="/var/run/mesos/isolators/docker/volume"
--enforce_container_disk_quota="false" --executor_registration_timeout="1mins" --executor_shutdown_grace_period="5secs"
--fetcher_cache_dir="/tmp/Endpoint_SlaveEndpointTest_UnauthorizedRequest_2_fTZnts/fetch" --fetcher_cache_size="2GB"
--frameworks_home="" --gc_delay="1weeks" --gc_disk_headroom="0.1" --hadoop_home="" --help="false"
--hostname_lookup="true" --http_authenticators="basic" --http_command_executor="false" --http_credentials="/tmp/Endpoint_SlaveEndpointTest_UnauthorizedRequest_2_fTZnts/http_credentials"
--image_provisioner_backend="copy" --initialize_driver_logging="true" --isolation="posix/cpu,posix/mem"
--launcher="posix" --launcher_dir="/mesos/mesos-1.2.0/_build/src" --logbufsecs="0" --logging_level="INFO"
--max_completed_executors_per_framework="150" --oversubscribed_resources_interval="15secs"
--perf_duration="10secs" --perf_interval="1mins" --qos_correction_interval_min="0ns" --quiet="false"
--recover="reconnect" --recovery_timeout="15mins" --registration_backoff_factor="10ms" --resources="cpus:2;gpus:0;mem:1024;disk:1024;ports:[31000-32000]"
--revocable_cpu_low_priority="true" --runtime_dir="/tmp/Endpoint_SlaveEndpointTest_UnauthorizedRequest_2_fTZnts"
--sandbox_directory="/mnt/mesos/sandbox" --strict="true" --switch_user="true" --systemd_enable_support="true"
--systemd_runtime_directory="/run/systemd/system" --version="false" --work_dir="/tmp/Endpoint_SlaveEndpointTest_UnauthorizedRequest_2_IqGaJq"
I1117 01:37:25.458621 31961 credentials.hpp:86] Loading credential for authentication from
'/tmp/Endpoint_SlaveEndpointTest_UnauthorizedRequest_2_fTZnts/credential'
I1117 01:37:25.458783 31961 slave.cpp:346] Agent using credential for: test-principal
I1117 01:37:25.458811 31961 credentials.hpp:37] Loading credentials for authentication from
'/tmp/Endpoint_SlaveEndpointTest_UnauthorizedRequest_2_fTZnts/http_credentials'
I1117 01:37:25.459076 31961 http.cpp:895] Using default 'basic' HTTP authenticator for realm
'mesos-agent-readonly'
I1117 01:37:25.459215 31961 http.cpp:895] Using default 'basic' HTTP authenticator for realm
'mesos-agent-readwrite'
I1117 01:37:25.460474 31961 slave.cpp:533] Agent resources: cpus(*):2; mem(*):1024; disk(*):1024;
ports(*):[31000-32000]
I1117 01:37:25.460574 31961 slave.cpp:541] Agent attributes: [  ]
I1117 01:37:25.460588 31961 slave.cpp:546] Agent hostname: 699184c85fed
I1117 01:37:25.462123 31963 state.cpp:57] Recovering state from '/tmp/Endpoint_SlaveEndpointTest_UnauthorizedRequest_2_IqGaJq/meta'
I1117 01:37:25.462414 31960 status_update_manager.cpp:203] Recovering status update manager
I1117 01:37:25.462837 31961 containerizer.cpp:561] Recovering containerizer
I1117 01:37:25.464649 31962 provisioner.cpp:253] Provisioner recovery complete
I1117 01:37:25.465342 31965 slave.cpp:5411] Finished recovery
I1117 01:37:25.466238 31965 slave.cpp:5585] Querying resource estimator for oversubscribable
resources
I1117 01:37:25.466605 31954 slave.cpp:5599] Received oversubscribable resources {} from the
resource estimator
I1117 01:37:25.468266 31955 process.cpp:3570] Handling HTTP event for process 'slave(647)'
with path: '/slave(647)/containers'
I1117 01:37:25.469377 31962 http.cpp:847] Authorizing principal 'test-principal' to GET the
'/containers' endpoint
I1117 01:37:25.471774 31963 slave.cpp:787] Agent terminating
[       OK ] Endpoint/SlaveEndpointTest.UnauthorizedRequest/2 (28 ms)
[ RUN      ] Endpoint/SlaveEndpointTest.NoAuthorizer/0
I1117 01:37:25.483690 31933 containerizer.cpp:202] Using isolation: posix/cpu,posix/mem,filesystem/posix,network/cni
W1117 01:37:25.484366 31933 backend.cpp:76] Failed to create 'aufs' backend: AufsBackend requires
root privileges, but is running as user mesos
W1117 01:37:25.484531 31933 backend.cpp:76] Failed to create 'bind' backend: BindBackend requires
root privileges
I1117 01:37:25.486572 31933 cluster.cpp:435] Creating default 'local' authorizer
I1117 01:37:25.488376 31965 slave.cpp:208] Mesos agent started on (648)@172.17.0.2:32956
I1117 01:37:25.488404 31965 slave.cpp:209] Flags at startup: --acls="" --appc_simple_discovery_uri_prefix="http://"
--appc_store_dir="/tmp/mesos/store/appc" --authenticate_http_readonly="true" --authenticate_http_readwrite="true"
--authenticatee="crammd5" --authentication_backoff_factor="1secs" --authorizer="local" --cgroups_cpu_enable_pids_and_tids_count="false"
--cgroups_enable_cfs="false" --cgroups_hierarchy="/sys/fs/cgroup" --cgroups_limit_swap="false"
--cgroups_root="mesos" --container_disk_watch_interval="15secs" --containerizers="mesos" --credential="/tmp/Endpoint_SlaveEndpointTest_NoAuthorizer_0_9gciIz/credential"
--default_role="*" --disk_watch_interval="1mins" --docker="docker" --docker_kill_orphans="true"
--docker_registry="https://registry-1.docker.io" --docker_remove_delay="6hrs" --docker_socket="/var/run/docker.sock"
--docker_stop_timeout="0ns" --docker_store_dir="/tmp/mesos/store/docker" --docker_volume_checkpoint_dir="/var/run/mesos/isolators/docker/volume"
--enforce_container_disk_quota="false" --executor_registration_timeout="1mins" --executor_shutdown_grace_period="5secs"
--fetcher_cache_dir="/tmp/Endpoint_SlaveEndpointTest_NoAuthorizer_0_9gciIz/fetch" --fetcher_cache_size="2GB"
--frameworks_home="" --gc_delay="1weeks" --gc_disk_headroom="0.1" --hadoop_home="" --help="false"
--hostname_lookup="true" --http_authenticators="basic" --http_command_executor="false" --http_credentials="/tmp/Endpoint_SlaveEndpointTest_NoAuthorizer_0_9gciIz/http_credentials"
--image_provisioner_backend="copy" --initialize_driver_logging="true" --isolation="posix/cpu,posix/mem"
--launcher="posix" --launcher_dir="/mesos/mesos-1.2.0/_build/src" --logbufsecs="0" --logging_level="INFO"
--max_completed_executors_per_framework="150" --oversubscribed_resources_interval="15secs"
--perf_duration="10secs" --perf_interval="1mins" --qos_correction_interval_min="0ns" --quiet="false"
--recover="reconnect" --recovery_timeout="15mins" --registration_backoff_factor="10ms" --resources="cpus:2;gpus:0;mem:1024;disk:1024;ports:[31000-32000]"
--revocable_cpu_low_priority="true" --runtime_dir="/tmp/Endpoint_SlaveEndpointTest_NoAuthorizer_0_9gciIz"
--sandbox_directory="/mnt/mesos/sandbox" --strict="true" --switch_user="true" --systemd_enable_support="true"
--systemd_runtime_directory="/run/systemd/system" --version="false" --work_dir="/tmp/Endpoint_SlaveEndpointTest_NoAuthorizer_0_847mTx"
I1117 01:37:25.489039 31965 credentials.hpp:86] Loading credential for authentication from
'/tmp/Endpoint_SlaveEndpointTest_NoAuthorizer_0_9gciIz/credential'
I1117 01:37:25.489193 31965 slave.cpp:346] Agent using credential for: test-principal
I1117 01:37:25.489220 31965 credentials.hpp:37] Loading credentials for authentication from
'/tmp/Endpoint_SlaveEndpointTest_NoAuthorizer_0_9gciIz/http_credentials'
I1117 01:37:25.489478 31965 http.cpp:895] Using default 'basic' HTTP authenticator for realm
'mesos-agent-readonly'
I1117 01:37:25.489624 31965 http.cpp:895] Using default 'basic' HTTP authenticator for realm
'mesos-agent-readwrite'
I1117 01:37:25.490854 31965 slave.cpp:533] Agent resources: cpus(*):2; mem(*):1024; disk(*):1024;
ports(*):[31000-32000]
I1117 01:37:25.490962 31965 slave.cpp:541] Agent attributes: [  ]
I1117 01:37:25.491006 31965 slave.cpp:546] Agent hostname: 699184c85fed
I1117 01:37:25.492475 31955 state.cpp:57] Recovering state from '/tmp/Endpoint_SlaveEndpointTest_NoAuthorizer_0_847mTx/meta'
I1117 01:37:25.493130 31961 status_update_manager.cpp:203] Recovering status update manager
I1117 01:37:25.493463 31966 containerizer.cpp:561] Recovering containerizer
I1117 01:37:25.494992 31952 provisioner.cpp:253] Provisioner recovery complete
I1117 01:37:25.495697 31957 slave.cpp:5411] Finished recovery
I1117 01:37:25.496244 31957 slave.cpp:5585] Querying resource estimator for oversubscribable
resources
I1117 01:37:25.496541 31961 slave.cpp:5599] Received oversubscribable resources {} from the
resource estimator
I1117 01:37:25.498102 31965 process.cpp:3570] Handling HTTP event for process 'slave(648)'
with path: '/slave(648)/monitor/statistics'
I1117 01:37:25.499156 31952 http.cpp:847] Authorizing principal 'test-principal' to GET the
'/monitor/statistics' endpoint
I1117 01:37:25.503049 31955 slave.cpp:787] Agent terminating
[       OK ] Endpoint/SlaveEndpointTest.NoAuthorizer/0 (32 ms)
[ RUN      ] Endpoint/SlaveEndpointTest.NoAuthorizer/1
I1117 01:37:25.516872 31933 containerizer.cpp:202] Using isolation: posix/cpu,posix/mem,filesystem/posix,network/cni
W1117 01:37:25.517601 31933 backend.cpp:76] Failed to create 'aufs' backend: AufsBackend requires
root privileges, but is running as user mesos
W1117 01:37:25.517860 31933 backend.cpp:76] Failed to create 'bind' backend: BindBackend requires
root privileges
I1117 01:37:25.519121 31933 cluster.cpp:435] Creating default 'local' authorizer
I1117 01:37:25.520442 31954 slave.cpp:208] Mesos agent started on (649)@172.17.0.2:32956
I1117 01:37:25.520469 31954 slave.cpp:209] Flags at startup: --acls="" --appc_simple_discovery_uri_prefix="http://"
--appc_store_dir="/tmp/mesos/store/appc" --authenticate_http_readonly="true" --authenticate_http_readwrite="true"
--authenticatee="crammd5" --authentication_backoff_factor="1secs" --authorizer="local" --cgroups_cpu_enable_pids_and_tids_count="false"
--cgroups_enable_cfs="false" --cgroups_hierarchy="/sys/fs/cgroup" --cgroups_limit_swap="false"
--cgroups_root="mesos" --container_disk_watch_interval="15secs" --containerizers="mesos" --credential="/tmp/Endpoint_SlaveEndpointTest_NoAuthorizer_1_nymhiH/credential"
--default_role="*" --disk_watch_interval="1mins" --docker="docker" --docker_kill_orphans="true"
--docker_registry="https://registry-1.docker.io" --docker_remove_delay="6hrs" --docker_socket="/var/run/docker.sock"
--docker_stop_timeout="0ns" --docker_store_dir="/tmp/mesos/store/docker" --docker_volume_checkpoint_dir="/var/run/mesos/isolators/docker/volume"
--enforce_container_disk_quota="false" --executor_registration_timeout="1mins" --executor_shutdown_grace_period="5secs"
--fetcher_cache_dir="/tmp/Endpoint_SlaveEndpointTest_NoAuthorizer_1_nymhiH/fetch" --fetcher_cache_size="2GB"
--frameworks_home="" --gc_delay="1weeks" --gc_disk_headroom="0.1" --hadoop_home="" --help="false"
--hostname_lookup="true" --http_authenticators="basic" --http_command_executor="false" --http_credentials="/tmp/Endpoint_SlaveEndpointTest_NoAuthorizer_1_nymhiH/http_credentials"
--image_provisioner_backend="copy" --initialize_driver_logging="true" --isolation="posix/cpu,posix/mem"
--launcher="posix" --launcher_dir="/mesos/mesos-1.2.0/_build/src" --logbufsecs="0" --logging_level="INFO"
--max_completed_executors_per_framework="150" --oversubscribed_resources_interval="15secs"
--perf_duration="10secs" --perf_interval="1mins" --qos_correction_interval_min="0ns" --quiet="false"
--recover="reconnect" --recovery_timeout="15mins" --registration_backoff_factor="10ms" --resources="cpus:2;gpus:0;mem:1024;disk:1024;ports:[31000-32000]"
--revocable_cpu_low_priority="true" --runtime_dir="/tmp/Endpoint_SlaveEndpointTest_NoAuthorizer_1_nymhiH"
--sandbox_directory="/mnt/mesos/sandbox" --strict="true" --switch_user="true" --systemd_enable_support="true"
--systemd_runtime_directory="/run/systemd/system" --version="false" --work_dir="/tmp/Endpoint_SlaveEndpointTest_NoAuthorizer_1_QMdYnF"
I1117 01:37:25.521111 31954 credentials.hpp:86] Loading credential for authentication from
'/tmp/Endpoint_SlaveEndpointTest_NoAuthorizer_1_nymhiH/credential'
I1117 01:37:25.521281 31954 slave.cpp:346] Agent using credential for: test-principal
I1117 01:37:25.521306 31954 credentials.hpp:37] Loading credentials for authentication from
'/tmp/Endpoint_SlaveEndpointTest_NoAuthorizer_1_nymhiH/http_credentials'
I1117 01:37:25.521569 31954 http.cpp:895] Using default 'basic' HTTP authenticator for realm
'mesos-agent-readonly'
I1117 01:37:25.521700 31954 http.cpp:895] Using default 'basic' HTTP authenticator for realm
'mesos-agent-readwrite'
I1117 01:37:25.522974 31954 slave.cpp:533] Agent resources: cpus(*):2; mem(*):1024; disk(*):1024;
ports(*):[31000-32000]
I1117 01:37:25.523072 31954 slave.cpp:541] Agent attributes: [  ]
I1117 01:37:25.523087 31954 slave.cpp:546] Agent hostname: 699184c85fed
I1117 01:37:25.524461 31953 state.cpp:57] Recovering state from '/tmp/Endpoint_SlaveEndpointTest_NoAuthorizer_1_QMdYnF/meta'
I1117 01:37:25.524752 31964 status_update_manager.cpp:203] Recovering status update manager
I1117 01:37:25.525231 31959 containerizer.cpp:561] Recovering containerizer
I1117 01:37:25.526881 31961 provisioner.cpp:253] Provisioner recovery complete
I1117 01:37:25.527377 31959 slave.cpp:5411] Finished recovery
I1117 01:37:25.527923 31959 slave.cpp:5585] Querying resource estimator for oversubscribable
resources
I1117 01:37:25.528262 31965 slave.cpp:5599] Received oversubscribable resources {} from the
resource estimator
I1117 01:37:25.530107 31957 process.cpp:3570] Handling HTTP event for process 'slave(649)'
with path: '/slave(649)/monitor/statistics.json'
I1117 01:37:25.531575 31965 http.cpp:847] Authorizing principal 'test-principal' to GET the
'/monitor/statistics.json' endpoint
I1117 01:37:25.535339 31957 slave.cpp:787] Agent terminating
[       OK ] Endpoint/SlaveEndpointTest.NoAuthorizer/1 (29 ms)
[ RUN      ] Endpoint/SlaveEndpointTest.NoAuthorizer/2
I1117 01:37:25.546726 31933 containerizer.cpp:202] Using isolation: posix/cpu,posix/mem,filesystem/posix,network/cni
W1117 01:37:25.547220 31933 backend.cpp:76] Failed to create 'aufs' backend: AufsBackend requires
root privileges, but is running as user mesos
W1117 01:37:25.547407 31933 backend.cpp:76] Failed to create 'bind' backend: BindBackend requires
root privileges
I1117 01:37:25.548594 31933 cluster.cpp:435] Creating default 'local' authorizer
I1117 01:37:25.550153 31961 slave.cpp:208] Mesos agent started on (650)@172.17.0.2:32956
I1117 01:37:25.550179 31961 slave.cpp:209] Flags at startup: --acls="" --appc_simple_discovery_uri_prefix="http://"
--appc_store_dir="/tmp/mesos/store/appc" --authenticate_http_readonly="true" --authenticate_http_readwrite="true"
--authenticatee="crammd5" --authentication_backoff_factor="1secs" --authorizer="local" --cgroups_cpu_enable_pids_and_tids_count="false"
--cgroups_enable_cfs="false" --cgroups_hierarchy="/sys/fs/cgroup" --cgroups_limit_swap="false"
--cgroups_root="mesos" --container_disk_watch_interval="15secs" --containerizers="mesos" --credential="/tmp/Endpoint_SlaveEndpointTest_NoAuthorizer_2_NPZXbP/credential"
--default_role="*" --disk_watch_interval="1mins" --docker="docker" --docker_kill_orphans="true"
--docker_registry="https://registry-1.docker.io" --docker_remove_delay="6hrs" --docker_socket="/var/run/docker.sock"
--docker_stop_timeout="0ns" --docker_store_dir="/tmp/mesos/store/docker" --docker_volume_checkpoint_dir="/var/run/mesos/isolators/docker/volume"
--enforce_container_disk_quota="false" --executor_registration_timeout="1mins" --executor_shutdown_grace_period="5secs"
--fetcher_cache_dir="/tmp/Endpoint_SlaveEndpointTest_NoAuthorizer_2_NPZXbP/fetch" --fetcher_cache_size="2GB"
--frameworks_home="" --gc_delay="1weeks" --gc_disk_headroom="0.1" --hadoop_home="" --help="false"
--hostname_lookup="true" --http_authenticators="basic" --http_command_executor="false" --http_credentials="/tmp/Endpoint_SlaveEndpointTest_NoAuthorizer_2_NPZXbP/http_credentials"
--image_provisioner_backend="copy" --initialize_driver_logging="true" --isolation="posix/cpu,posix/mem"
--launcher="posix" --launcher_dir="/mesos/mesos-1.2.0/_build/src" --logbufsecs="0" --logging_level="INFO"
--max_completed_executors_per_framework="150" --oversubscribed_resources_interval="15secs"
--perf_duration="10secs" --perf_interval="1mins" --qos_correction_interval_min="0ns" --quiet="false"
--recover="reconnect" --recovery_timeout="15mins" --registration_backoff_factor="10ms" --resources="cpus:2;gpus:0;mem:1024;disk:1024;ports:[31000-32000]"
--revocable_cpu_low_priority="true" --runtime_dir="/tmp/Endpoint_SlaveEndpointTest_NoAuthorizer_2_NPZXbP"
--sandbox_directory="/mnt/mesos/sandbox" --strict="true" --switch_user="true" --systemd_enable_support="true"
--systemd_runtime_directory="/run/systemd/system" --version="false" --work_dir="/tmp/Endpoint_SlaveEndpointTest_NoAuthorizer_2_QlPNcN"
I1117 01:37:25.550604 31961 credentials.hpp:86] Loading credential for authentication from
'/tmp/Endpoint_SlaveEndpointTest_NoAuthorizer_2_NPZXbP/credential'
I1117 01:37:25.550781 31961 slave.cpp:346] Agent using credential for: test-principal
I1117 01:37:25.550809 31961 credentials.hpp:37] Loading credentials for authentication from
'/tmp/Endpoint_SlaveEndpointTest_NoAuthorizer_2_NPZXbP/http_credentials'
I1117 01:37:25.551089 31961 http.cpp:895] Using default 'basic' HTTP authenticator for realm
'mesos-agent-readonly'
I1117 01:37:25.551254 31961 http.cpp:895] Using default 'basic' HTTP authenticator for realm
'mesos-agent-readwrite'
I1117 01:37:25.552788 31961 slave.cpp:533] Agent resources: cpus(*):2; mem(*):1024; disk(*):1024;
ports(*):[31000-32000]
I1117 01:37:25.552892 31961 slave.cpp:541] Agent attributes: [  ]
I1117 01:37:25.552908 31961 slave.cpp:546] Agent hostname: 699184c85fed
I1117 01:37:25.554410 31967 state.cpp:57] Recovering state from '/tmp/Endpoint_SlaveEndpointTest_NoAuthorizer_2_QlPNcN/meta'
I1117 01:37:25.554870 31964 status_update_manager.cpp:203] Recovering status update manager
I1117 01:37:25.555142 31961 containerizer.cpp:561] Recovering containerizer
I1117 01:37:25.556720 31962 provisioner.cpp:253] Provisioner recovery complete
I1117 01:37:25.557142 31956 slave.cpp:5411] Finished recovery
I1117 01:37:25.557832 31956 slave.cpp:5585] Querying resource estimator for oversubscribable
resources
I1117 01:37:25.558120 31962 slave.cpp:5599] Received oversubscribable resources {} from the
resource estimator
I1117 01:37:25.560006 31963 process.cpp:3570] Handling HTTP event for process 'slave(650)'
with path: '/slave(650)/containers'
I1117 01:37:25.561002 31959 http.cpp:847] Authorizing principal 'test-principal' to GET the
'/containers' endpoint
I1117 01:37:25.564795 31952 slave.cpp:787] Agent terminating
[       OK ] Endpoint/SlaveEndpointTest.NoAuthorizer/2 (29 ms)
[----------] 9 tests from Endpoint/SlaveEndpointTest (278 ms total)

[----------] Global test environment tear-down
[==========] 1371 tests from 155 test cases ran. (556667 ms total)
[  PASSED  ] 1369 tests.
[  FAILED  ] 2 tests, listed below:
[  FAILED  ] SlaveTest.ShutdownUnregisteredExecutor
[  FAILED  ] ContentType/ExecutorHttpApiTest.NoAcceptHeader/1, where GetParam() = application/json

 2 FAILED TESTS
  YOU HAVE 4 DISABLED TESTS

make[4]: *** [check-local] Error 1
make[4]: Leaving directory `/mesos/mesos-1.2.0/_build/src'
make[3]: *** [check-am] Error 2
make[3]: Leaving directory `/mesos/mesos-1.2.0/_build/src'
make[2]: *** [check] Error 2
make[2]: Leaving directory `/mesos/mesos-1.2.0/_build/src'
make[1]: *** [check-recursive] Error 1
make[1]: Leaving directory `/mesos/mesos-1.2.0/_build'
make: *** [distcheck] Error 1
+ docker rmi mesos-1479344155-28543
Untagged: mesos-1479344155-28543:latest
Deleted: sha256:8a9780aa5ed251e3f1b07022169512ae9540097046ffbd64907dee98c6c3e324
Deleted: sha256:64a71f4d257cad1c5aaed72c7c06ffd2376f9321f486de4676e725c9e00bf2ac
Deleted: sha256:0fac146badb163f19d4f200637d94c14ee4fc0b0969eb166b661be9633ea9d70
Deleted: sha256:d56096c52d4bbe838e68518f3f595688037803332a04abe13d909038d7474203
Deleted: sha256:f389b023a6367c2ee69a68542626442092254efbe956ef854d90740e2fb21e41
Deleted: sha256:1bbe34dd8f6777da21a6d5110f93d5ec7bad9b75f611f926d98cbf00bce7c6ac
Deleted: sha256:0bdff15b6f3d1dd9259e6547d0a6490e742bafbf7b5096079d1aba7f125e46c3
Deleted: sha256:26ba6152baa9ba7218db2fe3b29c12105d3c9feab13e1268fb2bd2c9001a2ac0
Deleted: sha256:e385dd5f85356b40e9ba6b8ac1e562addbffb5a372d86243d3e478b20856e944
Deleted: sha256:990b381550031b5af19bfa2b8791119c1bd8f4c481a39a3f3f2c249659a68f49
Deleted: sha256:42b5b1e560fe12cd582cd218f8f594f7fc1c8c447679ac672e4278be89e040e5
Deleted: sha256:b439dee9101b7a5e01cbae331408ab6779494f3bd3ac2c098a0fe162af250e46
Deleted: sha256:6bb559039ba980c19561030cd27006b7c9d1edaa4a8ed91df266f2695f713b3a
Deleted: sha256:731aff22c61b0fba5dbce90cef0b1f983ce4095b0c334818d03c7d63b5bc57f7
Deleted: sha256:e89a923784890ad3c552f76c778ae170b5d32efc72d237ede9aebfafb274de43
Deleted: sha256:1f6f6080ed28f3ad13041d98992cf12500cf764cc4612da65a354945a037416a
Deleted: sha256:d5130a66e7e08306b8cd6db213990d92991bbf3047dbac63786d870d5d3247d6
Deleted: sha256:da534b8f78a082ae50dbaa7a09c6a486473d47f3575cc540894ab6dcfb00f9b1
Deleted: sha256:5967e34823a03c1a13d42d688c588dff361adc5c673bf91b1c78f812c0a0d383
Deleted: sha256:27f56072d2f2f58355a9c68510f6d6808a523eb5a493b545eb5ad1268395b8e8
Deleted: sha256:66b7729f0b3f2891734f6f130789b8fd2e8e793d4122f57f8057aa5ca2f6f8f9
Deleted: sha256:4a6d890089f609eb63f5fe028e812181d718f80ebc5386ccd1bc6bb68866b654
Deleted: sha256:629c51d72abc7482b21b2c1b9ebf32ebd9e521a26bf20fb1567ef3cbfc782f2a
Deleted: sha256:0506bc9a68410acb7198cfd121c8773a80cc03611e3b3f8c30f92300802439da
Deleted: sha256:f8d83ac623a782b391d244f0831a27edc11e1af9d3a3bb4a5b2ec404d8a14e6c
Build step 'Execute shell' marked build as failure

Mime
View raw message