mesos-builds mailing list archives

Site index · List index
Message view « Date » · « Thread »
Top « Date » · « Thread »
From Apache Jenkins Server <jenk...@builds.apache.org>
Subject Build failed in Jenkins: mesos-reviewbot #16076
Date Tue, 15 Nov 2016 05:39:39 GMT
See <https://builds.apache.org/job/mesos-reviewbot/16076/>

------------------------------------------
[...truncated 223248 lines...]
I1115 05:38:55.476204 29702 containerizer.cpp:202] Using isolation: posix/cpu,posix/mem,filesystem/posix,network/cni
W1115 05:38:55.477252 29702 backend.cpp:76] Failed to create 'aufs' backend: AufsBackend requires
root privileges, but is running as user mesos
W1115 05:38:55.477516 29702 backend.cpp:76] Failed to create 'bind' backend: BindBackend requires
root privileges
I1115 05:38:55.491870 29728 slave.cpp:208] Mesos agent started on (644)@172.17.0.3:42132
I1115 05:38:55.491925 29728 slave.cpp:209] Flags at startup: --acls="" --appc_simple_discovery_uri_prefix="http://"
--appc_store_dir="/tmp/mesos/store/appc" --authenticate_http_readonly="true" --authenticate_http_readwrite="true"
--authenticatee="crammd5" --authentication_backoff_factor="1secs" --authorizer="local" --cgroups_cpu_enable_pids_and_tids_count="false"
--cgroups_enable_cfs="false" --cgroups_hierarchy="/sys/fs/cgroup" --cgroups_limit_swap="false"
--cgroups_root="mesos" --container_disk_watch_interval="15secs" --containerizers="mesos" --credential="/tmp/Endpoint_SlaveEndpointTest_AuthorizedRequest_1_HmBUox/credential"
--default_role="*" --disk_watch_interval="1mins" --docker="docker" --docker_kill_orphans="true"
--docker_registry="https://registry-1.docker.io" --docker_remove_delay="6hrs" --docker_socket="/var/run/docker.sock"
--docker_stop_timeout="0ns" --docker_store_dir="/tmp/mesos/store/docker" --docker_volume_checkpoint_dir="/var/run/mesos/isolators/docker/volume"
--enforce_container_disk_quota="false" --executor_registration_timeout="1mins" --executor_shutdown_grace_period="5secs"
--fetcher_cache_dir="/tmp/Endpoint_SlaveEndpointTest_AuthorizedRequest_1_HmBUox/fetch" --fetcher_cache_size="2GB"
--frameworks_home="" --gc_delay="1weeks" --gc_disk_headroom="0.1" --hadoop_home="" --help="false"
--hostname_lookup="true" --http_authenticators="basic" --http_command_executor="false" --http_credentials="/tmp/Endpoint_SlaveEndpointTest_AuthorizedRequest_1_HmBUox/http_credentials"
--image_provisioner_backend="copy" --initialize_driver_logging="true" --isolation="posix/cpu,posix/mem"
--launcher="posix" --launcher_dir="/mesos/mesos-1.2.0/_build/src" --logbufsecs="0" --logging_level="INFO"
--max_completed_executors_per_framework="150" --oversubscribed_resources_interval="15secs"
--perf_duration="10secs" --perf_interval="1mins" --qos_correction_interval_min="0ns" --quiet="false"
--recover="reconnect" --recovery_timeout="15mins" --registration_backoff_factor="10ms" --resources="cpus:2;gpus:0;mem:1024;disk:1024;ports:[31000-32000]"
--revocable_cpu_low_priority="true" --runtime_dir="/tmp/Endpoint_SlaveEndpointTest_AuthorizedRequest_1_HmBUox"
--sandbox_directory="/mnt/mesos/sandbox" --strict="true" --switch_user="true" --systemd_enable_support="true"
--systemd_runtime_directory="/run/systemd/system" --version="false" --work_dir="/tmp/Endpoint_SlaveEndpointTest_AuthorizedRequest_1_EcSVp9"
I1115 05:38:55.492758 29728 credentials.hpp:86] Loading credential for authentication from
'/tmp/Endpoint_SlaveEndpointTest_AuthorizedRequest_1_HmBUox/credential'
I1115 05:38:55.493062 29728 slave.cpp:346] Agent using credential for: test-principal
I1115 05:38:55.493088 29728 credentials.hpp:37] Loading credentials for authentication from
'/tmp/Endpoint_SlaveEndpointTest_AuthorizedRequest_1_HmBUox/http_credentials'
I1115 05:38:55.493433 29728 http.cpp:895] Using default 'basic' HTTP authenticator for realm
'mesos-agent-readonly'
I1115 05:38:55.493662 29728 http.cpp:895] Using default 'basic' HTTP authenticator for realm
'mesos-agent-readwrite'
I1115 05:38:55.495239 29728 slave.cpp:533] Agent resources: cpus(*):2; mem(*):1024; disk(*):1024;
ports(*):[31000-32000]
I1115 05:38:55.495353 29728 slave.cpp:541] Agent attributes: [  ]
I1115 05:38:55.495373 29728 slave.cpp:546] Agent hostname: bc958f9f2d1d
I1115 05:38:55.499058 29728 state.cpp:57] Recovering state from '/tmp/Endpoint_SlaveEndpointTest_AuthorizedRequest_1_EcSVp9/meta'
I1115 05:38:55.503864 29728 status_update_manager.cpp:203] Recovering status update manager
I1115 05:38:55.504199 29728 containerizer.cpp:561] Recovering containerizer
I1115 05:38:55.506822 29728 provisioner.cpp:253] Provisioner recovery complete
I1115 05:38:55.507519 29728 slave.cpp:5411] Finished recovery
I1115 05:38:55.508554 29728 slave.cpp:5585] Querying resource estimator for oversubscribable
resources
I1115 05:38:55.509260 29728 slave.cpp:5599] Received oversubscribable resources {} from the
resource estimator
I1115 05:38:55.519861 29728 process.cpp:3570] Handling HTTP event for process 'slave(644)'
with path: '/slave(644)/monitor/statistics.json'
I1115 05:38:55.521426 29722 http.cpp:847] Authorizing principal 'test-principal' to GET the
'/monitor/statistics.json' endpoint
I1115 05:38:55.541559 29729 slave.cpp:787] Agent terminating
[       OK ] Endpoint/SlaveEndpointTest.AuthorizedRequest/1 (124 ms)
[ RUN      ] Endpoint/SlaveEndpointTest.AuthorizedRequest/2
I1115 05:38:55.595741 29702 containerizer.cpp:202] Using isolation: posix/cpu,posix/mem,filesystem/posix,network/cni
W1115 05:38:55.597929 29702 backend.cpp:76] Failed to create 'aufs' backend: AufsBackend requires
root privileges, but is running as user mesos
W1115 05:38:55.598281 29702 backend.cpp:76] Failed to create 'bind' backend: BindBackend requires
root privileges
I1115 05:38:55.605919 29735 slave.cpp:208] Mesos agent started on (645)@172.17.0.3:42132
I1115 05:38:55.605976 29735 slave.cpp:209] Flags at startup: --acls="" --appc_simple_discovery_uri_prefix="http://"
--appc_store_dir="/tmp/mesos/store/appc" --authenticate_http_readonly="true" --authenticate_http_readwrite="true"
--authenticatee="crammd5" --authentication_backoff_factor="1secs" --authorizer="local" --cgroups_cpu_enable_pids_and_tids_count="false"
--cgroups_enable_cfs="false" --cgroups_hierarchy="/sys/fs/cgroup" --cgroups_limit_swap="false"
--cgroups_root="mesos" --container_disk_watch_interval="15secs" --containerizers="mesos" --credential="/tmp/Endpoint_SlaveEndpointTest_AuthorizedRequest_2_eQ3sp6/credential"
--default_role="*" --disk_watch_interval="1mins" --docker="docker" --docker_kill_orphans="true"
--docker_registry="https://registry-1.docker.io" --docker_remove_delay="6hrs" --docker_socket="/var/run/docker.sock"
--docker_stop_timeout="0ns" --docker_store_dir="/tmp/mesos/store/docker" --docker_volume_checkpoint_dir="/var/run/mesos/isolators/docker/volume"
--enforce_container_disk_quota="false" --executor_registration_timeout="1mins" --executor_shutdown_grace_period="5secs"
--fetcher_cache_dir="/tmp/Endpoint_SlaveEndpointTest_AuthorizedRequest_2_eQ3sp6/fetch" --fetcher_cache_size="2GB"
--frameworks_home="" --gc_delay="1weeks" --gc_disk_headroom="0.1" --hadoop_home="" --help="false"
--hostname_lookup="true" --http_authenticators="basic" --http_command_executor="false" --http_credentials="/tmp/Endpoint_SlaveEndpointTest_AuthorizedRequest_2_eQ3sp6/http_credentials"
--image_provisioner_backend="copy" --initialize_driver_logging="true" --isolation="posix/cpu,posix/mem"
--launcher="posix" --launcher_dir="/mesos/mesos-1.2.0/_build/src" --logbufsecs="0" --logging_level="INFO"
--max_completed_executors_per_framework="150" --oversubscribed_resources_interval="15secs"
--perf_duration="10secs" --perf_interval="1mins" --qos_correction_interval_min="0ns" --quiet="false"
--recover="reconnect" --recovery_timeout="15mins" --registration_backoff_factor="10ms" --resources="cpus:2;gpus:0;mem:1024;disk:1024;ports:[31000-32000]"
--revocable_cpu_low_priority="true" --runtime_dir="/tmp/Endpoint_SlaveEndpointTest_AuthorizedRequest_2_eQ3sp6"
--sandbox_directory="/mnt/mesos/sandbox" --strict="true" --switch_user="true" --systemd_enable_support="true"
--systemd_runtime_directory="/run/systemd/system" --version="false" --work_dir="/tmp/Endpoint_SlaveEndpointTest_AuthorizedRequest_2_3bbi6H"
I1115 05:38:55.606772 29735 credentials.hpp:86] Loading credential for authentication from
'/tmp/Endpoint_SlaveEndpointTest_AuthorizedRequest_2_eQ3sp6/credential'
I1115 05:38:55.607062 29735 slave.cpp:346] Agent using credential for: test-principal
I1115 05:38:55.607095 29735 credentials.hpp:37] Loading credentials for authentication from
'/tmp/Endpoint_SlaveEndpointTest_AuthorizedRequest_2_eQ3sp6/http_credentials'
I1115 05:38:55.607415 29735 http.cpp:895] Using default 'basic' HTTP authenticator for realm
'mesos-agent-readonly'
I1115 05:38:55.607642 29735 http.cpp:895] Using default 'basic' HTTP authenticator for realm
'mesos-agent-readwrite'
I1115 05:38:55.609235 29735 slave.cpp:533] Agent resources: cpus(*):2; mem(*):1024; disk(*):1024;
ports(*):[31000-32000]
I1115 05:38:55.609362 29735 slave.cpp:541] Agent attributes: [  ]
I1115 05:38:55.609382 29735 slave.cpp:546] Agent hostname: bc958f9f2d1d
I1115 05:38:55.612010 29736 state.cpp:57] Recovering state from '/tmp/Endpoint_SlaveEndpointTest_AuthorizedRequest_2_3bbi6H/meta'
I1115 05:38:55.612555 29736 status_update_manager.cpp:203] Recovering status update manager
I1115 05:38:55.612766 29736 containerizer.cpp:561] Recovering containerizer
I1115 05:38:55.614470 29736 provisioner.cpp:253] Provisioner recovery complete
I1115 05:38:55.615020 29736 slave.cpp:5411] Finished recovery
I1115 05:38:55.615659 29736 slave.cpp:5585] Querying resource estimator for oversubscribable
resources
I1115 05:38:55.616569 29736 slave.cpp:5599] Received oversubscribable resources {} from the
resource estimator
I1115 05:38:55.620923 29730 process.cpp:3570] Handling HTTP event for process 'slave(645)'
with path: '/slave(645)/containers'
I1115 05:38:55.622589 29730 http.cpp:847] Authorizing principal 'test-principal' to GET the
'/containers' endpoint
I1115 05:38:55.636488 29734 slave.cpp:787] Agent terminating
[       OK ] Endpoint/SlaveEndpointTest.AuthorizedRequest/2 (90 ms)
[ RUN      ] Endpoint/SlaveEndpointTest.UnauthorizedRequest/0
I1115 05:38:55.690759 29702 containerizer.cpp:202] Using isolation: posix/cpu,posix/mem,filesystem/posix,network/cni
W1115 05:38:55.692914 29702 backend.cpp:76] Failed to create 'aufs' backend: AufsBackend requires
root privileges, but is running as user mesos
W1115 05:38:55.696378 29702 backend.cpp:76] Failed to create 'bind' backend: BindBackend requires
root privileges
I1115 05:38:55.702430 29733 slave.cpp:208] Mesos agent started on (646)@172.17.0.3:42132
I1115 05:38:55.702486 29733 slave.cpp:209] Flags at startup: --acls="" --appc_simple_discovery_uri_prefix="http://"
--appc_store_dir="/tmp/mesos/store/appc" --authenticate_http_readonly="true" --authenticate_http_readwrite="true"
--authenticatee="crammd5" --authentication_backoff_factor="1secs" --authorizer="local" --cgroups_cpu_enable_pids_and_tids_count="false"
--cgroups_enable_cfs="false" --cgroups_hierarchy="/sys/fs/cgroup" --cgroups_limit_swap="false"
--cgroups_root="mesos" --container_disk_watch_interval="15secs" --containerizers="mesos" --credential="/tmp/Endpoint_SlaveEndpointTest_UnauthorizedRequest_0_OmwBpG/credential"
--default_role="*" --disk_watch_interval="1mins" --docker="docker" --docker_kill_orphans="true"
--docker_registry="https://registry-1.docker.io" --docker_remove_delay="6hrs" --docker_socket="/var/run/docker.sock"
--docker_stop_timeout="0ns" --docker_store_dir="/tmp/mesos/store/docker" --docker_volume_checkpoint_dir="/var/run/mesos/isolators/docker/volume"
--enforce_container_disk_quota="false" --executor_registration_timeout="1mins" --executor_shutdown_grace_period="5secs"
--fetcher_cache_dir="/tmp/Endpoint_SlaveEndpointTest_UnauthorizedRequest_0_OmwBpG/fetch" --fetcher_cache_size="2GB"
--frameworks_home="" --gc_delay="1weeks" --gc_disk_headroom="0.1" --hadoop_home="" --help="false"
--hostname_lookup="true" --http_authenticators="basic" --http_command_executor="false" --http_credentials="/tmp/Endpoint_SlaveEndpointTest_UnauthorizedRequest_0_OmwBpG/http_credentials"
--image_provisioner_backend="copy" --initialize_driver_logging="true" --isolation="posix/cpu,posix/mem"
--launcher="posix" --launcher_dir="/mesos/mesos-1.2.0/_build/src" --logbufsecs="0" --logging_level="INFO"
--max_completed_executors_per_framework="150" --oversubscribed_resources_interval="15secs"
--perf_duration="10secs" --perf_interval="1mins" --qos_correction_interval_min="0ns" --quiet="false"
--recover="reconnect" --recovery_timeout="15mins" --registration_backoff_factor="10ms" --resources="cpus:2;gpus:0;mem:1024;disk:1024;ports:[31000-32000]"
--revocable_cpu_low_priority="true" --runtime_dir="/tmp/Endpoint_SlaveEndpointTest_UnauthorizedRequest_0_OmwBpG"
--sandbox_directory="/mnt/mesos/sandbox" --strict="true" --switch_user="true" --systemd_enable_support="true"
--systemd_runtime_directory="/run/systemd/system" --version="false" --work_dir="/tmp/Endpoint_SlaveEndpointTest_UnauthorizedRequest_0_QVPHRh"
I1115 05:38:55.703215 29733 credentials.hpp:86] Loading credential for authentication from
'/tmp/Endpoint_SlaveEndpointTest_UnauthorizedRequest_0_OmwBpG/credential'
I1115 05:38:55.703511 29733 slave.cpp:346] Agent using credential for: test-principal
I1115 05:38:55.703541 29733 credentials.hpp:37] Loading credentials for authentication from
'/tmp/Endpoint_SlaveEndpointTest_UnauthorizedRequest_0_OmwBpG/http_credentials'
I1115 05:38:55.703871 29733 http.cpp:895] Using default 'basic' HTTP authenticator for realm
'mesos-agent-readonly'
I1115 05:38:55.704093 29733 http.cpp:895] Using default 'basic' HTTP authenticator for realm
'mesos-agent-readwrite'
I1115 05:38:55.705590 29733 slave.cpp:533] Agent resources: cpus(*):2; mem(*):1024; disk(*):1024;
ports(*):[31000-32000]
I1115 05:38:55.705729 29733 slave.cpp:541] Agent attributes: [  ]
I1115 05:38:55.705750 29733 slave.cpp:546] Agent hostname: bc958f9f2d1d
I1115 05:38:55.708905 29729 state.cpp:57] Recovering state from '/tmp/Endpoint_SlaveEndpointTest_UnauthorizedRequest_0_QVPHRh/meta'
I1115 05:38:55.716226 29732 status_update_manager.cpp:203] Recovering status update manager
I1115 05:38:55.716583 29728 containerizer.cpp:561] Recovering containerizer
I1115 05:38:55.718605 29734 provisioner.cpp:253] Provisioner recovery complete
I1115 05:38:55.719185 29734 slave.cpp:5411] Finished recovery
I1115 05:38:55.719812 29734 slave.cpp:5585] Querying resource estimator for oversubscribable
resources
I1115 05:38:55.720356 29728 slave.cpp:5599] Received oversubscribable resources {} from the
resource estimator
I1115 05:38:55.728839 29734 process.cpp:3570] Handling HTTP event for process 'slave(646)'
with path: '/slave(646)/monitor/statistics'
I1115 05:38:55.730265 29734 http.cpp:847] Authorizing principal 'test-principal' to GET the
'/monitor/statistics' endpoint
I1115 05:38:55.744818 29702 slave.cpp:787] Agent terminating
[       OK ] Endpoint/SlaveEndpointTest.UnauthorizedRequest/0 (101 ms)
[ RUN      ] Endpoint/SlaveEndpointTest.UnauthorizedRequest/1
I1115 05:38:55.788439 29702 containerizer.cpp:202] Using isolation: posix/cpu,posix/mem,filesystem/posix,network/cni
W1115 05:38:55.789569 29702 backend.cpp:76] Failed to create 'aufs' backend: AufsBackend requires
root privileges, but is running as user mesos
W1115 05:38:55.789926 29702 backend.cpp:76] Failed to create 'bind' backend: BindBackend requires
root privileges
I1115 05:38:55.797646 29724 slave.cpp:208] Mesos agent started on (647)@172.17.0.3:42132
I1115 05:38:55.797698 29724 slave.cpp:209] Flags at startup: --acls="" --appc_simple_discovery_uri_prefix="http://"
--appc_store_dir="/tmp/mesos/store/appc" --authenticate_http_readonly="true" --authenticate_http_readwrite="true"
--authenticatee="crammd5" --authentication_backoff_factor="1secs" --authorizer="local" --cgroups_cpu_enable_pids_and_tids_count="false"
--cgroups_enable_cfs="false" --cgroups_hierarchy="/sys/fs/cgroup" --cgroups_limit_swap="false"
--cgroups_root="mesos" --container_disk_watch_interval="15secs" --containerizers="mesos" --credential="/tmp/Endpoint_SlaveEndpointTest_UnauthorizedRequest_1_favquh/credential"
--default_role="*" --disk_watch_interval="1mins" --docker="docker" --docker_kill_orphans="true"
--docker_registry="https://registry-1.docker.io" --docker_remove_delay="6hrs" --docker_socket="/var/run/docker.sock"
--docker_stop_timeout="0ns" --docker_store_dir="/tmp/mesos/store/docker" --docker_volume_checkpoint_dir="/var/run/mesos/isolators/docker/volume"
--enforce_container_disk_quota="false" --executor_registration_timeout="1mins" --executor_shutdown_grace_period="5secs"
--fetcher_cache_dir="/tmp/Endpoint_SlaveEndpointTest_UnauthorizedRequest_1_favquh/fetch" --fetcher_cache_size="2GB"
--frameworks_home="" --gc_delay="1weeks" --gc_disk_headroom="0.1" --hadoop_home="" --help="false"
--hostname_lookup="true" --http_authenticators="basic" --http_command_executor="false" --http_credentials="/tmp/Endpoint_SlaveEndpointTest_UnauthorizedRequest_1_favquh/http_credentials"
--image_provisioner_backend="copy" --initialize_driver_logging="true" --isolation="posix/cpu,posix/mem"
--launcher="posix" --launcher_dir="/mesos/mesos-1.2.0/_build/src" --logbufsecs="0" --logging_level="INFO"
--max_completed_executors_per_framework="150" --oversubscribed_resources_interval="15secs"
--perf_duration="10secs" --perf_interval="1mins" --qos_correction_interval_min="0ns" --quiet="false"
--recover="reconnect" --recovery_timeout="15mins" --registration_backoff_factor="10ms" --resources="cpus:2;gpus:0;mem:1024;disk:1024;ports:[31000-32000]"
--revocable_cpu_low_priority="true" --runtime_dir="/tmp/Endpoint_SlaveEndpointTest_UnauthorizedRequest_1_favquh"
--sandbox_directory="/mnt/mesos/sandbox" --strict="true" --switch_user="true" --systemd_enable_support="true"
--systemd_runtime_directory="/run/systemd/system" --version="false" --work_dir="/tmp/Endpoint_SlaveEndpointTest_UnauthorizedRequest_1_KCNVFS"
I1115 05:38:55.798441 29724 credentials.hpp:86] Loading credential for authentication from
'/tmp/Endpoint_SlaveEndpointTest_UnauthorizedRequest_1_favquh/credential'
I1115 05:38:55.798692 29724 slave.cpp:346] Agent using credential for: test-principal
I1115 05:38:55.798717 29724 credentials.hpp:37] Loading credentials for authentication from
'/tmp/Endpoint_SlaveEndpointTest_UnauthorizedRequest_1_favquh/http_credentials'
I1115 05:38:55.799005 29724 http.cpp:895] Using default 'basic' HTTP authenticator for realm
'mesos-agent-readonly'
I1115 05:38:55.799183 29724 http.cpp:895] Using default 'basic' HTTP authenticator for realm
'mesos-agent-readwrite'
I1115 05:38:55.800760 29724 slave.cpp:533] Agent resources: cpus(*):2; mem(*):1024; disk(*):1024;
ports(*):[31000-32000]
I1115 05:38:55.800942 29724 slave.cpp:541] Agent attributes: [  ]
I1115 05:38:55.800966 29724 slave.cpp:546] Agent hostname: bc958f9f2d1d
I1115 05:38:55.803694 29732 state.cpp:57] Recovering state from '/tmp/Endpoint_SlaveEndpointTest_UnauthorizedRequest_1_KCNVFS/meta'
I1115 05:38:55.804095 29725 status_update_manager.cpp:203] Recovering status update manager
I1115 05:38:55.804327 29725 containerizer.cpp:561] Recovering containerizer
I1115 05:38:55.812494 29732 provisioner.cpp:253] Provisioner recovery complete
I1115 05:38:55.813662 29732 slave.cpp:5411] Finished recovery
I1115 05:38:55.814528 29732 slave.cpp:5585] Querying resource estimator for oversubscribable
resources
I1115 05:38:55.815518 29732 slave.cpp:5599] Received oversubscribable resources {} from the
resource estimator
I1115 05:38:55.828188 29735 process.cpp:3570] Handling HTTP event for process 'slave(647)'
with path: '/slave(647)/monitor/statistics.json'
I1115 05:38:55.829676 29723 http.cpp:847] Authorizing principal 'test-principal' to GET the
'/monitor/statistics.json' endpoint
I1115 05:38:55.840595 29727 slave.cpp:787] Agent terminating
[       OK ] Endpoint/SlaveEndpointTest.UnauthorizedRequest/1 (92 ms)
[ RUN      ] Endpoint/SlaveEndpointTest.UnauthorizedRequest/2
I1115 05:38:55.881093 29702 containerizer.cpp:202] Using isolation: posix/cpu,posix/mem,filesystem/posix,network/cni
W1115 05:38:55.881996 29702 backend.cpp:76] Failed to create 'aufs' backend: AufsBackend requires
root privileges, but is running as user mesos
W1115 05:38:55.882182 29702 backend.cpp:76] Failed to create 'bind' backend: BindBackend requires
root privileges
I1115 05:38:55.893839 29722 slave.cpp:208] Mesos agent started on (648)@172.17.0.3:42132
I1115 05:38:55.893893 29722 slave.cpp:209] Flags at startup: --acls="" --appc_simple_discovery_uri_prefix="http://"
--appc_store_dir="/tmp/mesos/store/appc" --authenticate_http_readonly="true" --authenticate_http_readwrite="true"
--authenticatee="crammd5" --authentication_backoff_factor="1secs" --authorizer="local" --cgroups_cpu_enable_pids_and_tids_count="false"
--cgroups_enable_cfs="false" --cgroups_hierarchy="/sys/fs/cgroup" --cgroups_limit_swap="false"
--cgroups_root="mesos" --container_disk_watch_interval="15secs" --containerizers="mesos" --credential="/tmp/Endpoint_SlaveEndpointTest_UnauthorizedRequest_2_evdTxT/credential"
--default_role="*" --disk_watch_interval="1mins" --docker="docker" --docker_kill_orphans="true"
--docker_registry="https://registry-1.docker.io" --docker_remove_delay="6hrs" --docker_socket="/var/run/docker.sock"
--docker_stop_timeout="0ns" --docker_store_dir="/tmp/mesos/store/docker" --docker_volume_checkpoint_dir="/var/run/mesos/isolators/docker/volume"
--enforce_container_disk_quota="false" --executor_registration_timeout="1mins" --executor_shutdown_grace_period="5secs"
--fetcher_cache_dir="/tmp/Endpoint_SlaveEndpointTest_UnauthorizedRequest_2_evdTxT/fetch" --fetcher_cache_size="2GB"
--frameworks_home="" --gc_delay="1weeks" --gc_disk_headroom="0.1" --hadoop_home="" --help="false"
--hostname_lookup="true" --http_authenticators="basic" --http_command_executor="false" --http_credentials="/tmp/Endpoint_SlaveEndpointTest_UnauthorizedRequest_2_evdTxT/http_credentials"
--image_provisioner_backend="copy" --initialize_driver_logging="true" --isolation="posix/cpu,posix/mem"
--launcher="posix" --launcher_dir="/mesos/mesos-1.2.0/_build/src" --logbufsecs="0" --logging_level="INFO"
--max_completed_executors_per_framework="150" --oversubscribed_resources_interval="15secs"
--perf_duration="10secs" --perf_interval="1mins" --qos_correction_interval_min="0ns" --quiet="false"
--recover="reconnect" --recovery_timeout="15mins" --registration_backoff_factor="10ms" --resources="cpus:2;gpus:0;mem:1024;disk:1024;ports:[31000-32000]"
--revocable_cpu_low_priority="true" --runtime_dir="/tmp/Endpoint_SlaveEndpointTest_UnauthorizedRequest_2_evdTxT"
--sandbox_directory="/mnt/mesos/sandbox" --strict="true" --switch_user="true" --systemd_enable_support="true"
--systemd_runtime_directory="/run/systemd/system" --version="false" --work_dir="/tmp/Endpoint_SlaveEndpointTest_UnauthorizedRequest_2_g6Ojuu"
I1115 05:38:55.894594 29722 credentials.hpp:86] Loading credential for authentication from
'/tmp/Endpoint_SlaveEndpointTest_UnauthorizedRequest_2_evdTxT/credential'
I1115 05:38:55.894865 29722 slave.cpp:346] Agent using credential for: test-principal
I1115 05:38:55.894892 29722 credentials.hpp:37] Loading credentials for authentication from
'/tmp/Endpoint_SlaveEndpointTest_UnauthorizedRequest_2_evdTxT/http_credentials'
I1115 05:38:55.895191 29722 http.cpp:895] Using default 'basic' HTTP authenticator for realm
'mesos-agent-readonly'
I1115 05:38:55.895367 29722 http.cpp:895] Using default 'basic' HTTP authenticator for realm
'mesos-agent-readwrite'
I1115 05:38:55.896910 29722 slave.cpp:533] Agent resources: cpus(*):2; mem(*):1024; disk(*):1024;
ports(*):[31000-32000]
I1115 05:38:55.897048 29722 slave.cpp:541] Agent attributes: [  ]
I1115 05:38:55.897068 29722 slave.cpp:546] Agent hostname: bc958f9f2d1d
I1115 05:38:55.900521 29733 state.cpp:57] Recovering state from '/tmp/Endpoint_SlaveEndpointTest_UnauthorizedRequest_2_g6Ojuu/meta'
I1115 05:38:55.901216 29733 status_update_manager.cpp:203] Recovering status update manager
I1115 05:38:55.901445 29733 containerizer.cpp:561] Recovering containerizer
I1115 05:38:55.903951 29733 provisioner.cpp:253] Provisioner recovery complete
I1115 05:38:55.904577 29733 slave.cpp:5411] Finished recovery
I1115 05:38:55.905213 29733 slave.cpp:5585] Querying resource estimator for oversubscribable
resources
I1115 05:38:55.905974 29733 slave.cpp:5599] Received oversubscribable resources {} from the
resource estimator
I1115 05:38:55.912001 29723 process.cpp:3570] Handling HTTP event for process 'slave(648)'
with path: '/slave(648)/containers'
I1115 05:38:55.913704 29723 http.cpp:847] Authorizing principal 'test-principal' to GET the
'/containers' endpoint
I1115 05:38:55.939875 29721 slave.cpp:787] Agent terminating
[       OK ] Endpoint/SlaveEndpointTest.UnauthorizedRequest/2 (96 ms)
[ RUN      ] Endpoint/SlaveEndpointTest.NoAuthorizer/0
I1115 05:38:55.977910 29702 containerizer.cpp:202] Using isolation: posix/cpu,posix/mem,filesystem/posix,network/cni
W1115 05:38:55.978790 29702 backend.cpp:76] Failed to create 'aufs' backend: AufsBackend requires
root privileges, but is running as user mesos
W1115 05:38:55.978983 29702 backend.cpp:76] Failed to create 'bind' backend: BindBackend requires
root privileges
I1115 05:38:55.981024 29702 cluster.cpp:435] Creating default 'local' authorizer
I1115 05:38:55.984005 29725 slave.cpp:208] Mesos agent started on (649)@172.17.0.3:42132
I1115 05:38:55.984045 29725 slave.cpp:209] Flags at startup: --acls="" --appc_simple_discovery_uri_prefix="http://"
--appc_store_dir="/tmp/mesos/store/appc" --authenticate_http_readonly="true" --authenticate_http_readwrite="true"
--authenticatee="crammd5" --authentication_backoff_factor="1secs" --authorizer="local" --cgroups_cpu_enable_pids_and_tids_count="false"
--cgroups_enable_cfs="false" --cgroups_hierarchy="/sys/fs/cgroup" --cgroups_limit_swap="false"
--cgroups_root="mesos" --container_disk_watch_interval="15secs" --containerizers="mesos" --credential="/tmp/Endpoint_SlaveEndpointTest_NoAuthorizer_0_pczZAw/credential"
--default_role="*" --disk_watch_interval="1mins" --docker="docker" --docker_kill_orphans="true"
--docker_registry="https://registry-1.docker.io" --docker_remove_delay="6hrs" --docker_socket="/var/run/docker.sock"
--docker_stop_timeout="0ns" --docker_store_dir="/tmp/mesos/store/docker" --docker_volume_checkpoint_dir="/var/run/mesos/isolators/docker/volume"
--enforce_container_disk_quota="false" --executor_registration_timeout="1mins" --executor_shutdown_grace_period="5secs"
--fetcher_cache_dir="/tmp/Endpoint_SlaveEndpointTest_NoAuthorizer_0_pczZAw/fetch" --fetcher_cache_size="2GB"
--frameworks_home="" --gc_delay="1weeks" --gc_disk_headroom="0.1" --hadoop_home="" --help="false"
--hostname_lookup="true" --http_authenticators="basic" --http_command_executor="false" --http_credentials="/tmp/Endpoint_SlaveEndpointTest_NoAuthorizer_0_pczZAw/http_credentials"
--image_provisioner_backend="copy" --initialize_driver_logging="true" --isolation="posix/cpu,posix/mem"
--launcher="posix" --launcher_dir="/mesos/mesos-1.2.0/_build/src" --logbufsecs="0" --logging_level="INFO"
--max_completed_executors_per_framework="150" --oversubscribed_resources_interval="15secs"
--perf_duration="10secs" --perf_interval="1mins" --qos_correction_interval_min="0ns" --quiet="false"
--recover="reconnect" --recovery_timeout="15mins" --registration_backoff_factor="10ms" --resources="cpus:2;gpus:0;mem:1024;disk:1024;ports:[31000-32000]"
--revocable_cpu_low_priority="true" --runtime_dir="/tmp/Endpoint_SlaveEndpointTest_NoAuthorizer_0_pczZAw"
--sandbox_directory="/mnt/mesos/sandbox" --strict="true" --switch_user="true" --systemd_enable_support="true"
--systemd_runtime_directory="/run/systemd/system" --version="false" --work_dir="/tmp/Endpoint_SlaveEndpointTest_NoAuthorizer_0_zvuNh7"
I1115 05:38:55.984737 29725 credentials.hpp:86] Loading credential for authentication from
'/tmp/Endpoint_SlaveEndpointTest_NoAuthorizer_0_pczZAw/credential'
I1115 05:38:55.985021 29725 slave.cpp:346] Agent using credential for: test-principal
I1115 05:38:55.985054 29725 credentials.hpp:37] Loading credentials for authentication from
'/tmp/Endpoint_SlaveEndpointTest_NoAuthorizer_0_pczZAw/http_credentials'
I1115 05:38:55.985374 29725 http.cpp:895] Using default 'basic' HTTP authenticator for realm
'mesos-agent-readonly'
I1115 05:38:55.985553 29725 http.cpp:895] Using default 'basic' HTTP authenticator for realm
'mesos-agent-readwrite'
I1115 05:38:55.987083 29725 slave.cpp:533] Agent resources: cpus(*):2; mem(*):1024; disk(*):1024;
ports(*):[31000-32000]
I1115 05:38:55.987222 29725 slave.cpp:541] Agent attributes: [  ]
I1115 05:38:55.987246 29725 slave.cpp:546] Agent hostname: bc958f9f2d1d
I1115 05:38:55.990360 29725 state.cpp:57] Recovering state from '/tmp/Endpoint_SlaveEndpointTest_NoAuthorizer_0_zvuNh7/meta'
I1115 05:38:55.990993 29725 status_update_manager.cpp:203] Recovering status update manager
I1115 05:38:55.991240 29725 containerizer.cpp:561] Recovering containerizer
I1115 05:38:55.994037 29725 provisioner.cpp:253] Provisioner recovery complete
I1115 05:38:55.994740 29725 slave.cpp:5411] Finished recovery
I1115 05:38:55.995388 29725 slave.cpp:5585] Querying resource estimator for oversubscribable
resources
I1115 05:38:55.996011 29735 slave.cpp:5599] Received oversubscribable resources {} from the
resource estimator
I1115 05:38:56.002516 29735 process.cpp:3570] Handling HTTP event for process 'slave(649)'
with path: '/slave(649)/monitor/statistics'
I1115 05:38:56.004206 29735 http.cpp:847] Authorizing principal 'test-principal' to GET the
'/monitor/statistics' endpoint
I1115 05:38:56.024073 29702 slave.cpp:787] Agent terminating
[       OK ] Endpoint/SlaveEndpointTest.NoAuthorizer/0 (69 ms)
[ RUN      ] Endpoint/SlaveEndpointTest.NoAuthorizer/1
I1115 05:38:56.050990 29702 containerizer.cpp:202] Using isolation: posix/cpu,posix/mem,filesystem/posix,network/cni
W1115 05:38:56.052811 29702 backend.cpp:76] Failed to create 'aufs' backend: AufsBackend requires
root privileges, but is running as user mesos
W1115 05:38:56.053539 29702 backend.cpp:76] Failed to create 'bind' backend: BindBackend requires
root privileges
I1115 05:38:56.055902 29702 cluster.cpp:435] Creating default 'local' authorizer
I1115 05:38:56.058900 29733 slave.cpp:208] Mesos agent started on (650)@172.17.0.3:42132
I1115 05:38:56.058940 29733 slave.cpp:209] Flags at startup: --acls="" --appc_simple_discovery_uri_prefix="http://"
--appc_store_dir="/tmp/mesos/store/appc" --authenticate_http_readonly="true" --authenticate_http_readwrite="true"
--authenticatee="crammd5" --authentication_backoff_factor="1secs" --authorizer="local" --cgroups_cpu_enable_pids_and_tids_count="false"
--cgroups_enable_cfs="false" --cgroups_hierarchy="/sys/fs/cgroup" --cgroups_limit_swap="false"
--cgroups_root="mesos" --container_disk_watch_interval="15secs" --containerizers="mesos" --credential="/tmp/Endpoint_SlaveEndpointTest_NoAuthorizer_1_zjAira/credential"
--default_role="*" --disk_watch_interval="1mins" --docker="docker" --docker_kill_orphans="true"
--docker_registry="https://registry-1.docker.io" --docker_remove_delay="6hrs" --docker_socket="/var/run/docker.sock"
--docker_stop_timeout="0ns" --docker_store_dir="/tmp/mesos/store/docker" --docker_volume_checkpoint_dir="/var/run/mesos/isolators/docker/volume"
--enforce_container_disk_quota="false" --executor_registration_timeout="1mins" --executor_shutdown_grace_period="5secs"
--fetcher_cache_dir="/tmp/Endpoint_SlaveEndpointTest_NoAuthorizer_1_zjAira/fetch" --fetcher_cache_size="2GB"
--frameworks_home="" --gc_delay="1weeks" --gc_disk_headroom="0.1" --hadoop_home="" --help="false"
--hostname_lookup="true" --http_authenticators="basic" --http_command_executor="false" --http_credentials="/tmp/Endpoint_SlaveEndpointTest_NoAuthorizer_1_zjAira/http_credentials"
--image_provisioner_backend="copy" --initialize_driver_logging="true" --isolation="posix/cpu,posix/mem"
--launcher="posix" --launcher_dir="/mesos/mesos-1.2.0/_build/src" --logbufsecs="0" --logging_level="INFO"
--max_completed_executors_per_framework="150" --oversubscribed_resources_interval="15secs"
--perf_duration="10secs" --perf_interval="1mins" --qos_correction_interval_min="0ns" --quiet="false"
--recover="reconnect" --recovery_timeout="15mins" --registration_backoff_factor="10ms" --resources="cpus:2;gpus:0;mem:1024;disk:1024;ports:[31000-32000]"
--revocable_cpu_low_priority="true" --runtime_dir="/tmp/Endpoint_SlaveEndpointTest_NoAuthorizer_1_zjAira"
--sandbox_directory="/mnt/mesos/sandbox" --strict="true" --switch_user="true" --systemd_enable_support="true"
--systemd_runtime_directory="/run/systemd/system" --version="false" --work_dir="/tmp/Endpoint_SlaveEndpointTest_NoAuthorizer_1_VZftWK"
I1115 05:38:56.059641 29733 credentials.hpp:86] Loading credential for authentication from
'/tmp/Endpoint_SlaveEndpointTest_NoAuthorizer_1_zjAira/credential'
I1115 05:38:56.059926 29733 slave.cpp:346] Agent using credential for: test-principal
I1115 05:38:56.060113 29733 credentials.hpp:37] Loading credentials for authentication from
'/tmp/Endpoint_SlaveEndpointTest_NoAuthorizer_1_zjAira/http_credentials'
I1115 05:38:56.060570 29733 http.cpp:895] Using default 'basic' HTTP authenticator for realm
'mesos-agent-readonly'
I1115 05:38:56.060940 29733 http.cpp:895] Using default 'basic' HTTP authenticator for realm
'mesos-agent-readwrite'
I1115 05:38:56.062738 29733 slave.cpp:533] Agent resources: cpus(*):2; mem(*):1024; disk(*):1024;
ports(*):[31000-32000]
I1115 05:38:56.063067 29733 slave.cpp:541] Agent attributes: [  ]
I1115 05:38:56.063253 29733 slave.cpp:546] Agent hostname: bc958f9f2d1d
I1115 05:38:56.065727 29733 state.cpp:57] Recovering state from '/tmp/Endpoint_SlaveEndpointTest_NoAuthorizer_1_VZftWK/meta'
I1115 05:38:56.067034 29725 status_update_manager.cpp:203] Recovering status update manager
I1115 05:38:56.067586 29725 containerizer.cpp:561] Recovering containerizer
I1115 05:38:56.070334 29725 provisioner.cpp:253] Provisioner recovery complete
I1115 05:38:56.071295 29725 slave.cpp:5411] Finished recovery
I1115 05:38:56.072862 29725 slave.cpp:5585] Querying resource estimator for oversubscribable
resources
I1115 05:38:56.073487 29725 slave.cpp:5599] Received oversubscribable resources {} from the
resource estimator
I1115 05:38:56.088301 29722 process.cpp:3570] Handling HTTP event for process 'slave(650)'
with path: '/slave(650)/monitor/statistics.json'
I1115 05:38:56.090143 29722 http.cpp:847] Authorizing principal 'test-principal' to GET the
'/monitor/statistics.json' endpoint
I1115 05:38:56.113368 29702 slave.cpp:787] Agent terminating
[       OK ] Endpoint/SlaveEndpointTest.NoAuthorizer/1 (99 ms)
[ RUN      ] Endpoint/SlaveEndpointTest.NoAuthorizer/2
I1115 05:38:56.147687 29702 containerizer.cpp:202] Using isolation: posix/cpu,posix/mem,filesystem/posix,network/cni
W1115 05:38:56.150243 29702 backend.cpp:76] Failed to create 'aufs' backend: AufsBackend requires
root privileges, but is running as user mesos
W1115 05:38:56.150444 29702 backend.cpp:76] Failed to create 'bind' backend: BindBackend requires
root privileges
I1115 05:38:56.152796 29702 cluster.cpp:435] Creating default 'local' authorizer
I1115 05:38:56.155630 29734 slave.cpp:208] Mesos agent started on (651)@172.17.0.3:42132
I1115 05:38:56.155663 29734 slave.cpp:209] Flags at startup: --acls="" --appc_simple_discovery_uri_prefix="http://"
--appc_store_dir="/tmp/mesos/store/appc" --authenticate_http_readonly="true" --authenticate_http_readwrite="true"
--authenticatee="crammd5" --authentication_backoff_factor="1secs" --authorizer="local" --cgroups_cpu_enable_pids_and_tids_count="false"
--cgroups_enable_cfs="false" --cgroups_hierarchy="/sys/fs/cgroup" --cgroups_limit_swap="false"
--cgroups_root="mesos" --container_disk_watch_interval="15secs" --containerizers="mesos" --credential="/tmp/Endpoint_SlaveEndpointTest_NoAuthorizer_2_JCjkgP/credential"
--default_role="*" --disk_watch_interval="1mins" --docker="docker" --docker_kill_orphans="true"
--docker_registry="https://registry-1.docker.io" --docker_remove_delay="6hrs" --docker_socket="/var/run/docker.sock"
--docker_stop_timeout="0ns" --docker_store_dir="/tmp/mesos/store/docker" --docker_volume_checkpoint_dir="/var/run/mesos/isolators/docker/volume"
--enforce_container_disk_quota="false" --executor_registration_timeout="1mins" --executor_shutdown_grace_period="5secs"
--fetcher_cache_dir="/tmp/Endpoint_SlaveEndpointTest_NoAuthorizer_2_JCjkgP/fetch" --fetcher_cache_size="2GB"
--frameworks_home="" --gc_delay="1weeks" --gc_disk_headroom="0.1" --hadoop_home="" --help="false"
--hostname_lookup="true" --http_authenticators="basic" --http_command_executor="false" --http_credentials="/tmp/Endpoint_SlaveEndpointTest_NoAuthorizer_2_JCjkgP/http_credentials"
--image_provisioner_backend="copy" --initialize_driver_logging="true" --isolation="posix/cpu,posix/mem"
--launcher="posix" --launcher_dir="/mesos/mesos-1.2.0/_build/src" --logbufsecs="0" --logging_level="INFO"
--max_completed_executors_per_framework="150" --oversubscribed_resources_interval="15secs"
--perf_duration="10secs" --perf_interval="1mins" --qos_correction_interval_min="0ns" --quiet="false"
--recover="reconnect" --recovery_timeout="15mins" --registration_backoff_factor="10ms" --resources="cpus:2;gpus:0;mem:1024;disk:1024;ports:[31000-32000]"
--revocable_cpu_low_priority="true" --runtime_dir="/tmp/Endpoint_SlaveEndpointTest_NoAuthorizer_2_JCjkgP"
--sandbox_directory="/mnt/mesos/sandbox" --strict="true" --switch_user="true" --systemd_enable_support="true"
--systemd_runtime_directory="/run/systemd/system" --version="false" --work_dir="/tmp/Endpoint_SlaveEndpointTest_NoAuthorizer_2_6Trxvp"
I1115 05:38:56.156332 29734 credentials.hpp:86] Loading credential for authentication from
'/tmp/Endpoint_SlaveEndpointTest_NoAuthorizer_2_JCjkgP/credential'
I1115 05:38:56.156750 29734 slave.cpp:346] Agent using credential for: test-principal
I1115 05:38:56.156779 29734 credentials.hpp:37] Loading credentials for authentication from
'/tmp/Endpoint_SlaveEndpointTest_NoAuthorizer_2_JCjkgP/http_credentials'
I1115 05:38:56.157070 29734 http.cpp:895] Using default 'basic' HTTP authenticator for realm
'mesos-agent-readonly'
I1115 05:38:56.157241 29734 http.cpp:895] Using default 'basic' HTTP authenticator for realm
'mesos-agent-readwrite'
I1115 05:38:56.158624 29734 slave.cpp:533] Agent resources: cpus(*):2; mem(*):1024; disk(*):1024;
ports(*):[31000-32000]
I1115 05:38:56.158746 29734 slave.cpp:541] Agent attributes: [  ]
I1115 05:38:56.158766 29734 slave.cpp:546] Agent hostname: bc958f9f2d1d
I1115 05:38:56.161880 29728 state.cpp:57] Recovering state from '/tmp/Endpoint_SlaveEndpointTest_NoAuthorizer_2_6Trxvp/meta'
I1115 05:38:56.162467 29728 status_update_manager.cpp:203] Recovering status update manager
I1115 05:38:56.162675 29728 containerizer.cpp:561] Recovering containerizer
I1115 05:38:56.166061 29735 provisioner.cpp:253] Provisioner recovery complete
I1115 05:38:56.167086 29735 slave.cpp:5411] Finished recovery
I1115 05:38:56.168411 29735 slave.cpp:5585] Querying resource estimator for oversubscribable
resources
I1115 05:38:56.169306 29735 slave.cpp:5599] Received oversubscribable resources {} from the
resource estimator
I1115 05:38:56.175441 29731 process.cpp:3570] Handling HTTP event for process 'slave(651)'
with path: '/slave(651)/containers'
I1115 05:38:56.177184 29731 http.cpp:847] Authorizing principal 'test-principal' to GET the
'/containers' endpoint
I1115 05:38:56.216398 29725 slave.cpp:787] Agent terminating
[       OK ] Endpoint/SlaveEndpointTest.NoAuthorizer/2 (85 ms)
[----------] 9 tests from Endpoint/SlaveEndpointTest (839 ms total)

[----------] Global test environment tear-down
[==========] 1378 tests from 156 test cases ran. (1086134 ms total)
[  PASSED  ] 1377 tests.
[  FAILED  ] 1 test, listed below:
[  FAILED  ] DefaultExecutorTest.KillTaskGroupOnTaskFailure

 1 FAILED TEST
  YOU HAVE 4 DISABLED TESTS

make[4]: *** [check-local] Error 1
make[4]: Leaving directory `/mesos/mesos-1.2.0/_build/src'
make[3]: *** [check-am] Error 2
make[3]: Leaving directory `/mesos/mesos-1.2.0/_build/src'
make[2]: *** [check] Error 2
make[2]: Leaving directory `/mesos/mesos-1.2.0/_build/src'
make[1]: *** [check-recursive] Error 1
make[1]: Leaving directory `/mesos/mesos-1.2.0/_build'
make: *** [distcheck] Error 1
+ docker rmi mesos-1479184953-28661
Untagged: mesos-1479184953-28661:latest
Deleted: sha256:1f419f3ada0c3085c6d40982f7a1ea3470add198e08691c6e5ab7186b9db627c
Deleted: sha256:cf6adf51b26a1b5a3d1d7b05d2354a24f5d4ea2ca8763155f8b079e086f91555
Deleted: sha256:d6ef9c9bf008f684d82d8074c5bfee466808c1acc0be95b7abdb7e27daa0fdc8
Deleted: sha256:a5724213545154a945573ec44a50a089d211210ed553d3609cb31cec85ad8651
Deleted: sha256:c2a2cbe39f9f5bc4b9573f33a862498b9ccb4d9ae979c4640f6861d7489905d1
Deleted: sha256:f0fad5b708468521fb7490219b13e06f64a4efbc8a24615fd99388907168dd2e
Deleted: sha256:fb43ca84a5d078c5e7de1cc4ce17e7937854e3186fd6ffa833808f95f96b52a1
Deleted: sha256:f8c4d5ffbae40fd10cccd4691ea51f7bed3a679ab4408a8043bc778e00045e55
Deleted: sha256:dd4c94820cf30866e9448f60ef34376206bb4541329433ecc0b2b88a47a01196
Deleted: sha256:20e7e93779cc098de32eb05b54f01c2a3089a5ddce2e708db24c46814bae10f0
Deleted: sha256:48bdf460cc7f12316a0e9a3b76e0cdaddf968b3b21d87e9c298f10feb53a6fce
Deleted: sha256:c292b23870e0bd8684930fa6b57b8b01e0399ad55bf84c7a9237f91ec6705782
Deleted: sha256:967556328e30e3517eb4d15810f49be2309a65970e8ee17e744d3d238743a6f0
Deleted: sha256:7d77abea7c3c3330327282b13bf12733da4d685faf18aac7fb0f63001461383d
Deleted: sha256:9f37ad8d51e3d54923f75b329b60b794d1c08a24e4543d3022450329ee99393f
Deleted: sha256:6c29deef704997ea621f296fb6d3c937a08abb0944cd87e0540e8fb068c123fa
Deleted: sha256:0b04296fcba622ffc67ea38a529bbab267017f77b3f89a923b1efdc7883edb37
Deleted: sha256:cd525919a549787dd50b7c24e271bd22cdc1f2b5bc94deb346e29ff3454d604f
Deleted: sha256:a9aba6f886ccb528175d84c45d378d5b3da31a8cc00654a9cea6445967299550
Deleted: sha256:95ec9b8ff296b81479630ae352fbbcce4ded912428b2c11833944f5cd9c86d75
Deleted: sha256:79aefa4793621e4ff44a2cb4387eff12499e43d5138e83d0b79e4b3bc03f105e
Deleted: sha256:dc1e6988342d52495396710c012f2ddc288197efe31e4ed8682a39ca9130811b
Deleted: sha256:0741c28016651300df22de7f86b90bd5789f0f21c17cbe542413531d9947020e
Deleted: sha256:98b267e0a7fdc1f50dc1547b951e94a05d0bce8b0953bf11874ab39a20597ed3
Build step 'Execute shell' marked build as failure

Mime
View raw message