mesos-builds mailing list archives

Site index · List index
Message view « Date » · « Thread »
Top « Date » · « Thread »
From Apache Jenkins Server <jenk...@builds.apache.org>
Subject Build failed in Jenkins: Mesos » autotools,clang,--verbose,GLOG_v=1 MESOS_VERBOSE=1,ubuntu:14.04,(docker||Hadoop)&&(!ubuntu-us1)&&(!ubuntu-6)&&(!ubuntu-eu2) #2932
Date Wed, 16 Nov 2016 12:58:52 GMT
See <https://builds.apache.org/job/Mesos/BUILDTOOL=autotools,COMPILER=clang,CONFIGURATION=--verbose,ENVIRONMENT=GLOG_v=1%20MESOS_VERBOSE=1,OS=ubuntu%3A14.04,label_exp=(docker%7C%7CHadoop)&&(!ubuntu-us1)&&(!ubuntu-6)&&(!ubuntu-eu2)/2932/changes>

Changes:

[alexr] Updated variable names in quota handler for consistency.

------------------------------------------
[...truncated 218009 lines...]
I1116 12:57:43.311125 28137 containerizer.cpp:202] Using isolation: posix/cpu,posix/mem,filesystem/posix,network/cni
W1116 12:57:43.311784 28137 backend.cpp:76] Failed to create 'aufs' backend: AufsBackend requires
root privileges, but is running as user mesos
W1116 12:57:43.312012 28137 backend.cpp:76] Failed to create 'bind' backend: BindBackend requires
root privileges
I1116 12:57:43.315281 28160 slave.cpp:208] Mesos agent started on (644)@172.17.0.3:46777
I1116 12:57:43.315335 28160 slave.cpp:209] Flags at startup: --acls="" --appc_simple_discovery_uri_prefix="http://"
--appc_store_dir="/tmp/mesos/store/appc" --authenticate_http_readonly="true" --authenticate_http_readwrite="true"
--authenticatee="crammd5" --authentication_backoff_factor="1secs" --authorizer="local" --cgroups_cpu_enable_pids_and_tids_count="false"
--cgroups_enable_cfs="false" --cgroups_hierarchy="/sys/fs/cgroup" --cgroups_limit_swap="false"
--cgroups_root="mesos" --container_disk_watch_interval="15secs" --containerizers="mesos" --credential="/tmp/Endpoint_SlaveEndpointTest_AuthorizedRequest_1_ACo6l6/credential"
--default_role="*" --disk_watch_interval="1mins" --docker="docker" --docker_kill_orphans="true"
--docker_registry="https://registry-1.docker.io" --docker_remove_delay="6hrs" --docker_socket="/var/run/docker.sock"
--docker_stop_timeout="0ns" --docker_store_dir="/tmp/mesos/store/docker" --docker_volume_checkpoint_dir="/var/run/mesos/isolators/docker/volume"
--enforce_container_disk_quota="false" --executor_registration_timeout="1mins" --executor_shutdown_grace_period="5secs"
--fetcher_cache_dir="/tmp/Endpoint_SlaveEndpointTest_AuthorizedRequest_1_ACo6l6/fetch" --fetcher_cache_size="2GB"
--frameworks_home="" --gc_delay="1weeks" --gc_disk_headroom="0.1" --hadoop_home="" --help="false"
--hostname_lookup="true" --http_authenticators="basic" --http_command_executor="false" --http_credentials="/tmp/Endpoint_SlaveEndpointTest_AuthorizedRequest_1_ACo6l6/http_credentials"
--image_provisioner_backend="copy" --initialize_driver_logging="true" --isolation="posix/cpu,posix/mem"
--launcher="posix" --launcher_dir="/mesos/mesos-1.2.0/_build/src" --logbufsecs="0" --logging_level="INFO"
--max_completed_executors_per_framework="150" --oversubscribed_resources_interval="15secs"
--perf_duration="10secs" --perf_interval="1mins" --qos_correction_interval_min="0ns" --quiet="false"
--recover="reconnect" --recovery_timeout="15mins" --registration_backoff_factor="10ms" --resources="cpus:2;gpus:0;mem:1024;disk:1024;ports:[31000-32000]"
--revocable_cpu_low_priority="true" --runtime_dir="/tmp/Endpoint_SlaveEndpointTest_AuthorizedRequest_1_ACo6l6"
--sandbox_directory="/mnt/mesos/sandbox" --strict="true" --switch_user="true" --systemd_enable_support="true"
--systemd_runtime_directory="/run/systemd/system" --version="false" --work_dir="/tmp/Endpoint_SlaveEndpointTest_AuthorizedRequest_1_dMp3wO"
I1116 12:57:43.316046 28160 credentials.hpp:86] Loading credential for authentication from
'/tmp/Endpoint_SlaveEndpointTest_AuthorizedRequest_1_ACo6l6/credential'
I1116 12:57:43.316241 28160 slave.cpp:346] Agent using credential for: test-principal
I1116 12:57:43.316272 28160 credentials.hpp:37] Loading credentials for authentication from
'/tmp/Endpoint_SlaveEndpointTest_AuthorizedRequest_1_ACo6l6/http_credentials'
I1116 12:57:43.316547 28160 http.cpp:895] Using default 'basic' HTTP authenticator for realm
'mesos-agent-readonly'
I1116 12:57:43.316699 28160 http.cpp:895] Using default 'basic' HTTP authenticator for realm
'mesos-agent-readwrite'
I1116 12:57:43.317987 28160 slave.cpp:533] Agent resources: cpus(*):2; mem(*):1024; disk(*):1024;
ports(*):[31000-32000]
I1116 12:57:43.318091 28160 slave.cpp:541] Agent attributes: [  ]
I1116 12:57:43.318117 28160 slave.cpp:546] Agent hostname: 4259ff14106a
I1116 12:57:43.319815 28161 state.cpp:57] Recovering state from '/tmp/Endpoint_SlaveEndpointTest_AuthorizedRequest_1_dMp3wO/meta'
I1116 12:57:43.320443 28170 status_update_manager.cpp:203] Recovering status update manager
I1116 12:57:43.320675 28156 containerizer.cpp:561] Recovering containerizer
I1116 12:57:43.322175 28156 provisioner.cpp:253] Provisioner recovery complete
I1116 12:57:43.322638 28163 slave.cpp:5411] Finished recovery
I1116 12:57:43.323407 28163 slave.cpp:5585] Querying resource estimator for oversubscribable
resources
I1116 12:57:43.323753 28159 slave.cpp:5599] Received oversubscribable resources {} from the
resource estimator
I1116 12:57:43.325615 28155 process.cpp:3570] Handling HTTP event for process 'slave(644)'
with path: '/slave(644)/monitor/statistics.json'
I1116 12:57:43.326495 28163 http.cpp:847] Authorizing principal 'test-principal' to GET the
'/monitor/statistics.json' endpoint
I1116 12:57:43.330088 28157 slave.cpp:787] Agent terminating
[       OK ] Endpoint/SlaveEndpointTest.AuthorizedRequest/1 (29 ms)
[ RUN      ] Endpoint/SlaveEndpointTest.AuthorizedRequest/2
I1116 12:57:43.339640 28137 containerizer.cpp:202] Using isolation: posix/cpu,posix/mem,filesystem/posix,network/cni
W1116 12:57:43.340232 28137 backend.cpp:76] Failed to create 'aufs' backend: AufsBackend requires
root privileges, but is running as user mesos
W1116 12:57:43.340409 28137 backend.cpp:76] Failed to create 'bind' backend: BindBackend requires
root privileges
I1116 12:57:43.343199 28165 slave.cpp:208] Mesos agent started on (645)@172.17.0.3:46777
I1116 12:57:43.343251 28165 slave.cpp:209] Flags at startup: --acls="" --appc_simple_discovery_uri_prefix="http://"
--appc_store_dir="/tmp/mesos/store/appc" --authenticate_http_readonly="true" --authenticate_http_readwrite="true"
--authenticatee="crammd5" --authentication_backoff_factor="1secs" --authorizer="local" --cgroups_cpu_enable_pids_and_tids_count="false"
--cgroups_enable_cfs="false" --cgroups_hierarchy="/sys/fs/cgroup" --cgroups_limit_swap="false"
--cgroups_root="mesos" --container_disk_watch_interval="15secs" --containerizers="mesos" --credential="/tmp/Endpoint_SlaveEndpointTest_AuthorizedRequest_2_ozIdUf/credential"
--default_role="*" --disk_watch_interval="1mins" --docker="docker" --docker_kill_orphans="true"
--docker_registry="https://registry-1.docker.io" --docker_remove_delay="6hrs" --docker_socket="/var/run/docker.sock"
--docker_stop_timeout="0ns" --docker_store_dir="/tmp/mesos/store/docker" --docker_volume_checkpoint_dir="/var/run/mesos/isolators/docker/volume"
--enforce_container_disk_quota="false" --executor_registration_timeout="1mins" --executor_shutdown_grace_period="5secs"
--fetcher_cache_dir="/tmp/Endpoint_SlaveEndpointTest_AuthorizedRequest_2_ozIdUf/fetch" --fetcher_cache_size="2GB"
--frameworks_home="" --gc_delay="1weeks" --gc_disk_headroom="0.1" --hadoop_home="" --help="false"
--hostname_lookup="true" --http_authenticators="basic" --http_command_executor="false" --http_credentials="/tmp/Endpoint_SlaveEndpointTest_AuthorizedRequest_2_ozIdUf/http_credentials"
--image_provisioner_backend="copy" --initialize_driver_logging="true" --isolation="posix/cpu,posix/mem"
--launcher="posix" --launcher_dir="/mesos/mesos-1.2.0/_build/src" --logbufsecs="0" --logging_level="INFO"
--max_completed_executors_per_framework="150" --oversubscribed_resources_interval="15secs"
--perf_duration="10secs" --perf_interval="1mins" --qos_correction_interval_min="0ns" --quiet="false"
--recover="reconnect" --recovery_timeout="15mins" --registration_backoff_factor="10ms" --resources="cpus:2;gpus:0;mem:1024;disk:1024;ports:[31000-32000]"
--revocable_cpu_low_priority="true" --runtime_dir="/tmp/Endpoint_SlaveEndpointTest_AuthorizedRequest_2_ozIdUf"
--sandbox_directory="/mnt/mesos/sandbox" --strict="true" --switch_user="true" --systemd_enable_support="true"
--systemd_runtime_directory="/run/systemd/system" --version="false" --work_dir="/tmp/Endpoint_SlaveEndpointTest_AuthorizedRequest_2_1Kaw0X"
I1116 12:57:43.344228 28165 credentials.hpp:86] Loading credential for authentication from
'/tmp/Endpoint_SlaveEndpointTest_AuthorizedRequest_2_ozIdUf/credential'
I1116 12:57:43.344439 28165 slave.cpp:346] Agent using credential for: test-principal
I1116 12:57:43.344475 28165 credentials.hpp:37] Loading credentials for authentication from
'/tmp/Endpoint_SlaveEndpointTest_AuthorizedRequest_2_ozIdUf/http_credentials'
I1116 12:57:43.344837 28165 http.cpp:895] Using default 'basic' HTTP authenticator for realm
'mesos-agent-readonly'
I1116 12:57:43.345006 28165 http.cpp:895] Using default 'basic' HTTP authenticator for realm
'mesos-agent-readwrite'
I1116 12:57:43.346344 28165 slave.cpp:533] Agent resources: cpus(*):2; mem(*):1024; disk(*):1024;
ports(*):[31000-32000]
I1116 12:57:43.346439 28165 slave.cpp:541] Agent attributes: [  ]
I1116 12:57:43.346453 28165 slave.cpp:546] Agent hostname: 4259ff14106a
I1116 12:57:43.348007 28162 state.cpp:57] Recovering state from '/tmp/Endpoint_SlaveEndpointTest_AuthorizedRequest_2_1Kaw0X/meta'
I1116 12:57:43.348418 28164 status_update_manager.cpp:203] Recovering status update manager
I1116 12:57:43.348657 28169 containerizer.cpp:561] Recovering containerizer
I1116 12:57:43.350009 28160 provisioner.cpp:253] Provisioner recovery complete
I1116 12:57:43.350411 28162 slave.cpp:5411] Finished recovery
I1116 12:57:43.350965 28162 slave.cpp:5585] Querying resource estimator for oversubscribable
resources
I1116 12:57:43.351248 28167 slave.cpp:5599] Received oversubscribable resources {} from the
resource estimator
I1116 12:57:43.353329 28165 process.cpp:3570] Handling HTTP event for process 'slave(645)'
with path: '/slave(645)/containers'
I1116 12:57:43.354274 28155 http.cpp:847] Authorizing principal 'test-principal' to GET the
'/containers' endpoint
I1116 12:57:43.357625 28162 slave.cpp:787] Agent terminating
[       OK ] Endpoint/SlaveEndpointTest.AuthorizedRequest/2 (27 ms)
[ RUN      ] Endpoint/SlaveEndpointTest.UnauthorizedRequest/0
I1116 12:57:43.366691 28137 containerizer.cpp:202] Using isolation: posix/cpu,posix/mem,filesystem/posix,network/cni
W1116 12:57:43.367275 28137 backend.cpp:76] Failed to create 'aufs' backend: AufsBackend requires
root privileges, but is running as user mesos
W1116 12:57:43.367427 28137 backend.cpp:76] Failed to create 'bind' backend: BindBackend requires
root privileges
I1116 12:57:43.370841 28165 slave.cpp:208] Mesos agent started on (646)@172.17.0.3:46777
I1116 12:57:43.370892 28165 slave.cpp:209] Flags at startup: --acls="" --appc_simple_discovery_uri_prefix="http://"
--appc_store_dir="/tmp/mesos/store/appc" --authenticate_http_readonly="true" --authenticate_http_readwrite="true"
--authenticatee="crammd5" --authentication_backoff_factor="1secs" --authorizer="local" --cgroups_cpu_enable_pids_and_tids_count="false"
--cgroups_enable_cfs="false" --cgroups_hierarchy="/sys/fs/cgroup" --cgroups_limit_swap="false"
--cgroups_root="mesos" --container_disk_watch_interval="15secs" --containerizers="mesos" --credential="/tmp/Endpoint_SlaveEndpointTest_UnauthorizedRequest_0_85z0Jp/credential"
--default_role="*" --disk_watch_interval="1mins" --docker="docker" --docker_kill_orphans="true"
--docker_registry="https://registry-1.docker.io" --docker_remove_delay="6hrs" --docker_socket="/var/run/docker.sock"
--docker_stop_timeout="0ns" --docker_store_dir="/tmp/mesos/store/docker" --docker_volume_checkpoint_dir="/var/run/mesos/isolators/docker/volume"
--enforce_container_disk_quota="false" --executor_registration_timeout="1mins" --executor_shutdown_grace_period="5secs"
--fetcher_cache_dir="/tmp/Endpoint_SlaveEndpointTest_UnauthorizedRequest_0_85z0Jp/fetch" --fetcher_cache_size="2GB"
--frameworks_home="" --gc_delay="1weeks" --gc_disk_headroom="0.1" --hadoop_home="" --help="false"
--hostname_lookup="true" --http_authenticators="basic" --http_command_executor="false" --http_credentials="/tmp/Endpoint_SlaveEndpointTest_UnauthorizedRequest_0_85z0Jp/http_credentials"
--image_provisioner_backend="copy" --initialize_driver_logging="true" --isolation="posix/cpu,posix/mem"
--launcher="posix" --launcher_dir="/mesos/mesos-1.2.0/_build/src" --logbufsecs="0" --logging_level="INFO"
--max_completed_executors_per_framework="150" --oversubscribed_resources_interval="15secs"
--perf_duration="10secs" --perf_interval="1mins" --qos_correction_interval_min="0ns" --quiet="false"
--recover="reconnect" --recovery_timeout="15mins" --registration_backoff_factor="10ms" --resources="cpus:2;gpus:0;mem:1024;disk:1024;ports:[31000-32000]"
--revocable_cpu_low_priority="true" --runtime_dir="/tmp/Endpoint_SlaveEndpointTest_UnauthorizedRequest_0_85z0Jp"
--sandbox_directory="/mnt/mesos/sandbox" --strict="true" --switch_user="true" --systemd_enable_support="true"
--systemd_runtime_directory="/run/systemd/system" --version="false" --work_dir="/tmp/Endpoint_SlaveEndpointTest_UnauthorizedRequest_0_HDgVL7"
I1116 12:57:43.371583 28165 credentials.hpp:86] Loading credential for authentication from
'/tmp/Endpoint_SlaveEndpointTest_UnauthorizedRequest_0_85z0Jp/credential'
I1116 12:57:43.371747 28165 slave.cpp:346] Agent using credential for: test-principal
I1116 12:57:43.371773 28165 credentials.hpp:37] Loading credentials for authentication from
'/tmp/Endpoint_SlaveEndpointTest_UnauthorizedRequest_0_85z0Jp/http_credentials'
I1116 12:57:43.372022 28165 http.cpp:895] Using default 'basic' HTTP authenticator for realm
'mesos-agent-readonly'
I1116 12:57:43.372175 28165 http.cpp:895] Using default 'basic' HTTP authenticator for realm
'mesos-agent-readwrite'
I1116 12:57:43.373365 28165 slave.cpp:533] Agent resources: cpus(*):2; mem(*):1024; disk(*):1024;
ports(*):[31000-32000]
I1116 12:57:43.373472 28165 slave.cpp:541] Agent attributes: [  ]
I1116 12:57:43.373489 28165 slave.cpp:546] Agent hostname: 4259ff14106a
I1116 12:57:43.374958 28155 state.cpp:57] Recovering state from '/tmp/Endpoint_SlaveEndpointTest_UnauthorizedRequest_0_HDgVL7/meta'
I1116 12:57:43.375249 28167 status_update_manager.cpp:203] Recovering status update manager
I1116 12:57:43.375524 28160 containerizer.cpp:561] Recovering containerizer
I1116 12:57:43.377017 28160 provisioner.cpp:253] Provisioner recovery complete
I1116 12:57:43.377519 28161 slave.cpp:5411] Finished recovery
I1116 12:57:43.377992 28161 slave.cpp:5585] Querying resource estimator for oversubscribable
resources
I1116 12:57:43.378244 28163 slave.cpp:5599] Received oversubscribable resources {} from the
resource estimator
I1116 12:57:43.380108 28167 process.cpp:3570] Handling HTTP event for process 'slave(646)'
with path: '/slave(646)/monitor/statistics'
I1116 12:57:43.381284 28170 http.cpp:847] Authorizing principal 'test-principal' to GET the
'/monitor/statistics' endpoint
I1116 12:57:43.383795 28159 slave.cpp:787] Agent terminating
[       OK ] Endpoint/SlaveEndpointTest.UnauthorizedRequest/0 (27 ms)
[ RUN      ] Endpoint/SlaveEndpointTest.UnauthorizedRequest/1
I1116 12:57:43.396440 28137 containerizer.cpp:202] Using isolation: posix/cpu,posix/mem,filesystem/posix,network/cni
W1116 12:57:43.397259 28137 backend.cpp:76] Failed to create 'aufs' backend: AufsBackend requires
root privileges, but is running as user mesos
W1116 12:57:43.397459 28137 backend.cpp:76] Failed to create 'bind' backend: BindBackend requires
root privileges
I1116 12:57:43.401530 28168 slave.cpp:208] Mesos agent started on (647)@172.17.0.3:46777
I1116 12:57:43.401581 28168 slave.cpp:209] Flags at startup: --acls="" --appc_simple_discovery_uri_prefix="http://"
--appc_store_dir="/tmp/mesos/store/appc" --authenticate_http_readonly="true" --authenticate_http_readwrite="true"
--authenticatee="crammd5" --authentication_backoff_factor="1secs" --authorizer="local" --cgroups_cpu_enable_pids_and_tids_count="false"
--cgroups_enable_cfs="false" --cgroups_hierarchy="/sys/fs/cgroup" --cgroups_limit_swap="false"
--cgroups_root="mesos" --container_disk_watch_interval="15secs" --containerizers="mesos" --credential="/tmp/Endpoint_SlaveEndpointTest_UnauthorizedRequest_1_y6iZRz/credential"
--default_role="*" --disk_watch_interval="1mins" --docker="docker" --docker_kill_orphans="true"
--docker_registry="https://registry-1.docker.io" --docker_remove_delay="6hrs" --docker_socket="/var/run/docker.sock"
--docker_stop_timeout="0ns" --docker_store_dir="/tmp/mesos/store/docker" --docker_volume_checkpoint_dir="/var/run/mesos/isolators/docker/volume"
--enforce_container_disk_quota="false" --executor_registration_timeout="1mins" --executor_shutdown_grace_period="5secs"
--fetcher_cache_dir="/tmp/Endpoint_SlaveEndpointTest_UnauthorizedRequest_1_y6iZRz/fetch" --fetcher_cache_size="2GB"
--frameworks_home="" --gc_delay="1weeks" --gc_disk_headroom="0.1" --hadoop_home="" --help="false"
--hostname_lookup="true" --http_authenticators="basic" --http_command_executor="false" --http_credentials="/tmp/Endpoint_SlaveEndpointTest_UnauthorizedRequest_1_y6iZRz/http_credentials"
--image_provisioner_backend="copy" --initialize_driver_logging="true" --isolation="posix/cpu,posix/mem"
--launcher="posix" --launcher_dir="/mesos/mesos-1.2.0/_build/src" --logbufsecs="0" --logging_level="INFO"
--max_completed_executors_per_framework="150" --oversubscribed_resources_interval="15secs"
--perf_duration="10secs" --perf_interval="1mins" --qos_correction_interval_min="0ns" --quiet="false"
--recover="reconnect" --recovery_timeout="15mins" --registration_backoff_factor="10ms" --resources="cpus:2;gpus:0;mem:1024;disk:1024;ports:[31000-32000]"
--revocable_cpu_low_priority="true" --runtime_dir="/tmp/Endpoint_SlaveEndpointTest_UnauthorizedRequest_1_y6iZRz"
--sandbox_directory="/mnt/mesos/sandbox" --strict="true" --switch_user="true" --systemd_enable_support="true"
--systemd_runtime_directory="/run/systemd/system" --version="false" --work_dir="/tmp/Endpoint_SlaveEndpointTest_UnauthorizedRequest_1_hfmfPh"
I1116 12:57:43.402220 28168 credentials.hpp:86] Loading credential for authentication from
'/tmp/Endpoint_SlaveEndpointTest_UnauthorizedRequest_1_y6iZRz/credential'
I1116 12:57:43.402375 28168 slave.cpp:346] Agent using credential for: test-principal
I1116 12:57:43.402402 28168 credentials.hpp:37] Loading credentials for authentication from
'/tmp/Endpoint_SlaveEndpointTest_UnauthorizedRequest_1_y6iZRz/http_credentials'
I1116 12:57:43.402647 28168 http.cpp:895] Using default 'basic' HTTP authenticator for realm
'mesos-agent-readonly'
I1116 12:57:43.402786 28168 http.cpp:895] Using default 'basic' HTTP authenticator for realm
'mesos-agent-readwrite'
I1116 12:57:43.404150 28168 slave.cpp:533] Agent resources: cpus(*):2; mem(*):1024; disk(*):1024;
ports(*):[31000-32000]
I1116 12:57:43.404245 28168 slave.cpp:541] Agent attributes: [  ]
I1116 12:57:43.404259 28168 slave.cpp:546] Agent hostname: 4259ff14106a
I1116 12:57:43.405802 28165 state.cpp:57] Recovering state from '/tmp/Endpoint_SlaveEndpointTest_UnauthorizedRequest_1_hfmfPh/meta'
I1116 12:57:43.406142 28157 status_update_manager.cpp:203] Recovering status update manager
I1116 12:57:43.406523 28161 containerizer.cpp:561] Recovering containerizer
I1116 12:57:43.408047 28161 provisioner.cpp:253] Provisioner recovery complete
I1116 12:57:43.408536 28167 slave.cpp:5411] Finished recovery
I1116 12:57:43.409219 28167 slave.cpp:5585] Querying resource estimator for oversubscribable
resources
I1116 12:57:43.409462 28161 slave.cpp:5599] Received oversubscribable resources {} from the
resource estimator
I1116 12:57:43.411433 28165 process.cpp:3570] Handling HTTP event for process 'slave(647)'
with path: '/slave(647)/monitor/statistics.json'
I1116 12:57:43.412390 28158 http.cpp:847] Authorizing principal 'test-principal' to GET the
'/monitor/statistics.json' endpoint
I1116 12:57:43.415410 28161 slave.cpp:787] Agent terminating
[       OK ] Endpoint/SlaveEndpointTest.UnauthorizedRequest/1 (31 ms)
[ RUN      ] Endpoint/SlaveEndpointTest.UnauthorizedRequest/2
I1116 12:57:43.428431 28137 containerizer.cpp:202] Using isolation: posix/cpu,posix/mem,filesystem/posix,network/cni
W1116 12:57:43.429286 28137 backend.cpp:76] Failed to create 'aufs' backend: AufsBackend requires
root privileges, but is running as user mesos
W1116 12:57:43.429498 28137 backend.cpp:76] Failed to create 'bind' backend: BindBackend requires
root privileges
I1116 12:57:43.433768 28160 slave.cpp:208] Mesos agent started on (648)@172.17.0.3:46777
I1116 12:57:43.433812 28160 slave.cpp:209] Flags at startup: --acls="" --appc_simple_discovery_uri_prefix="http://"
--appc_store_dir="/tmp/mesos/store/appc" --authenticate_http_readonly="true" --authenticate_http_readwrite="true"
--authenticatee="crammd5" --authentication_backoff_factor="1secs" --authorizer="local" --cgroups_cpu_enable_pids_and_tids_count="false"
--cgroups_enable_cfs="false" --cgroups_hierarchy="/sys/fs/cgroup" --cgroups_limit_swap="false"
--cgroups_root="mesos" --container_disk_watch_interval="15secs" --containerizers="mesos" --credential="/tmp/Endpoint_SlaveEndpointTest_UnauthorizedRequest_2_oKtxkK/credential"
--default_role="*" --disk_watch_interval="1mins" --docker="docker" --docker_kill_orphans="true"
--docker_registry="https://registry-1.docker.io" --docker_remove_delay="6hrs" --docker_socket="/var/run/docker.sock"
--docker_stop_timeout="0ns" --docker_store_dir="/tmp/mesos/store/docker" --docker_volume_checkpoint_dir="/var/run/mesos/isolators/docker/volume"
--enforce_container_disk_quota="false" --executor_registration_timeout="1mins" --executor_shutdown_grace_period="5secs"
--fetcher_cache_dir="/tmp/Endpoint_SlaveEndpointTest_UnauthorizedRequest_2_oKtxkK/fetch" --fetcher_cache_size="2GB"
--frameworks_home="" --gc_delay="1weeks" --gc_disk_headroom="0.1" --hadoop_home="" --help="false"
--hostname_lookup="true" --http_authenticators="basic" --http_command_executor="false" --http_credentials="/tmp/Endpoint_SlaveEndpointTest_UnauthorizedRequest_2_oKtxkK/http_credentials"
--image_provisioner_backend="copy" --initialize_driver_logging="true" --isolation="posix/cpu,posix/mem"
--launcher="posix" --launcher_dir="/mesos/mesos-1.2.0/_build/src" --logbufsecs="0" --logging_level="INFO"
--max_completed_executors_per_framework="150" --oversubscribed_resources_interval="15secs"
--perf_duration="10secs" --perf_interval="1mins" --qos_correction_interval_min="0ns" --quiet="false"
--recover="reconnect" --recovery_timeout="15mins" --registration_backoff_factor="10ms" --resources="cpus:2;gpus:0;mem:1024;disk:1024;ports:[31000-32000]"
--revocable_cpu_low_priority="true" --runtime_dir="/tmp/Endpoint_SlaveEndpointTest_UnauthorizedRequest_2_oKtxkK"
--sandbox_directory="/mnt/mesos/sandbox" --strict="true" --switch_user="true" --systemd_enable_support="true"
--systemd_runtime_directory="/run/systemd/system" --version="false" --work_dir="/tmp/Endpoint_SlaveEndpointTest_UnauthorizedRequest_2_7YNCcs"
I1116 12:57:43.434505 28160 credentials.hpp:86] Loading credential for authentication from
'/tmp/Endpoint_SlaveEndpointTest_UnauthorizedRequest_2_oKtxkK/credential'
I1116 12:57:43.434662 28160 slave.cpp:346] Agent using credential for: test-principal
I1116 12:57:43.434690 28160 credentials.hpp:37] Loading credentials for authentication from
'/tmp/Endpoint_SlaveEndpointTest_UnauthorizedRequest_2_oKtxkK/http_credentials'
I1116 12:57:43.434937 28160 http.cpp:895] Using default 'basic' HTTP authenticator for realm
'mesos-agent-readonly'
I1116 12:57:43.435075 28160 http.cpp:895] Using default 'basic' HTTP authenticator for realm
'mesos-agent-readwrite'
I1116 12:57:43.436235 28160 slave.cpp:533] Agent resources: cpus(*):2; mem(*):1024; disk(*):1024;
ports(*):[31000-32000]
I1116 12:57:43.436334 28160 slave.cpp:541] Agent attributes: [  ]
I1116 12:57:43.436359 28160 slave.cpp:546] Agent hostname: 4259ff14106a
I1116 12:57:43.438091 28164 state.cpp:57] Recovering state from '/tmp/Endpoint_SlaveEndpointTest_UnauthorizedRequest_2_7YNCcs/meta'
I1116 12:57:43.438334 28169 status_update_manager.cpp:203] Recovering status update manager
I1116 12:57:43.438621 28161 containerizer.cpp:561] Recovering containerizer
I1116 12:57:43.440011 28165 provisioner.cpp:253] Provisioner recovery complete
I1116 12:57:43.440407 28164 slave.cpp:5411] Finished recovery
I1116 12:57:43.441088 28164 slave.cpp:5585] Querying resource estimator for oversubscribable
resources
I1116 12:57:43.441365 28169 slave.cpp:5599] Received oversubscribable resources {} from the
resource estimator
I1116 12:57:43.443294 28158 process.cpp:3570] Handling HTTP event for process 'slave(648)'
with path: '/slave(648)/containers'
I1116 12:57:43.444247 28156 http.cpp:847] Authorizing principal 'test-principal' to GET the
'/containers' endpoint
I1116 12:57:43.446547 28169 slave.cpp:787] Agent terminating
[       OK ] Endpoint/SlaveEndpointTest.UnauthorizedRequest/2 (30 ms)
[ RUN      ] Endpoint/SlaveEndpointTest.NoAuthorizer/0
I1116 12:57:43.459076 28137 containerizer.cpp:202] Using isolation: posix/cpu,posix/mem,filesystem/posix,network/cni
W1116 12:57:43.459841 28137 backend.cpp:76] Failed to create 'aufs' backend: AufsBackend requires
root privileges, but is running as user mesos
W1116 12:57:43.460043 28137 backend.cpp:76] Failed to create 'bind' backend: BindBackend requires
root privileges
I1116 12:57:43.461726 28137 cluster.cpp:435] Creating default 'local' authorizer
I1116 12:57:43.463141 28158 slave.cpp:208] Mesos agent started on (649)@172.17.0.3:46777
I1116 12:57:43.463173 28158 slave.cpp:209] Flags at startup: --acls="" --appc_simple_discovery_uri_prefix="http://"
--appc_store_dir="/tmp/mesos/store/appc" --authenticate_http_readonly="true" --authenticate_http_readwrite="true"
--authenticatee="crammd5" --authentication_backoff_factor="1secs" --authorizer="local" --cgroups_cpu_enable_pids_and_tids_count="false"
--cgroups_enable_cfs="false" --cgroups_hierarchy="/sys/fs/cgroup" --cgroups_limit_swap="false"
--cgroups_root="mesos" --container_disk_watch_interval="15secs" --containerizers="mesos" --credential="/tmp/Endpoint_SlaveEndpointTest_NoAuthorizer_0_Ye4n7U/credential"
--default_role="*" --disk_watch_interval="1mins" --docker="docker" --docker_kill_orphans="true"
--docker_registry="https://registry-1.docker.io" --docker_remove_delay="6hrs" --docker_socket="/var/run/docker.sock"
--docker_stop_timeout="0ns" --docker_store_dir="/tmp/mesos/store/docker" --docker_volume_checkpoint_dir="/var/run/mesos/isolators/docker/volume"
--enforce_container_disk_quota="false" --executor_registration_timeout="1mins" --executor_shutdown_grace_period="5secs"
--fetcher_cache_dir="/tmp/Endpoint_SlaveEndpointTest_NoAuthorizer_0_Ye4n7U/fetch" --fetcher_cache_size="2GB"
--frameworks_home="" --gc_delay="1weeks" --gc_disk_headroom="0.1" --hadoop_home="" --help="false"
--hostname_lookup="true" --http_authenticators="basic" --http_command_executor="false" --http_credentials="/tmp/Endpoint_SlaveEndpointTest_NoAuthorizer_0_Ye4n7U/http_credentials"
--image_provisioner_backend="copy" --initialize_driver_logging="true" --isolation="posix/cpu,posix/mem"
--launcher="posix" --launcher_dir="/mesos/mesos-1.2.0/_build/src" --logbufsecs="0" --logging_level="INFO"
--max_completed_executors_per_framework="150" --oversubscribed_resources_interval="15secs"
--perf_duration="10secs" --perf_interval="1mins" --qos_correction_interval_min="0ns" --quiet="false"
--recover="reconnect" --recovery_timeout="15mins" --registration_backoff_factor="10ms" --resources="cpus:2;gpus:0;mem:1024;disk:1024;ports:[31000-32000]"
--revocable_cpu_low_priority="true" --runtime_dir="/tmp/Endpoint_SlaveEndpointTest_NoAuthorizer_0_Ye4n7U"
--sandbox_directory="/mnt/mesos/sandbox" --strict="true" --switch_user="true" --systemd_enable_support="true"
--systemd_runtime_directory="/run/systemd/system" --version="false" --work_dir="/tmp/Endpoint_SlaveEndpointTest_NoAuthorizer_0_ZRVsUC"
I1116 12:57:43.463723 28158 credentials.hpp:86] Loading credential for authentication from
'/tmp/Endpoint_SlaveEndpointTest_NoAuthorizer_0_Ye4n7U/credential'
I1116 12:57:43.463891 28158 slave.cpp:346] Agent using credential for: test-principal
I1116 12:57:43.463922 28158 credentials.hpp:37] Loading credentials for authentication from
'/tmp/Endpoint_SlaveEndpointTest_NoAuthorizer_0_Ye4n7U/http_credentials'
I1116 12:57:43.464190 28158 http.cpp:895] Using default 'basic' HTTP authenticator for realm
'mesos-agent-readonly'
I1116 12:57:43.464339 28158 http.cpp:895] Using default 'basic' HTTP authenticator for realm
'mesos-agent-readwrite'
I1116 12:57:43.465509 28158 slave.cpp:533] Agent resources: cpus(*):2; mem(*):1024; disk(*):1024;
ports(*):[31000-32000]
I1116 12:57:43.465581 28158 slave.cpp:541] Agent attributes: [  ]
I1116 12:57:43.465600 28158 slave.cpp:546] Agent hostname: 4259ff14106a
I1116 12:57:43.466931 28165 state.cpp:57] Recovering state from '/tmp/Endpoint_SlaveEndpointTest_NoAuthorizer_0_ZRVsUC/meta'
I1116 12:57:43.467284 28170 status_update_manager.cpp:203] Recovering status update manager
I1116 12:57:43.467531 28157 containerizer.cpp:561] Recovering containerizer
I1116 12:57:43.468587 28169 provisioner.cpp:253] Provisioner recovery complete
I1116 12:57:43.468946 28155 slave.cpp:5411] Finished recovery
I1116 12:57:43.469338 28155 slave.cpp:5585] Querying resource estimator for oversubscribable
resources
I1116 12:57:43.469566 28164 slave.cpp:5599] Received oversubscribable resources {} from the
resource estimator
I1116 12:57:43.471182 28169 process.cpp:3570] Handling HTTP event for process 'slave(649)'
with path: '/slave(649)/monitor/statistics'
I1116 12:57:43.472210 28161 http.cpp:847] Authorizing principal 'test-principal' to GET the
'/monitor/statistics' endpoint
I1116 12:57:43.475380 28169 slave.cpp:787] Agent terminating
[       OK ] Endpoint/SlaveEndpointTest.NoAuthorizer/0 (27 ms)
[ RUN      ] Endpoint/SlaveEndpointTest.NoAuthorizer/1
I1116 12:57:43.486156 28137 containerizer.cpp:202] Using isolation: posix/cpu,posix/mem,filesystem/posix,network/cni
W1116 12:57:43.486853 28137 backend.cpp:76] Failed to create 'aufs' backend: AufsBackend requires
root privileges, but is running as user mesos
W1116 12:57:43.487025 28137 backend.cpp:76] Failed to create 'bind' backend: BindBackend requires
root privileges
I1116 12:57:43.488545 28137 cluster.cpp:435] Creating default 'local' authorizer
I1116 12:57:43.490190 28159 slave.cpp:208] Mesos agent started on (650)@172.17.0.3:46777
I1116 12:57:43.490229 28159 slave.cpp:209] Flags at startup: --acls="" --appc_simple_discovery_uri_prefix="http://"
--appc_store_dir="/tmp/mesos/store/appc" --authenticate_http_readonly="true" --authenticate_http_readwrite="true"
--authenticatee="crammd5" --authentication_backoff_factor="1secs" --authorizer="local" --cgroups_cpu_enable_pids_and_tids_count="false"
--cgroups_enable_cfs="false" --cgroups_hierarchy="/sys/fs/cgroup" --cgroups_limit_swap="false"
--cgroups_root="mesos" --container_disk_watch_interval="15secs" --containerizers="mesos" --credential="/tmp/Endpoint_SlaveEndpointTest_NoAuthorizer_1_Iahcc6/credential"
--default_role="*" --disk_watch_interval="1mins" --docker="docker" --docker_kill_orphans="true"
--docker_registry="https://registry-1.docker.io" --docker_remove_delay="6hrs" --docker_socket="/var/run/docker.sock"
--docker_stop_timeout="0ns" --docker_store_dir="/tmp/mesos/store/docker" --docker_volume_checkpoint_dir="/var/run/mesos/isolators/docker/volume"
--enforce_container_disk_quota="false" --executor_registration_timeout="1mins" --executor_shutdown_grace_period="5secs"
--fetcher_cache_dir="/tmp/Endpoint_SlaveEndpointTest_NoAuthorizer_1_Iahcc6/fetch" --fetcher_cache_size="2GB"
--frameworks_home="" --gc_delay="1weeks" --gc_disk_headroom="0.1" --hadoop_home="" --help="false"
--hostname_lookup="true" --http_authenticators="basic" --http_command_executor="false" --http_credentials="/tmp/Endpoint_SlaveEndpointTest_NoAuthorizer_1_Iahcc6/http_credentials"
--image_provisioner_backend="copy" --initialize_driver_logging="true" --isolation="posix/cpu,posix/mem"
--launcher="posix" --launcher_dir="/mesos/mesos-1.2.0/_build/src" --logbufsecs="0" --logging_level="INFO"
--max_completed_executors_per_framework="150" --oversubscribed_resources_interval="15secs"
--perf_duration="10secs" --perf_interval="1mins" --qos_correction_interval_min="0ns" --quiet="false"
--recover="reconnect" --recovery_timeout="15mins" --registration_backoff_factor="10ms" --resources="cpus:2;gpus:0;mem:1024;disk:1024;ports:[31000-32000]"
--revocable_cpu_low_priority="true" --runtime_dir="/tmp/Endpoint_SlaveEndpointTest_NoAuthorizer_1_Iahcc6"
--sandbox_directory="/mnt/mesos/sandbox" --strict="true" --switch_user="true" --systemd_enable_support="true"
--systemd_runtime_directory="/run/systemd/system" --version="false" --work_dir="/tmp/Endpoint_SlaveEndpointTest_NoAuthorizer_1_3fPPUN"
I1116 12:57:43.490717 28159 credentials.hpp:86] Loading credential for authentication from
'/tmp/Endpoint_SlaveEndpointTest_NoAuthorizer_1_Iahcc6/credential'
I1116 12:57:43.490869 28159 slave.cpp:346] Agent using credential for: test-principal
I1116 12:57:43.490891 28159 credentials.hpp:37] Loading credentials for authentication from
'/tmp/Endpoint_SlaveEndpointTest_NoAuthorizer_1_Iahcc6/http_credentials'
I1116 12:57:43.491101 28159 http.cpp:895] Using default 'basic' HTTP authenticator for realm
'mesos-agent-readonly'
I1116 12:57:43.491237 28159 http.cpp:895] Using default 'basic' HTTP authenticator for realm
'mesos-agent-readwrite'
I1116 12:57:43.492305 28159 slave.cpp:533] Agent resources: cpus(*):2; mem(*):1024; disk(*):1024;
ports(*):[31000-32000]
I1116 12:57:43.492380 28159 slave.cpp:541] Agent attributes: [  ]
I1116 12:57:43.492393 28159 slave.cpp:546] Agent hostname: 4259ff14106a
I1116 12:57:43.493970 28156 state.cpp:57] Recovering state from '/tmp/Endpoint_SlaveEndpointTest_NoAuthorizer_1_3fPPUN/meta'
I1116 12:57:43.494408 28168 status_update_manager.cpp:203] Recovering status update manager
I1116 12:57:43.494719 28163 containerizer.cpp:561] Recovering containerizer
I1116 12:57:43.495807 28166 provisioner.cpp:253] Provisioner recovery complete
I1116 12:57:43.496168 28162 slave.cpp:5411] Finished recovery
I1116 12:57:43.496597 28162 slave.cpp:5585] Querying resource estimator for oversubscribable
resources
I1116 12:57:43.496877 28168 slave.cpp:5599] Received oversubscribable resources {} from the
resource estimator
I1116 12:57:43.498627 28155 process.cpp:3570] Handling HTTP event for process 'slave(650)'
with path: '/slave(650)/monitor/statistics.json'
I1116 12:57:43.499645 28164 http.cpp:847] Authorizing principal 'test-principal' to GET the
'/monitor/statistics.json' endpoint
I1116 12:57:43.503188 28157 slave.cpp:787] Agent terminating
[       OK ] Endpoint/SlaveEndpointTest.NoAuthorizer/1 (26 ms)
[ RUN      ] Endpoint/SlaveEndpointTest.NoAuthorizer/2
I1116 12:57:43.512727 28137 containerizer.cpp:202] Using isolation: posix/cpu,posix/mem,filesystem/posix,network/cni
W1116 12:57:43.513295 28137 backend.cpp:76] Failed to create 'aufs' backend: AufsBackend requires
root privileges, but is running as user mesos
W1116 12:57:43.513451 28137 backend.cpp:76] Failed to create 'bind' backend: BindBackend requires
root privileges
I1116 12:57:43.514631 28137 cluster.cpp:435] Creating default 'local' authorizer
I1116 12:57:43.516005 28155 slave.cpp:208] Mesos agent started on (651)@172.17.0.3:46777
I1116 12:57:43.516042 28155 slave.cpp:209] Flags at startup: --acls="" --appc_simple_discovery_uri_prefix="http://"
--appc_store_dir="/tmp/mesos/store/appc" --authenticate_http_readonly="true" --authenticate_http_readwrite="true"
--authenticatee="crammd5" --authentication_backoff_factor="1secs" --authorizer="local" --cgroups_cpu_enable_pids_and_tids_count="false"
--cgroups_enable_cfs="false" --cgroups_hierarchy="/sys/fs/cgroup" --cgroups_limit_swap="false"
--cgroups_root="mesos" --container_disk_watch_interval="15secs" --containerizers="mesos" --credential="/tmp/Endpoint_SlaveEndpointTest_NoAuthorizer_2_c3ELyh/credential"
--default_role="*" --disk_watch_interval="1mins" --docker="docker" --docker_kill_orphans="true"
--docker_registry="https://registry-1.docker.io" --docker_remove_delay="6hrs" --docker_socket="/var/run/docker.sock"
--docker_stop_timeout="0ns" --docker_store_dir="/tmp/mesos/store/docker" --docker_volume_checkpoint_dir="/var/run/mesos/isolators/docker/volume"
--enforce_container_disk_quota="false" --executor_registration_timeout="1mins" --executor_shutdown_grace_period="5secs"
--fetcher_cache_dir="/tmp/Endpoint_SlaveEndpointTest_NoAuthorizer_2_c3ELyh/fetch" --fetcher_cache_size="2GB"
--frameworks_home="" --gc_delay="1weeks" --gc_disk_headroom="0.1" --hadoop_home="" --help="false"
--hostname_lookup="true" --http_authenticators="basic" --http_command_executor="false" --http_credentials="/tmp/Endpoint_SlaveEndpointTest_NoAuthorizer_2_c3ELyh/http_credentials"
--image_provisioner_backend="copy" --initialize_driver_logging="true" --isolation="posix/cpu,posix/mem"
--launcher="posix" --launcher_dir="/mesos/mesos-1.2.0/_build/src" --logbufsecs="0" --logging_level="INFO"
--max_completed_executors_per_framework="150" --oversubscribed_resources_interval="15secs"
--perf_duration="10secs" --perf_interval="1mins" --qos_correction_interval_min="0ns" --quiet="false"
--recover="reconnect" --recovery_timeout="15mins" --registration_backoff_factor="10ms" --resources="cpus:2;gpus:0;mem:1024;disk:1024;ports:[31000-32000]"
--revocable_cpu_low_priority="true" --runtime_dir="/tmp/Endpoint_SlaveEndpointTest_NoAuthorizer_2_c3ELyh"
--sandbox_directory="/mnt/mesos/sandbox" --strict="true" --switch_user="true" --systemd_enable_support="true"
--systemd_runtime_directory="/run/systemd/system" --version="false" --work_dir="/tmp/Endpoint_SlaveEndpointTest_NoAuthorizer_2_PjxYcZ"
I1116 12:57:43.516624 28155 credentials.hpp:86] Loading credential for authentication from
'/tmp/Endpoint_SlaveEndpointTest_NoAuthorizer_2_c3ELyh/credential'
I1116 12:57:43.516757 28155 slave.cpp:346] Agent using credential for: test-principal
I1116 12:57:43.516782 28155 credentials.hpp:37] Loading credentials for authentication from
'/tmp/Endpoint_SlaveEndpointTest_NoAuthorizer_2_c3ELyh/http_credentials'
I1116 12:57:43.516988 28155 http.cpp:895] Using default 'basic' HTTP authenticator for realm
'mesos-agent-readonly'
I1116 12:57:43.517138 28155 http.cpp:895] Using default 'basic' HTTP authenticator for realm
'mesos-agent-readwrite'
I1116 12:57:43.518323 28155 slave.cpp:533] Agent resources: cpus(*):2; mem(*):1024; disk(*):1024;
ports(*):[31000-32000]
I1116 12:57:43.518424 28155 slave.cpp:541] Agent attributes: [  ]
I1116 12:57:43.518448 28155 slave.cpp:546] Agent hostname: 4259ff14106a
I1116 12:57:43.519876 28167 state.cpp:57] Recovering state from '/tmp/Endpoint_SlaveEndpointTest_NoAuthorizer_2_PjxYcZ/meta'
I1116 12:57:43.520205 28157 status_update_manager.cpp:203] Recovering status update manager
I1116 12:57:43.520476 28159 containerizer.cpp:561] Recovering containerizer
I1116 12:57:43.521916 28159 provisioner.cpp:253] Provisioner recovery complete
I1116 12:57:43.522281 28157 slave.cpp:5411] Finished recovery
I1116 12:57:43.522716 28157 slave.cpp:5585] Querying resource estimator for oversubscribable
resources
I1116 12:57:43.522922 28166 slave.cpp:5599] Received oversubscribable resources {} from the
resource estimator
I1116 12:57:43.524334 28164 process.cpp:3570] Handling HTTP event for process 'slave(651)'
with path: '/slave(651)/containers'
I1116 12:57:43.525164 28162 http.cpp:847] Authorizing principal 'test-principal' to GET the
'/containers' endpoint
I1116 12:57:43.528352 28167 slave.cpp:787] Agent terminating
[       OK ] Endpoint/SlaveEndpointTest.NoAuthorizer/2 (25 ms)
[----------] 9 tests from Endpoint/SlaveEndpointTest (258 ms total)

[----------] Global test environment tear-down
[==========] 1378 tests from 156 test cases ran. (420181 ms total)
[  PASSED  ] 1377 tests.
[  FAILED  ] 1 test, listed below:
[  FAILED  ] MasterAuthorizationTest.KillPendingTaskInTaskGroup

 1 FAILED TEST
  YOU HAVE 4 DISABLED TESTS

make[4]: *** [check-local] Error 1
make[4]: Leaving directory `/mesos/mesos-1.2.0/_build/src'
make[3]: *** [check-am] Error 2
make[3]: Leaving directory `/mesos/mesos-1.2.0/_build/src'
make[2]: *** [check] Error 2
make[2]: Leaving directory `/mesos/mesos-1.2.0/_build/src'
make[1]: *** [check-recursive] Error 1
make[1]: Leaving directory `/mesos/mesos-1.2.0/_build'
make: *** [distcheck] Error 1
+ docker rmi mesos-1479298702-14690
Untagged: mesos-1479298702-14690:latest
Deleted: sha256:8f879aaa44b6562afe34496004aa10a5870ae457fb58e72bdf0690926fa7a244
Deleted: sha256:0eaef413ca666656ad76a45d295d369f072e0a29fea65c912969f420613adc92
Deleted: sha256:8c176d79828a0ed8c61ef64478c3a2b7a51bc4825e874c4eca62378c9bf1b034
Deleted: sha256:706dbfae432f2d46e67c290e8e80963345415baefc8bf83f3ce3467537f7b61a
Deleted: sha256:9a6f46e8fd1f153c765a9f23dd45f95f099024dce32a5375902701ee2fddc4ed
Deleted: sha256:fce3a2da65b3966da9c6e3048a8b3f91d28acdc335b2a45f9f08fc7e1ee73705
Deleted: sha256:1b75b7a741989508a376fb29976a8fe489cf5d757ba6cabfefa191701d0efd1f
Deleted: sha256:a200c66a48dea21d41ed0578657de15c128e7034c64d7befd496de4303340034
Deleted: sha256:f36144e5bb084f2b58e51ac078b0ffded46a5f16bb4f34d655d842ac214329c7
Deleted: sha256:8c0bd5a32096b7eece9dce022c7b9ab91cd969b094f7b00764d2d13b590e198e
Deleted: sha256:8b1744b4a7ed34c10e994d7cee25eba5c3a5dd4945deb179436210308ea8ebeb
Deleted: sha256:09714c17913b4b24a43bc738e253212c55cde37df255b05dcf0cd4fd696ec7df
Deleted: sha256:ca079412659b8cb9743410905d2145135ef1ad45d3c998f1bdb11920e237ebc6
Deleted: sha256:bce2b81ec9590d4ff1cceaea5f18c561d5b7d05cc9c422d7eec138091f09c4c1
Deleted: sha256:87601686d5cb454730e226467d858ead64906944b87a1c1f2d2314b9f3651086
Deleted: sha256:b9a484397b1c1a1f6423a9aeb06d127d2a2e9b494b78f78f204d896d3d1c170e
Deleted: sha256:7a3272efae2f50d777e9d96a0a3935f4cbf17377cb7e75353345cd6d4fe2e83e
Deleted: sha256:7e5bd614fa41ea0579ce46772525c94bb88ab23b5f071625f800748c263e3775
Deleted: sha256:35daf7bd6d3b327361e3c7fa49138f750036ce3bffa5f166bf84c322299c2e9d
Deleted: sha256:d8b938835acb3e33b00aa9cee8afd5e71c67dfb1b00f936cb7cdf6e8f816887f
Deleted: sha256:ff592db974352bf7df610f749d5f1a7fca1b34455d748478e7521fe63aee76b3
Deleted: sha256:7cbcfb50f70a772c190313cadeebd6aaea3006a59c47b62115235eb166d7be0b
Deleted: sha256:998aae989e5a955bb8a65028eae4dcff6d4937c503b071e3060b2c494e519e8d
Deleted: sha256:d34c4d278e1130e89ac1ec49aca0641197bdfdc00f2244a87f11857e851e9094
Build step 'Execute shell' marked build as failure

Mime
View raw message