mesos-builds mailing list archives

Site index · List index
Message view « Date » · « Thread »
Top « Date » · « Thread »
From Apache Jenkins Server <jenk...@builds.apache.org>
Subject Build failed in Jenkins: Mesos » autotools,gcc,--verbose --enable-libevent --enable-ssl,GLOG_v=1 MESOS_VERBOSE=1,ubuntu:14.04,(docker||Hadoop)&&(!ubuntu-us1)&&(!ubuntu-6)&&(!ubuntu-eu2) #2933
Date Wed, 16 Nov 2016 14:30:27 GMT
See <https://builds.apache.org/job/Mesos/BUILDTOOL=autotools,COMPILER=gcc,CONFIGURATION=--verbose%20--enable-libevent%20--enable-ssl,ENVIRONMENT=GLOG_v=1%20MESOS_VERBOSE=1,OS=ubuntu%3A14.04,label_exp=(docker%7C%7CHadoop)&&(!ubuntu-us1)&&(!ubuntu-6)&&(!ubuntu-eu2)/2933/changes>

Changes:

[alexr] Added a comment about deprecation cycle of quota get authz.

------------------------------------------
[...truncated 222325 lines...]
I1116 14:27:35.400284 30948 containerizer.cpp:202] Using isolation: posix/cpu,posix/mem,filesystem/posix,network/cni
W1116 14:27:35.400846 30948 backend.cpp:76] Failed to create 'aufs' backend: AufsBackend requires
root privileges, but is running as user mesos
W1116 14:27:35.400980 30948 backend.cpp:76] Failed to create 'bind' backend: BindBackend requires
root privileges
I1116 14:27:35.405436 30978 slave.cpp:208] Mesos agent started on (644)@172.17.0.3:56829
I1116 14:27:35.405462 30978 slave.cpp:209] Flags at startup: --acls="" --appc_simple_discovery_uri_prefix="http://"
--appc_store_dir="/tmp/mesos/store/appc" --authenticate_http_readonly="true" --authenticate_http_readwrite="true"
--authenticatee="crammd5" --authentication_backoff_factor="1secs" --authorizer="local" --cgroups_cpu_enable_pids_and_tids_count="false"
--cgroups_enable_cfs="false" --cgroups_hierarchy="/sys/fs/cgroup" --cgroups_limit_swap="false"
--cgroups_root="mesos" --container_disk_watch_interval="15secs" --containerizers="mesos" --credential="/tmp/Endpoint_SlaveEndpointTest_AuthorizedRequest_1_6t56bO/credential"
--default_role="*" --disk_watch_interval="1mins" --docker="docker" --docker_kill_orphans="true"
--docker_registry="https://registry-1.docker.io" --docker_remove_delay="6hrs" --docker_socket="/var/run/docker.sock"
--docker_stop_timeout="0ns" --docker_store_dir="/tmp/mesos/store/docker" --docker_volume_checkpoint_dir="/var/run/mesos/isolators/docker/volume"
--enforce_container_disk_quota="false" --executor_registration_timeout="1mins" --executor_shutdown_grace_period="5secs"
--fetcher_cache_dir="/tmp/Endpoint_SlaveEndpointTest_AuthorizedRequest_1_6t56bO/fetch" --fetcher_cache_size="2GB"
--frameworks_home="" --gc_delay="1weeks" --gc_disk_headroom="0.1" --hadoop_home="" --help="false"
--hostname_lookup="true" --http_authenticators="basic" --http_command_executor="false" --http_credentials="/tmp/Endpoint_SlaveEndpointTest_AuthorizedRequest_1_6t56bO/http_credentials"
--image_provisioner_backend="copy" --initialize_driver_logging="true" --isolation="posix/cpu,posix/mem"
--launcher="posix" --launcher_dir="/mesos/mesos-1.2.0/_build/src" --logbufsecs="0" --logging_level="INFO"
--max_completed_executors_per_framework="150" --oversubscribed_resources_interval="15secs"
--perf_duration="10secs" --perf_interval="1mins" --qos_correction_interval_min="0ns" --quiet="false"
--recover="reconnect" --recovery_timeout="15mins" --registration_backoff_factor="10ms" --resources="cpus:2;gpus:0;mem:1024;disk:1024;ports:[31000-32000]"
--revocable_cpu_low_priority="true" --runtime_dir="/tmp/Endpoint_SlaveEndpointTest_AuthorizedRequest_1_6t56bO"
--sandbox_directory="/mnt/mesos/sandbox" --strict="true" --switch_user="true" --systemd_enable_support="true"
--systemd_runtime_directory="/run/systemd/system" --version="false" --work_dir="/tmp/Endpoint_SlaveEndpointTest_AuthorizedRequest_1_OjLwwx"
I1116 14:27:35.406361 30978 credentials.hpp:86] Loading credential for authentication from
'/tmp/Endpoint_SlaveEndpointTest_AuthorizedRequest_1_6t56bO/credential'
I1116 14:27:35.406677 30978 slave.cpp:346] Agent using credential for: test-principal
I1116 14:27:35.406782 30978 credentials.hpp:37] Loading credentials for authentication from
'/tmp/Endpoint_SlaveEndpointTest_AuthorizedRequest_1_6t56bO/http_credentials'
I1116 14:27:35.407196 30978 http.cpp:895] Using default 'basic' HTTP authenticator for realm
'mesos-agent-readonly'
I1116 14:27:35.407546 30978 http.cpp:895] Using default 'basic' HTTP authenticator for realm
'mesos-agent-readwrite'
I1116 14:27:35.409431 30978 slave.cpp:533] Agent resources: cpus(*):2; mem(*):1024; disk(*):1024;
ports(*):[31000-32000]
I1116 14:27:35.409689 30978 slave.cpp:541] Agent attributes: [  ]
I1116 14:27:35.409821 30978 slave.cpp:546] Agent hostname: 5817a5b56afb
I1116 14:27:35.411998 30970 state.cpp:57] Recovering state from '/tmp/Endpoint_SlaveEndpointTest_AuthorizedRequest_1_OjLwwx/meta'
I1116 14:27:35.412678 30968 status_update_manager.cpp:203] Recovering status update manager
I1116 14:27:35.413048 30975 containerizer.cpp:561] Recovering containerizer
I1116 14:27:35.415036 30975 provisioner.cpp:253] Provisioner recovery complete
I1116 14:27:35.415485 30970 slave.cpp:5411] Finished recovery
I1116 14:27:35.416321 30970 slave.cpp:5585] Querying resource estimator for oversubscribable
resources
I1116 14:27:35.416712 30970 slave.cpp:5599] Received oversubscribable resources {} from the
resource estimator
I1116 14:27:35.419165 30979 process.cpp:3570] Handling HTTP event for process 'slave(644)'
with path: '/slave(644)/monitor/statistics.json'
I1116 14:27:35.420332 30978 http.cpp:847] Authorizing principal 'test-principal' to GET the
'/monitor/statistics.json' endpoint
I1116 14:27:35.424998 30975 slave.cpp:787] Agent terminating
[       OK ] Endpoint/SlaveEndpointTest.AuthorizedRequest/1 (40 ms)
[ RUN      ] Endpoint/SlaveEndpointTest.AuthorizedRequest/2
I1116 14:27:35.444366 30948 containerizer.cpp:202] Using isolation: posix/cpu,posix/mem,filesystem/posix,network/cni
W1116 14:27:35.445293 30948 backend.cpp:76] Failed to create 'aufs' backend: AufsBackend requires
root privileges, but is running as user mesos
W1116 14:27:35.445514 30948 backend.cpp:76] Failed to create 'bind' backend: BindBackend requires
root privileges
I1116 14:27:35.448741 30977 slave.cpp:208] Mesos agent started on (645)@172.17.0.3:56829
I1116 14:27:35.448781 30977 slave.cpp:209] Flags at startup: --acls="" --appc_simple_discovery_uri_prefix="http://"
--appc_store_dir="/tmp/mesos/store/appc" --authenticate_http_readonly="true" --authenticate_http_readwrite="true"
--authenticatee="crammd5" --authentication_backoff_factor="1secs" --authorizer="local" --cgroups_cpu_enable_pids_and_tids_count="false"
--cgroups_enable_cfs="false" --cgroups_hierarchy="/sys/fs/cgroup" --cgroups_limit_swap="false"
--cgroups_root="mesos" --container_disk_watch_interval="15secs" --containerizers="mesos" --credential="/tmp/Endpoint_SlaveEndpointTest_AuthorizedRequest_2_iYnwfT/credential"
--default_role="*" --disk_watch_interval="1mins" --docker="docker" --docker_kill_orphans="true"
--docker_registry="https://registry-1.docker.io" --docker_remove_delay="6hrs" --docker_socket="/var/run/docker.sock"
--docker_stop_timeout="0ns" --docker_store_dir="/tmp/mesos/store/docker" --docker_volume_checkpoint_dir="/var/run/mesos/isolators/docker/volume"
--enforce_container_disk_quota="false" --executor_registration_timeout="1mins" --executor_shutdown_grace_period="5secs"
--fetcher_cache_dir="/tmp/Endpoint_SlaveEndpointTest_AuthorizedRequest_2_iYnwfT/fetch" --fetcher_cache_size="2GB"
--frameworks_home="" --gc_delay="1weeks" --gc_disk_headroom="0.1" --hadoop_home="" --help="false"
--hostname_lookup="true" --http_authenticators="basic" --http_command_executor="false" --http_credentials="/tmp/Endpoint_SlaveEndpointTest_AuthorizedRequest_2_iYnwfT/http_credentials"
--image_provisioner_backend="copy" --initialize_driver_logging="true" --isolation="posix/cpu,posix/mem"
--launcher="posix" --launcher_dir="/mesos/mesos-1.2.0/_build/src" --logbufsecs="0" --logging_level="INFO"
--max_completed_executors_per_framework="150" --oversubscribed_resources_interval="15secs"
--perf_duration="10secs" --perf_interval="1mins" --qos_correction_interval_min="0ns" --quiet="false"
--recover="reconnect" --recovery_timeout="15mins" --registration_backoff_factor="10ms" --resources="cpus:2;gpus:0;mem:1024;disk:1024;ports:[31000-32000]"
--revocable_cpu_low_priority="true" --runtime_dir="/tmp/Endpoint_SlaveEndpointTest_AuthorizedRequest_2_iYnwfT"
--sandbox_directory="/mnt/mesos/sandbox" --strict="true" --switch_user="true" --systemd_enable_support="true"
--systemd_runtime_directory="/run/systemd/system" --version="false" --work_dir="/tmp/Endpoint_SlaveEndpointTest_AuthorizedRequest_2_Yph2sC"
I1116 14:27:35.449463 30977 credentials.hpp:86] Loading credential for authentication from
'/tmp/Endpoint_SlaveEndpointTest_AuthorizedRequest_2_iYnwfT/credential'
I1116 14:27:35.449704 30977 slave.cpp:346] Agent using credential for: test-principal
I1116 14:27:35.449730 30977 credentials.hpp:37] Loading credentials for authentication from
'/tmp/Endpoint_SlaveEndpointTest_AuthorizedRequest_2_iYnwfT/http_credentials'
I1116 14:27:35.450063 30977 http.cpp:895] Using default 'basic' HTTP authenticator for realm
'mesos-agent-readonly'
I1116 14:27:35.450253 30977 http.cpp:895] Using default 'basic' HTTP authenticator for realm
'mesos-agent-readwrite'
I1116 14:27:35.451776 30977 slave.cpp:533] Agent resources: cpus(*):2; mem(*):1024; disk(*):1024;
ports(*):[31000-32000]
I1116 14:27:35.451894 30977 slave.cpp:541] Agent attributes: [  ]
I1116 14:27:35.451937 30977 slave.cpp:546] Agent hostname: 5817a5b56afb
I1116 14:27:35.453969 30967 state.cpp:57] Recovering state from '/tmp/Endpoint_SlaveEndpointTest_AuthorizedRequest_2_Yph2sC/meta'
I1116 14:27:35.454285 30980 status_update_manager.cpp:203] Recovering status update manager
I1116 14:27:35.454635 30973 containerizer.cpp:561] Recovering containerizer
I1116 14:27:35.456527 30973 provisioner.cpp:253] Provisioner recovery complete
I1116 14:27:35.456989 30973 slave.cpp:5411] Finished recovery
I1116 14:27:35.457659 30973 slave.cpp:5585] Querying resource estimator for oversubscribable
resources
I1116 14:27:35.457984 30972 slave.cpp:5599] Received oversubscribable resources {} from the
resource estimator
I1116 14:27:35.460067 30978 process.cpp:3570] Handling HTTP event for process 'slave(645)'
with path: '/slave(645)/containers'
I1116 14:27:35.461123 30979 http.cpp:847] Authorizing principal 'test-principal' to GET the
'/containers' endpoint
I1116 14:27:35.464967 30981 slave.cpp:787] Agent terminating
[       OK ] Endpoint/SlaveEndpointTest.AuthorizedRequest/2 (32 ms)
[ RUN      ] Endpoint/SlaveEndpointTest.UnauthorizedRequest/0
I1116 14:27:35.473783 30948 containerizer.cpp:202] Using isolation: posix/cpu,posix/mem,filesystem/posix,network/cni
W1116 14:27:35.474424 30948 backend.cpp:76] Failed to create 'aufs' backend: AufsBackend requires
root privileges, but is running as user mesos
W1116 14:27:35.474589 30948 backend.cpp:76] Failed to create 'bind' backend: BindBackend requires
root privileges
I1116 14:27:35.477913 30969 slave.cpp:208] Mesos agent started on (646)@172.17.0.3:56829
I1116 14:27:35.477951 30969 slave.cpp:209] Flags at startup: --acls="" --appc_simple_discovery_uri_prefix="http://"
--appc_store_dir="/tmp/mesos/store/appc" --authenticate_http_readonly="true" --authenticate_http_readwrite="true"
--authenticatee="crammd5" --authentication_backoff_factor="1secs" --authorizer="local" --cgroups_cpu_enable_pids_and_tids_count="false"
--cgroups_enable_cfs="false" --cgroups_hierarchy="/sys/fs/cgroup" --cgroups_limit_swap="false"
--cgroups_root="mesos" --container_disk_watch_interval="15secs" --containerizers="mesos" --credential="/tmp/Endpoint_SlaveEndpointTest_UnauthorizedRequest_0_eaKXEY/credential"
--default_role="*" --disk_watch_interval="1mins" --docker="docker" --docker_kill_orphans="true"
--docker_registry="https://registry-1.docker.io" --docker_remove_delay="6hrs" --docker_socket="/var/run/docker.sock"
--docker_stop_timeout="0ns" --docker_store_dir="/tmp/mesos/store/docker" --docker_volume_checkpoint_dir="/var/run/mesos/isolators/docker/volume"
--enforce_container_disk_quota="false" --executor_registration_timeout="1mins" --executor_shutdown_grace_period="5secs"
--fetcher_cache_dir="/tmp/Endpoint_SlaveEndpointTest_UnauthorizedRequest_0_eaKXEY/fetch" --fetcher_cache_size="2GB"
--frameworks_home="" --gc_delay="1weeks" --gc_disk_headroom="0.1" --hadoop_home="" --help="false"
--hostname_lookup="true" --http_authenticators="basic" --http_command_executor="false" --http_credentials="/tmp/Endpoint_SlaveEndpointTest_UnauthorizedRequest_0_eaKXEY/http_credentials"
--image_provisioner_backend="copy" --initialize_driver_logging="true" --isolation="posix/cpu,posix/mem"
--launcher="posix" --launcher_dir="/mesos/mesos-1.2.0/_build/src" --logbufsecs="0" --logging_level="INFO"
--max_completed_executors_per_framework="150" --oversubscribed_resources_interval="15secs"
--perf_duration="10secs" --perf_interval="1mins" --qos_correction_interval_min="0ns" --quiet="false"
--recover="reconnect" --recovery_timeout="15mins" --registration_backoff_factor="10ms" --resources="cpus:2;gpus:0;mem:1024;disk:1024;ports:[31000-32000]"
--revocable_cpu_low_priority="true" --runtime_dir="/tmp/Endpoint_SlaveEndpointTest_UnauthorizedRequest_0_eaKXEY"
--sandbox_directory="/mnt/mesos/sandbox" --strict="true" --switch_user="true" --systemd_enable_support="true"
--systemd_runtime_directory="/run/systemd/system" --version="false" --work_dir="/tmp/Endpoint_SlaveEndpointTest_UnauthorizedRequest_0_Er8qNH"
I1116 14:27:35.478622 30969 credentials.hpp:86] Loading credential for authentication from
'/tmp/Endpoint_SlaveEndpointTest_UnauthorizedRequest_0_eaKXEY/credential'
I1116 14:27:35.478850 30969 slave.cpp:346] Agent using credential for: test-principal
I1116 14:27:35.478878 30969 credentials.hpp:37] Loading credentials for authentication from
'/tmp/Endpoint_SlaveEndpointTest_UnauthorizedRequest_0_eaKXEY/http_credentials'
I1116 14:27:35.479178 30969 http.cpp:895] Using default 'basic' HTTP authenticator for realm
'mesos-agent-readonly'
I1116 14:27:35.479351 30969 http.cpp:895] Using default 'basic' HTTP authenticator for realm
'mesos-agent-readwrite'
I1116 14:27:35.480437 30969 slave.cpp:533] Agent resources: cpus(*):2; mem(*):1024; disk(*):1024;
ports(*):[31000-32000]
I1116 14:27:35.480518 30969 slave.cpp:541] Agent attributes: [  ]
I1116 14:27:35.480619 30969 slave.cpp:546] Agent hostname: 5817a5b56afb
I1116 14:27:35.482491 30969 state.cpp:57] Recovering state from '/tmp/Endpoint_SlaveEndpointTest_UnauthorizedRequest_0_Er8qNH/meta'
I1116 14:27:35.485957 30973 status_update_manager.cpp:203] Recovering status update manager
I1116 14:27:35.486367 30974 containerizer.cpp:561] Recovering containerizer
I1116 14:27:35.488077 30977 provisioner.cpp:253] Provisioner recovery complete
I1116 14:27:35.488512 30973 slave.cpp:5411] Finished recovery
I1116 14:27:35.489275 30973 slave.cpp:5585] Querying resource estimator for oversubscribable
resources
I1116 14:27:35.489680 30973 slave.cpp:5599] Received oversubscribable resources {} from the
resource estimator
I1116 14:27:35.492025 30972 process.cpp:3570] Handling HTTP event for process 'slave(646)'
with path: '/slave(646)/monitor/statistics'
I1116 14:27:35.492998 30970 http.cpp:847] Authorizing principal 'test-principal' to GET the
'/monitor/statistics' endpoint
I1116 14:27:35.496016 30973 slave.cpp:787] Agent terminating
[       OK ] Endpoint/SlaveEndpointTest.UnauthorizedRequest/0 (31 ms)
[ RUN      ] Endpoint/SlaveEndpointTest.UnauthorizedRequest/1
I1116 14:27:35.506119 30948 containerizer.cpp:202] Using isolation: posix/cpu,posix/mem,filesystem/posix,network/cni
W1116 14:27:35.506932 30948 backend.cpp:76] Failed to create 'aufs' backend: AufsBackend requires
root privileges, but is running as user mesos
W1116 14:27:35.507091 30948 backend.cpp:76] Failed to create 'bind' backend: BindBackend requires
root privileges
I1116 14:27:35.511317 30969 slave.cpp:208] Mesos agent started on (647)@172.17.0.3:56829
I1116 14:27:35.511348 30969 slave.cpp:209] Flags at startup: --acls="" --appc_simple_discovery_uri_prefix="http://"
--appc_store_dir="/tmp/mesos/store/appc" --authenticate_http_readonly="true" --authenticate_http_readwrite="true"
--authenticatee="crammd5" --authentication_backoff_factor="1secs" --authorizer="local" --cgroups_cpu_enable_pids_and_tids_count="false"
--cgroups_enable_cfs="false" --cgroups_hierarchy="/sys/fs/cgroup" --cgroups_limit_swap="false"
--cgroups_root="mesos" --container_disk_watch_interval="15secs" --containerizers="mesos" --credential="/tmp/Endpoint_SlaveEndpointTest_UnauthorizedRequest_1_uKnLo4/credential"
--default_role="*" --disk_watch_interval="1mins" --docker="docker" --docker_kill_orphans="true"
--docker_registry="https://registry-1.docker.io" --docker_remove_delay="6hrs" --docker_socket="/var/run/docker.sock"
--docker_stop_timeout="0ns" --docker_store_dir="/tmp/mesos/store/docker" --docker_volume_checkpoint_dir="/var/run/mesos/isolators/docker/volume"
--enforce_container_disk_quota="false" --executor_registration_timeout="1mins" --executor_shutdown_grace_period="5secs"
--fetcher_cache_dir="/tmp/Endpoint_SlaveEndpointTest_UnauthorizedRequest_1_uKnLo4/fetch" --fetcher_cache_size="2GB"
--frameworks_home="" --gc_delay="1weeks" --gc_disk_headroom="0.1" --hadoop_home="" --help="false"
--hostname_lookup="true" --http_authenticators="basic" --http_command_executor="false" --http_credentials="/tmp/Endpoint_SlaveEndpointTest_UnauthorizedRequest_1_uKnLo4/http_credentials"
--image_provisioner_backend="copy" --initialize_driver_logging="true" --isolation="posix/cpu,posix/mem"
--launcher="posix" --launcher_dir="/mesos/mesos-1.2.0/_build/src" --logbufsecs="0" --logging_level="INFO"
--max_completed_executors_per_framework="150" --oversubscribed_resources_interval="15secs"
--perf_duration="10secs" --perf_interval="1mins" --qos_correction_interval_min="0ns" --quiet="false"
--recover="reconnect" --recovery_timeout="15mins" --registration_backoff_factor="10ms" --resources="cpus:2;gpus:0;mem:1024;disk:1024;ports:[31000-32000]"
--revocable_cpu_low_priority="true" --runtime_dir="/tmp/Endpoint_SlaveEndpointTest_UnauthorizedRequest_1_uKnLo4"
--sandbox_directory="/mnt/mesos/sandbox" --strict="true" --switch_user="true" --systemd_enable_support="true"
--systemd_runtime_directory="/run/systemd/system" --version="false" --work_dir="/tmp/Endpoint_SlaveEndpointTest_UnauthorizedRequest_1_2z09rN"
I1116 14:27:35.511925 30969 credentials.hpp:86] Loading credential for authentication from
'/tmp/Endpoint_SlaveEndpointTest_UnauthorizedRequest_1_uKnLo4/credential'
I1116 14:27:35.512109 30969 slave.cpp:346] Agent using credential for: test-principal
I1116 14:27:35.512130 30969 credentials.hpp:37] Loading credentials for authentication from
'/tmp/Endpoint_SlaveEndpointTest_UnauthorizedRequest_1_uKnLo4/http_credentials'
I1116 14:27:35.512353 30969 http.cpp:895] Using default 'basic' HTTP authenticator for realm
'mesos-agent-readonly'
I1116 14:27:35.512639 30969 http.cpp:895] Using default 'basic' HTTP authenticator for realm
'mesos-agent-readwrite'
I1116 14:27:35.513793 30969 slave.cpp:533] Agent resources: cpus(*):2; mem(*):1024; disk(*):1024;
ports(*):[31000-32000]
I1116 14:27:35.513900 30969 slave.cpp:541] Agent attributes: [  ]
I1116 14:27:35.513914 30969 slave.cpp:546] Agent hostname: 5817a5b56afb
I1116 14:27:35.515413 30978 state.cpp:57] Recovering state from '/tmp/Endpoint_SlaveEndpointTest_UnauthorizedRequest_1_2z09rN/meta'
I1116 14:27:35.515853 30969 status_update_manager.cpp:203] Recovering status update manager
I1116 14:27:35.516088 30974 containerizer.cpp:561] Recovering containerizer
I1116 14:27:35.517729 30977 provisioner.cpp:253] Provisioner recovery complete
I1116 14:27:35.518235 30981 slave.cpp:5411] Finished recovery
I1116 14:27:35.518908 30981 slave.cpp:5585] Querying resource estimator for oversubscribable
resources
I1116 14:27:35.519232 30976 slave.cpp:5599] Received oversubscribable resources {} from the
resource estimator
I1116 14:27:35.521486 30967 process.cpp:3570] Handling HTTP event for process 'slave(647)'
with path: '/slave(647)/monitor/statistics.json'
I1116 14:27:35.522490 30968 http.cpp:847] Authorizing principal 'test-principal' to GET the
'/monitor/statistics.json' endpoint
I1116 14:27:35.529134 30968 slave.cpp:787] Agent terminating
[       OK ] Endpoint/SlaveEndpointTest.UnauthorizedRequest/1 (34 ms)
[ RUN      ] Endpoint/SlaveEndpointTest.UnauthorizedRequest/2
I1116 14:27:35.539479 30948 containerizer.cpp:202] Using isolation: posix/cpu,posix/mem,filesystem/posix,network/cni
W1116 14:27:35.540099 30948 backend.cpp:76] Failed to create 'aufs' backend: AufsBackend requires
root privileges, but is running as user mesos
W1116 14:27:35.540262 30948 backend.cpp:76] Failed to create 'bind' backend: BindBackend requires
root privileges
I1116 14:27:35.543988 30974 slave.cpp:208] Mesos agent started on (648)@172.17.0.3:56829
I1116 14:27:35.544167 30974 slave.cpp:209] Flags at startup: --acls="" --appc_simple_discovery_uri_prefix="http://"
--appc_store_dir="/tmp/mesos/store/appc" --authenticate_http_readonly="true" --authenticate_http_readwrite="true"
--authenticatee="crammd5" --authentication_backoff_factor="1secs" --authorizer="local" --cgroups_cpu_enable_pids_and_tids_count="false"
--cgroups_enable_cfs="false" --cgroups_hierarchy="/sys/fs/cgroup" --cgroups_limit_swap="false"
--cgroups_root="mesos" --container_disk_watch_interval="15secs" --containerizers="mesos" --credential="/tmp/Endpoint_SlaveEndpointTest_UnauthorizedRequest_2_67q3ta/credential"
--default_role="*" --disk_watch_interval="1mins" --docker="docker" --docker_kill_orphans="true"
--docker_registry="https://registry-1.docker.io" --docker_remove_delay="6hrs" --docker_socket="/var/run/docker.sock"
--docker_stop_timeout="0ns" --docker_store_dir="/tmp/mesos/store/docker" --docker_volume_checkpoint_dir="/var/run/mesos/isolators/docker/volume"
--enforce_container_disk_quota="false" --executor_registration_timeout="1mins" --executor_shutdown_grace_period="5secs"
--fetcher_cache_dir="/tmp/Endpoint_SlaveEndpointTest_UnauthorizedRequest_2_67q3ta/fetch" --fetcher_cache_size="2GB"
--frameworks_home="" --gc_delay="1weeks" --gc_disk_headroom="0.1" --hadoop_home="" --help="false"
--hostname_lookup="true" --http_authenticators="basic" --http_command_executor="false" --http_credentials="/tmp/Endpoint_SlaveEndpointTest_UnauthorizedRequest_2_67q3ta/http_credentials"
--image_provisioner_backend="copy" --initialize_driver_logging="true" --isolation="posix/cpu,posix/mem"
--launcher="posix" --launcher_dir="/mesos/mesos-1.2.0/_build/src" --logbufsecs="0" --logging_level="INFO"
--max_completed_executors_per_framework="150" --oversubscribed_resources_interval="15secs"
--perf_duration="10secs" --perf_interval="1mins" --qos_correction_interval_min="0ns" --quiet="false"
--recover="reconnect" --recovery_timeout="15mins" --registration_backoff_factor="10ms" --resources="cpus:2;gpus:0;mem:1024;disk:1024;ports:[31000-32000]"
--revocable_cpu_low_priority="true" --runtime_dir="/tmp/Endpoint_SlaveEndpointTest_UnauthorizedRequest_2_67q3ta"
--sandbox_directory="/mnt/mesos/sandbox" --strict="true" --switch_user="true" --systemd_enable_support="true"
--systemd_runtime_directory="/run/systemd/system" --version="false" --work_dir="/tmp/Endpoint_SlaveEndpointTest_UnauthorizedRequest_2_MiISrT"
I1116 14:27:35.544724 30974 credentials.hpp:86] Loading credential for authentication from
'/tmp/Endpoint_SlaveEndpointTest_UnauthorizedRequest_2_67q3ta/credential'
I1116 14:27:35.544978 30974 slave.cpp:346] Agent using credential for: test-principal
I1116 14:27:35.545002 30974 credentials.hpp:37] Loading credentials for authentication from
'/tmp/Endpoint_SlaveEndpointTest_UnauthorizedRequest_2_67q3ta/http_credentials'
I1116 14:27:35.545271 30974 http.cpp:895] Using default 'basic' HTTP authenticator for realm
'mesos-agent-readonly'
I1116 14:27:35.545433 30974 http.cpp:895] Using default 'basic' HTTP authenticator for realm
'mesos-agent-readwrite'
I1116 14:27:35.546582 30974 slave.cpp:533] Agent resources: cpus(*):2; mem(*):1024; disk(*):1024;
ports(*):[31000-32000]
I1116 14:27:35.546666 30974 slave.cpp:541] Agent attributes: [  ]
I1116 14:27:35.546706 30974 slave.cpp:546] Agent hostname: 5817a5b56afb
I1116 14:27:35.548372 30975 state.cpp:57] Recovering state from '/tmp/Endpoint_SlaveEndpointTest_UnauthorizedRequest_2_MiISrT/meta'
I1116 14:27:35.548727 30974 status_update_manager.cpp:203] Recovering status update manager
I1116 14:27:35.549042 30968 containerizer.cpp:561] Recovering containerizer
I1116 14:27:35.551621 30977 provisioner.cpp:253] Provisioner recovery complete
I1116 14:27:35.552250 30977 slave.cpp:5411] Finished recovery
I1116 14:27:35.552856 30977 slave.cpp:5585] Querying resource estimator for oversubscribable
resources
I1116 14:27:35.553509 30979 slave.cpp:5599] Received oversubscribable resources {} from the
resource estimator
I1116 14:27:35.556260 30971 process.cpp:3570] Handling HTTP event for process 'slave(648)'
with path: '/slave(648)/containers'
I1116 14:27:35.557286 30982 http.cpp:847] Authorizing principal 'test-principal' to GET the
'/containers' endpoint
I1116 14:27:35.559728 30976 slave.cpp:787] Agent terminating
[       OK ] Endpoint/SlaveEndpointTest.UnauthorizedRequest/2 (29 ms)
[ RUN      ] Endpoint/SlaveEndpointTest.NoAuthorizer/0
I1116 14:27:35.571800 30948 containerizer.cpp:202] Using isolation: posix/cpu,posix/mem,filesystem/posix,network/cni
W1116 14:27:35.572603 30948 backend.cpp:76] Failed to create 'aufs' backend: AufsBackend requires
root privileges, but is running as user mesos
W1116 14:27:35.572806 30948 backend.cpp:76] Failed to create 'bind' backend: BindBackend requires
root privileges
I1116 14:27:35.574511 30948 cluster.cpp:435] Creating default 'local' authorizer
I1116 14:27:35.576695 30968 slave.cpp:208] Mesos agent started on (649)@172.17.0.3:56829
I1116 14:27:35.576740 30968 slave.cpp:209] Flags at startup: --acls="" --appc_simple_discovery_uri_prefix="http://"
--appc_store_dir="/tmp/mesos/store/appc" --authenticate_http_readonly="true" --authenticate_http_readwrite="true"
--authenticatee="crammd5" --authentication_backoff_factor="1secs" --authorizer="local" --cgroups_cpu_enable_pids_and_tids_count="false"
--cgroups_enable_cfs="false" --cgroups_hierarchy="/sys/fs/cgroup" --cgroups_limit_swap="false"
--cgroups_root="mesos" --container_disk_watch_interval="15secs" --containerizers="mesos" --credential="/tmp/Endpoint_SlaveEndpointTest_NoAuthorizer_0_4aVTTg/credential"
--default_role="*" --disk_watch_interval="1mins" --docker="docker" --docker_kill_orphans="true"
--docker_registry="https://registry-1.docker.io" --docker_remove_delay="6hrs" --docker_socket="/var/run/docker.sock"
--docker_stop_timeout="0ns" --docker_store_dir="/tmp/mesos/store/docker" --docker_volume_checkpoint_dir="/var/run/mesos/isolators/docker/volume"
--enforce_container_disk_quota="false" --executor_registration_timeout="1mins" --executor_shutdown_grace_period="5secs"
--fetcher_cache_dir="/tmp/Endpoint_SlaveEndpointTest_NoAuthorizer_0_4aVTTg/fetch" --fetcher_cache_size="2GB"
--frameworks_home="" --gc_delay="1weeks" --gc_disk_headroom="0.1" --hadoop_home="" --help="false"
--hostname_lookup="true" --http_authenticators="basic" --http_command_executor="false" --http_credentials="/tmp/Endpoint_SlaveEndpointTest_NoAuthorizer_0_4aVTTg/http_credentials"
--image_provisioner_backend="copy" --initialize_driver_logging="true" --isolation="posix/cpu,posix/mem"
--launcher="posix" --launcher_dir="/mesos/mesos-1.2.0/_build/src" --logbufsecs="0" --logging_level="INFO"
--max_completed_executors_per_framework="150" --oversubscribed_resources_interval="15secs"
--perf_duration="10secs" --perf_interval="1mins" --qos_correction_interval_min="0ns" --quiet="false"
--recover="reconnect" --recovery_timeout="15mins" --registration_backoff_factor="10ms" --resources="cpus:2;gpus:0;mem:1024;disk:1024;ports:[31000-32000]"
--revocable_cpu_low_priority="true" --runtime_dir="/tmp/Endpoint_SlaveEndpointTest_NoAuthorizer_0_4aVTTg"
--sandbox_directory="/mnt/mesos/sandbox" --strict="true" --switch_user="true" --systemd_enable_support="true"
--systemd_runtime_directory="/run/systemd/system" --version="false" --work_dir="/tmp/Endpoint_SlaveEndpointTest_NoAuthorizer_0_2uVGMZ"
I1116 14:27:35.577491 30968 credentials.hpp:86] Loading credential for authentication from
'/tmp/Endpoint_SlaveEndpointTest_NoAuthorizer_0_4aVTTg/credential'
I1116 14:27:35.577703 30968 slave.cpp:346] Agent using credential for: test-principal
I1116 14:27:35.577723 30968 credentials.hpp:37] Loading credentials for authentication from
'/tmp/Endpoint_SlaveEndpointTest_NoAuthorizer_0_4aVTTg/http_credentials'
I1116 14:27:35.577994 30968 http.cpp:895] Using default 'basic' HTTP authenticator for realm
'mesos-agent-readonly'
I1116 14:27:35.578205 30968 http.cpp:895] Using default 'basic' HTTP authenticator for realm
'mesos-agent-readwrite'
I1116 14:27:35.579545 30968 slave.cpp:533] Agent resources: cpus(*):2; mem(*):1024; disk(*):1024;
ports(*):[31000-32000]
I1116 14:27:35.579629 30968 slave.cpp:541] Agent attributes: [  ]
I1116 14:27:35.579643 30968 slave.cpp:546] Agent hostname: 5817a5b56afb
I1116 14:27:35.581477 30974 state.cpp:57] Recovering state from '/tmp/Endpoint_SlaveEndpointTest_NoAuthorizer_0_2uVGMZ/meta'
I1116 14:27:35.581858 30970 status_update_manager.cpp:203] Recovering status update manager
I1116 14:27:35.582171 30982 containerizer.cpp:561] Recovering containerizer
I1116 14:27:35.583780 30972 provisioner.cpp:253] Provisioner recovery complete
I1116 14:27:35.584188 30971 slave.cpp:5411] Finished recovery
I1116 14:27:35.584784 30971 slave.cpp:5585] Querying resource estimator for oversubscribable
resources
I1116 14:27:35.585062 30975 slave.cpp:5599] Received oversubscribable resources {} from the
resource estimator
I1116 14:27:35.586894 30976 process.cpp:3570] Handling HTTP event for process 'slave(649)'
with path: '/slave(649)/monitor/statistics'
I1116 14:27:35.587993 30979 http.cpp:847] Authorizing principal 'test-principal' to GET the
'/monitor/statistics' endpoint
I1116 14:27:35.592371 30980 slave.cpp:787] Agent terminating
[       OK ] Endpoint/SlaveEndpointTest.NoAuthorizer/0 (33 ms)
[ RUN      ] Endpoint/SlaveEndpointTest.NoAuthorizer/1
I1116 14:27:35.603094 30948 containerizer.cpp:202] Using isolation: posix/cpu,posix/mem,filesystem/posix,network/cni
W1116 14:27:35.603977 30948 backend.cpp:76] Failed to create 'aufs' backend: AufsBackend requires
root privileges, but is running as user mesos
W1116 14:27:35.604166 30948 backend.cpp:76] Failed to create 'bind' backend: BindBackend requires
root privileges
I1116 14:27:35.605937 30948 cluster.cpp:435] Creating default 'local' authorizer
I1116 14:27:35.609235 30977 slave.cpp:208] Mesos agent started on (650)@172.17.0.3:56829
I1116 14:27:35.609266 30977 slave.cpp:209] Flags at startup: --acls="" --appc_simple_discovery_uri_prefix="http://"
--appc_store_dir="/tmp/mesos/store/appc" --authenticate_http_readonly="true" --authenticate_http_readwrite="true"
--authenticatee="crammd5" --authentication_backoff_factor="1secs" --authorizer="local" --cgroups_cpu_enable_pids_and_tids_count="false"
--cgroups_enable_cfs="false" --cgroups_hierarchy="/sys/fs/cgroup" --cgroups_limit_swap="false"
--cgroups_root="mesos" --container_disk_watch_interval="15secs" --containerizers="mesos" --credential="/tmp/Endpoint_SlaveEndpointTest_NoAuthorizer_1_u9NLEn/credential"
--default_role="*" --disk_watch_interval="1mins" --docker="docker" --docker_kill_orphans="true"
--docker_registry="https://registry-1.docker.io" --docker_remove_delay="6hrs" --docker_socket="/var/run/docker.sock"
--docker_stop_timeout="0ns" --docker_store_dir="/tmp/mesos/store/docker" --docker_volume_checkpoint_dir="/var/run/mesos/isolators/docker/volume"
--enforce_container_disk_quota="false" --executor_registration_timeout="1mins" --executor_shutdown_grace_period="5secs"
--fetcher_cache_dir="/tmp/Endpoint_SlaveEndpointTest_NoAuthorizer_1_u9NLEn/fetch" --fetcher_cache_size="2GB"
--frameworks_home="" --gc_delay="1weeks" --gc_disk_headroom="0.1" --hadoop_home="" --help="false"
--hostname_lookup="true" --http_authenticators="basic" --http_command_executor="false" --http_credentials="/tmp/Endpoint_SlaveEndpointTest_NoAuthorizer_1_u9NLEn/http_credentials"
--image_provisioner_backend="copy" --initialize_driver_logging="true" --isolation="posix/cpu,posix/mem"
--launcher="posix" --launcher_dir="/mesos/mesos-1.2.0/_build/src" --logbufsecs="0" --logging_level="INFO"
--max_completed_executors_per_framework="150" --oversubscribed_resources_interval="15secs"
--perf_duration="10secs" --perf_interval="1mins" --qos_correction_interval_min="0ns" --quiet="false"
--recover="reconnect" --recovery_timeout="15mins" --registration_backoff_factor="10ms" --resources="cpus:2;gpus:0;mem:1024;disk:1024;ports:[31000-32000]"
--revocable_cpu_low_priority="true" --runtime_dir="/tmp/Endpoint_SlaveEndpointTest_NoAuthorizer_1_u9NLEn"
--sandbox_directory="/mnt/mesos/sandbox" --strict="true" --switch_user="true" --systemd_enable_support="true"
--systemd_runtime_directory="/run/systemd/system" --version="false" --work_dir="/tmp/Endpoint_SlaveEndpointTest_NoAuthorizer_1_kvVjs6"
I1116 14:27:35.609771 30977 credentials.hpp:86] Loading credential for authentication from
'/tmp/Endpoint_SlaveEndpointTest_NoAuthorizer_1_u9NLEn/credential'
I1116 14:27:35.610019 30977 slave.cpp:346] Agent using credential for: test-principal
I1116 14:27:35.610044 30977 credentials.hpp:37] Loading credentials for authentication from
'/tmp/Endpoint_SlaveEndpointTest_NoAuthorizer_1_u9NLEn/http_credentials'
I1116 14:27:35.610291 30977 http.cpp:895] Using default 'basic' HTTP authenticator for realm
'mesos-agent-readonly'
I1116 14:27:35.610460 30977 http.cpp:895] Using default 'basic' HTTP authenticator for realm
'mesos-agent-readwrite'
I1116 14:27:35.611508 30977 slave.cpp:533] Agent resources: cpus(*):2; mem(*):1024; disk(*):1024;
ports(*):[31000-32000]
I1116 14:27:35.611587 30977 slave.cpp:541] Agent attributes: [  ]
I1116 14:27:35.611604 30977 slave.cpp:546] Agent hostname: 5817a5b56afb
I1116 14:27:35.613030 30969 state.cpp:57] Recovering state from '/tmp/Endpoint_SlaveEndpointTest_NoAuthorizer_1_kvVjs6/meta'
I1116 14:27:35.613469 30968 status_update_manager.cpp:203] Recovering status update manager
I1116 14:27:35.613685 30977 containerizer.cpp:561] Recovering containerizer
I1116 14:27:35.615144 30982 provisioner.cpp:253] Provisioner recovery complete
I1116 14:27:35.615643 30969 slave.cpp:5411] Finished recovery
I1116 14:27:35.616415 30969 slave.cpp:5585] Querying resource estimator for oversubscribable
resources
I1116 14:27:35.616745 30974 slave.cpp:5599] Received oversubscribable resources {} from the
resource estimator
I1116 14:27:35.618626 30981 process.cpp:3570] Handling HTTP event for process 'slave(650)'
with path: '/slave(650)/monitor/statistics.json'
I1116 14:27:35.620023 30975 http.cpp:847] Authorizing principal 'test-principal' to GET the
'/monitor/statistics.json' endpoint
I1116 14:27:35.624454 30948 slave.cpp:787] Agent terminating
[       OK ] Endpoint/SlaveEndpointTest.NoAuthorizer/1 (32 ms)
[ RUN      ] Endpoint/SlaveEndpointTest.NoAuthorizer/2
I1116 14:27:35.635406 30948 containerizer.cpp:202] Using isolation: posix/cpu,posix/mem,filesystem/posix,network/cni
W1116 14:27:35.635979 30948 backend.cpp:76] Failed to create 'aufs' backend: AufsBackend requires
root privileges, but is running as user mesos
W1116 14:27:35.636121 30948 backend.cpp:76] Failed to create 'bind' backend: BindBackend requires
root privileges
I1116 14:27:35.637451 30948 cluster.cpp:435] Creating default 'local' authorizer
I1116 14:27:35.639664 30978 slave.cpp:208] Mesos agent started on (651)@172.17.0.3:56829
I1116 14:27:35.639698 30978 slave.cpp:209] Flags at startup: --acls="" --appc_simple_discovery_uri_prefix="http://"
--appc_store_dir="/tmp/mesos/store/appc" --authenticate_http_readonly="true" --authenticate_http_readwrite="true"
--authenticatee="crammd5" --authentication_backoff_factor="1secs" --authorizer="local" --cgroups_cpu_enable_pids_and_tids_count="false"
--cgroups_enable_cfs="false" --cgroups_hierarchy="/sys/fs/cgroup" --cgroups_limit_swap="false"
--cgroups_root="mesos" --container_disk_watch_interval="15secs" --containerizers="mesos" --credential="/tmp/Endpoint_SlaveEndpointTest_NoAuthorizer_2_OuSAKu/credential"
--default_role="*" --disk_watch_interval="1mins" --docker="docker" --docker_kill_orphans="true"
--docker_registry="https://registry-1.docker.io" --docker_remove_delay="6hrs" --docker_socket="/var/run/docker.sock"
--docker_stop_timeout="0ns" --docker_store_dir="/tmp/mesos/store/docker" --docker_volume_checkpoint_dir="/var/run/mesos/isolators/docker/volume"
--enforce_container_disk_quota="false" --executor_registration_timeout="1mins" --executor_shutdown_grace_period="5secs"
--fetcher_cache_dir="/tmp/Endpoint_SlaveEndpointTest_NoAuthorizer_2_OuSAKu/fetch" --fetcher_cache_size="2GB"
--frameworks_home="" --gc_delay="1weeks" --gc_disk_headroom="0.1" --hadoop_home="" --help="false"
--hostname_lookup="true" --http_authenticators="basic" --http_command_executor="false" --http_credentials="/tmp/Endpoint_SlaveEndpointTest_NoAuthorizer_2_OuSAKu/http_credentials"
--image_provisioner_backend="copy" --initialize_driver_logging="true" --isolation="posix/cpu,posix/mem"
--launcher="posix" --launcher_dir="/mesos/mesos-1.2.0/_build/src" --logbufsecs="0" --logging_level="INFO"
--max_completed_executors_per_framework="150" --oversubscribed_resources_interval="15secs"
--perf_duration="10secs" --perf_interval="1mins" --qos_correction_interval_min="0ns" --quiet="false"
--recover="reconnect" --recovery_timeout="15mins" --registration_backoff_factor="10ms" --resources="cpus:2;gpus:0;mem:1024;disk:1024;ports:[31000-32000]"
--revocable_cpu_low_priority="true" --runtime_dir="/tmp/Endpoint_SlaveEndpointTest_NoAuthorizer_2_OuSAKu"
--sandbox_directory="/mnt/mesos/sandbox" --strict="true" --switch_user="true" --systemd_enable_support="true"
--systemd_runtime_directory="/run/systemd/system" --version="false" --work_dir="/tmp/Endpoint_SlaveEndpointTest_NoAuthorizer_2_MS6Rsd"
I1116 14:27:35.640187 30978 credentials.hpp:86] Loading credential for authentication from
'/tmp/Endpoint_SlaveEndpointTest_NoAuthorizer_2_OuSAKu/credential'
I1116 14:27:35.640391 30978 slave.cpp:346] Agent using credential for: test-principal
I1116 14:27:35.640411 30978 credentials.hpp:37] Loading credentials for authentication from
'/tmp/Endpoint_SlaveEndpointTest_NoAuthorizer_2_OuSAKu/http_credentials'
I1116 14:27:35.640635 30978 http.cpp:895] Using default 'basic' HTTP authenticator for realm
'mesos-agent-readonly'
I1116 14:27:35.640766 30978 http.cpp:895] Using default 'basic' HTTP authenticator for realm
'mesos-agent-readwrite'
I1116 14:27:35.641753 30978 slave.cpp:533] Agent resources: cpus(*):2; mem(*):1024; disk(*):1024;
ports(*):[31000-32000]
I1116 14:27:35.641851 30978 slave.cpp:541] Agent attributes: [  ]
I1116 14:27:35.641866 30978 slave.cpp:546] Agent hostname: 5817a5b56afb
I1116 14:27:35.643261 30978 state.cpp:57] Recovering state from '/tmp/Endpoint_SlaveEndpointTest_NoAuthorizer_2_MS6Rsd/meta'
I1116 14:27:35.643973 30978 status_update_manager.cpp:203] Recovering status update manager
I1116 14:27:35.644181 30982 containerizer.cpp:561] Recovering containerizer
I1116 14:27:35.646143 30981 provisioner.cpp:253] Provisioner recovery complete
I1116 14:27:35.646560 30979 slave.cpp:5411] Finished recovery
I1116 14:27:35.647127 30979 slave.cpp:5585] Querying resource estimator for oversubscribable
resources
I1116 14:27:35.647388 30979 slave.cpp:5599] Received oversubscribable resources {} from the
resource estimator
I1116 14:27:35.649623 30976 process.cpp:3570] Handling HTTP event for process 'slave(651)'
with path: '/slave(651)/containers'
I1116 14:27:35.650555 30971 http.cpp:847] Authorizing principal 'test-principal' to GET the
'/containers' endpoint
I1116 14:27:35.653576 30978 slave.cpp:787] Agent terminating
[       OK ] Endpoint/SlaveEndpointTest.NoAuthorizer/2 (27 ms)
[----------] 9 tests from Endpoint/SlaveEndpointTest (295 ms total)

[----------] Global test environment tear-down
[==========] 1378 tests from 156 test cases ran. (479079 ms total)
[  PASSED  ] 1377 tests.
[  FAILED  ] 1 test, listed below:
[  FAILED  ] ReservationEndpointsTest.AvailableResources

 1 FAILED TEST
  YOU HAVE 4 DISABLED TESTS

make[4]: *** [check-local] Error 1
make[4]: Leaving directory `/mesos/mesos-1.2.0/_build/src'
make[3]: *** [check-am] Error 2
make[3]: Leaving directory `/mesos/mesos-1.2.0/_build/src'
make[2]: *** [check] Error 2
make[2]: Leaving directory `/mesos/mesos-1.2.0/_build/src'
make[1]: *** [check-recursive] Error 1
make[1]: Leaving directory `/mesos/mesos-1.2.0/_build'
make: *** [distcheck] Error 1
+ docker rmi mesos-1479303849-9473
Untagged: mesos-1479303849-9473:latest
Deleted: sha256:26931f13baae938f6e74111a9304d9be66e6832db64f9966bf36137068c6c7c2
Deleted: sha256:893787cd52127cff4f87a7e63e0b0b75524d1a81aecfea8d1076f800ad968d1d
Deleted: sha256:006908272bbbf2fdc13f15ec129dd0a15fbd0a5c4fccba1340cb271aedd7d32d
Deleted: sha256:03424756e8b282fc43f246c1b67cdf408e82a3c962c917ebf63fea4df173202f
Deleted: sha256:29e8107efc3d540addb00315f005d6c9148d2d34d39e92c2482bc8f37f1ce960
Deleted: sha256:9624cb7ee83492b27146746a9d029edee3df32946ec18f71726d622328efbdf3
Deleted: sha256:3b15b864a3b032745e1ce910b1827abcfe8b5670a58f9fc5e3b47c5c414d435d
Deleted: sha256:337ae7c743f8a709a85b290e53f64b296db1fc965543f807a9341c3b86bb8579
Deleted: sha256:3914d8f0aa8c2d8ca5110025b1a62c49dbbe18a94c6bfde453d62d118d1cf8a4
Deleted: sha256:193db2fbe5ad4bf9c4031764cbc89890ac56f58ef30c3cb9a0c80f65c0251f1e
Deleted: sha256:b266147c040f6cd34eb893fdb4d77b514a90e4ca0acf6d7e8755705e1e9fdd24
Deleted: sha256:e49aba5416b2ae26d8f8be778e337846435a3c19dd5a1f4b5f0f2765cddefdda
Deleted: sha256:e43beb27634c7ba2c99f0e83e439e938caf0ad127dc28bd6fc9ddec3a26cd707
Deleted: sha256:3eb0e2c51112c0f27a1118458accf61ead967011137b85dd734f7389219f020c
Deleted: sha256:a5660f6e1b4451dcc5ee8fee0dbc08382f6432294e64b166d92a9cc7dd94ec2a
Deleted: sha256:097c43b524858f13fa467761e31b0431d60bcfef60fbe24683b646c183b0ff89
Deleted: sha256:03f6a7efed662424dec28974843c2161175423a0ec11fa9b0daf9238f865524c
Deleted: sha256:05ff7c536af5ec4b2675dba6d3a28fb5cf9cae6945913a000f1e0f97f6e07ba8
Deleted: sha256:d70437fd386434dacf05866d3072274e0ecb3a5c7415a6447ae64fffd039ab48
Deleted: sha256:1a979b841891a63e91c69a4f49e6fd70944def576d539ffff6c31550de291cb9
Deleted: sha256:ee26710c3829956aa824665a84abc7a1da67a48389dd587cce87bb81401f310d
Deleted: sha256:81efaa9c60f3fd6cbf1f82716f8adcb5aab87830a03f3e9fa861b2fd9604e6c8
Deleted: sha256:f3f56344a6bdc60056831d1867ca3f79031079c420c944e8054ed0a0234cde94
Deleted: sha256:ad55023fba73390b558746dc73b2dc0669113d4dcfe9816355ad59b9a66c5e18
Build step 'Execute shell' marked build as failure

Mime
View raw message