mesos-builds mailing list archives

Site index · List index
Message view « Date » · « Thread »
Top « Date » · « Thread »
From Apache Jenkins Server <jenk...@builds.apache.org>
Subject Build failed in Jenkins: mesos-reviewbot #15985
Date Mon, 07 Nov 2016 06:35:46 GMT
See <https://builds.apache.org/job/mesos-reviewbot/15985/>

------------------------------------------
[...truncated 13109 lines...]
Skipping installation of build/bdist.linux-x86_64/wheel/mesos/__init__.py (namespace package)
copying mesos/cli.py -> build/bdist.linux-x86_64/wheel/mesos
copying build/lib.linux-x86_64-2.7/mesos/scheduler/_scheduler.so -> build/bdist.linux-x86_64/egg/mesos/scheduler
copying mesos/futures.py -> build/bdist.linux-x86_64/wheel/mesos
running install_egg_info
Copying src/mesos.cli.egg-info to build/bdist.linux-x86_64/wheel/mesos.cli-1.2.0-py2.7.egg-info
Installing build/bdist.linux-x86_64/wheel/mesos.cli-1.2.0-py2.7-nspkg.pth
running egg_info
writing requirements to src/mesos.executor.egg-info/requires.txt
running install_scripts
writing src/mesos.executor.egg-info/PKG-INFO
writing namespace_packages to src/mesos.executor.egg-info/namespace_packages.txt
writing top-level names to src/mesos.executor.egg-info/top_level.txt
writing dependency_links to src/mesos.executor.egg-info/dependency_links.txt
running install_lib
running build_py
creating build/bdist.linux-x86_64/egg
creating build/bdist.linux-x86_64/egg/mesos
copying build/lib.linux-x86_64-2.7/mesos/__init__.py -> build/bdist.linux-x86_64/egg/mesos
byte-compiling build/bdist.linux-x86_64/egg/mesos/__init__.py to __init__.pyc
creating build/bdist.linux-x86_64/egg/EGG-INFO
copying src/mesos.egg-info/PKG-INFO -> build/bdist.linux-x86_64/egg/EGG-INFO
copying src/mesos.egg-info/SOURCES.txt -> build/bdist.linux-x86_64/egg/EGG-INFO
copying src/mesos.egg-info/dependency_links.txt -> build/bdist.linux-x86_64/egg/EGG-INFO
copying src/mesos.egg-info/requires.txt -> build/bdist.linux-x86_64/egg/EGG-INFO
copying src/mesos.egg-info/top_level.txt -> build/bdist.linux-x86_64/egg/EGG-INFO
zip_safe flag not set; analyzing archive contents...
reading manifest file 'src/mesos.executor.egg-info/SOURCES.txt'
mesos.__init__: module references __path__
creating '/mesos/mesos-1.2.0/_build/src/python/dist/mesos-1.2.0-py2.7.egg' and adding 'build/bdist.linux-x86_64/egg' to it
removing 'build/bdist.linux-x86_64/egg' (and everything under it)
running bdist_wheel
writing manifest file 'src/mesos.executor.egg-info/SOURCES.txt'
installing library code to build/bdist.linux-x86_64/egg
running build
running install_lib
running build_py
creating build/bdist.linux-x86_64/wheel/mesos.cli-1.2.0.dist-info/WHEEL
creating build/bdist.linux-x86_64/egg
creating build/bdist.linux-x86_64/egg/mesos
copying build/lib.linux-x86_64-2.7/mesos/__init__.py -> build/bdist.linux-x86_64/egg/mesos
creating build/bdist.linux-x86_64/egg/mesos/interface
copying build/lib.linux-x86_64-2.7/mesos/interface/mesos_pb2.py -> build/bdist.linux-x86_64/egg/mesos/interface
copying build/lib.linux-x86_64-2.7/mesos/interface/__init__.py -> build/bdist.linux-x86_64/egg/mesos/interface
installing to build/bdist.linux-x86_64/wheel
running install
running install_lib
creating build/bdist.linux-x86_64/wheel
byte-compiling build/bdist.linux-x86_64/egg/mesos/__init__.py to __init__.pyc
creating build/bdist.linux-x86_64/wheel/mesos
copying build/lib.linux-x86_64-2.7/mesos/__init__.py -> build/bdist.linux-x86_64/wheel/mesos
running install_egg_info
Copying src/mesos.egg-info to build/bdist.linux-x86_64/wheel/mesos-1.2.0-py2.7.egg-info
byte-compiling build/bdist.linux-x86_64/egg/mesos/interface/mesos_pb2.py to mesos_pb2.pyc
creating build/bdist.linux-x86_64/wheel/mesos.native-1.2.0.dist-info/WHEEL
running install_scripts
running install_lib
running build_py
running build_ext
creating build/bdist.linux-x86_64/egg
creating build/bdist.linux-x86_64/egg/mesos
copying build/lib.linux-x86_64-2.7/mesos/__init__.py -> build/bdist.linux-x86_64/egg/mesos
creating build/bdist.linux-x86_64/egg/mesos/executor
copying build/lib.linux-x86_64-2.7/mesos/executor/__init__.py -> build/bdist.linux-x86_64/egg/mesos/executor
copying build/lib.linux-x86_64-2.7/mesos/executor/_executor.so -> build/bdist.linux-x86_64/egg/mesos/executor
creating build/bdist.linux-x86_64/wheel/mesos-1.2.0.dist-info/WHEEL
byte-compiling build/bdist.linux-x86_64/egg/mesos/__init__.py to __init__.pyc
byte-compiling build/bdist.linux-x86_64/egg/mesos/executor/__init__.py to __init__.pyc
creating stub loader for mesos/executor/_executor.so
byte-compiling build/bdist.linux-x86_64/egg/mesos/executor/_executor.py to _executor.pyc
byte-compiling build/bdist.linux-x86_64/egg/mesos/interface/__init__.py to __init__.pyc
creating build/bdist.linux-x86_64/egg/EGG-INFO
copying src/mesos.executor.egg-info/PKG-INFO -> build/bdist.linux-x86_64/egg/EGG-INFO
copying src/mesos.executor.egg-info/SOURCES.txt -> build/bdist.linux-x86_64/egg/EGG-INFO
copying src/mesos.executor.egg-info/dependency_links.txt -> build/bdist.linux-x86_64/egg/EGG-INFO
copying src/mesos.executor.egg-info/namespace_packages.txt -> build/bdist.linux-x86_64/egg/EGG-INFO
creating build/bdist.linux-x86_64/egg/EGG-INFO
copying src/mesos.executor.egg-info/requires.txt -> build/bdist.linux-x86_64/egg/EGG-INFO
copying src/mesos.interface.egg-info/PKG-INFO -> build/bdist.linux-x86_64/egg/EGG-INFO
copying src/mesos.interface.egg-info/SOURCES.txt -> build/bdist.linux-x86_64/egg/EGG-INFO
copying src/mesos.executor.egg-info/top_level.txt -> build/bdist.linux-x86_64/egg/EGG-INFO
copying src/mesos.interface.egg-info/dependency_links.txt -> build/bdist.linux-x86_64/egg/EGG-INFO
writing build/bdist.linux-x86_64/egg/EGG-INFO/native_libs.txt
zip_safe flag not set; analyzing archive contents...
copying src/mesos.interface.egg-info/namespace_packages.txt -> build/bdist.linux-x86_64/egg/EGG-INFO
copying src/mesos.interface.egg-info/requires.txt -> build/bdist.linux-x86_64/egg/EGG-INFO
mesos.__init__: module references __path__
copying src/mesos.interface.egg-info/top_level.txt -> build/bdist.linux-x86_64/egg/EGG-INFO
zip_safe flag not set; analyzing archive contents...
creating '/mesos/mesos-1.2.0/_build/src/python/dist/mesos.executor-1.2.0-py2.7-linux-x86_64.egg' and adding 'build/bdist.linux-x86_64/egg' to it
mesos.__init__: module references __path__
creating '/mesos/mesos-1.2.0/_build/src/python/dist/mesos.interface-1.2.0-py2.7.egg' and adding 'build/bdist.linux-x86_64/egg' to it
removing 'build/bdist.linux-x86_64/egg' (and everything under it)
running bdist_wheel
running build
installing to build/bdist.linux-x86_64/wheel
running install
running install_lib
Skipping installation of build/bdist.linux-x86_64/wheel/mesos/__init__.py (namespace package)
copying mesos/interface/mesos_pb2.py -> build/bdist.linux-x86_64/wheel/mesos/interface
copying mesos/interface/__init__.py -> build/bdist.linux-x86_64/wheel/mesos/interface
running install_egg_info
Copying src/mesos.interface.egg-info to build/bdist.linux-x86_64/wheel/mesos.interface-1.2.0-py2.7.egg-info
Installing build/bdist.linux-x86_64/wheel/mesos.interface-1.2.0-py2.7-nspkg.pth
running install_scripts
creating build/bdist.linux-x86_64/wheel/mesos.interface-1.2.0.dist-info/WHEEL
copying build/lib.linux-x86_64-2.7/mesos/scheduler/__init__.py -> build/bdist.linux-x86_64/egg/mesos/scheduler
byte-compiling build/bdist.linux-x86_64/egg/mesos/__init__.py to __init__.pyc
byte-compiling build/bdist.linux-x86_64/egg/mesos/scheduler/__init__.py to __init__.pyc
creating stub loader for mesos/scheduler/_scheduler.so
byte-compiling build/bdist.linux-x86_64/egg/mesos/scheduler/_scheduler.py to _scheduler.pyc
creating build/bdist.linux-x86_64/egg/EGG-INFO
copying src/mesos.scheduler.egg-info/PKG-INFO -> build/bdist.linux-x86_64/egg/EGG-INFO
copying src/mesos.scheduler.egg-info/SOURCES.txt -> build/bdist.linux-x86_64/egg/EGG-INFO
copying src/mesos.scheduler.egg-info/dependency_links.txt -> build/bdist.linux-x86_64/egg/EGG-INFO
copying src/mesos.scheduler.egg-info/namespace_packages.txt -> build/bdist.linux-x86_64/egg/EGG-INFO
copying src/mesos.scheduler.egg-info/requires.txt -> build/bdist.linux-x86_64/egg/EGG-INFO
copying src/mesos.scheduler.egg-info/top_level.txt -> build/bdist.linux-x86_64/egg/EGG-INFO
writing build/bdist.linux-x86_64/egg/EGG-INFO/native_libs.txt
zip_safe flag not set; analyzing archive contents...
mesos.__init__: module references __path__
creating '/mesos/mesos-1.2.0/_build/src/python/dist/mesos.scheduler-1.2.0-py2.7-linux-x86_64.egg' and adding 'build/bdist.linux-x86_64/egg' to it
removing 'build/bdist.linux-x86_64/egg' (and everything under it)
running bdist_wheel
running build
installing to build/bdist.linux-x86_64/wheel
running install
running install_lib
Skipping installation of build/bdist.linux-x86_64/wheel/mesos/__init__.py (namespace package)
copying mesos/executor/__init__.py -> build/bdist.linux-x86_64/wheel/mesos/executor
copying mesos/executor/_executor.so -> build/bdist.linux-x86_64/wheel/mesos/executor
running install_egg_info
Copying src/mesos.executor.egg-info to build/bdist.linux-x86_64/wheel/mesos.executor-1.2.0-py2.7.egg-info
Installing build/bdist.linux-x86_64/wheel/mesos.executor-1.2.0-py2.7-nspkg.pth
running install_scripts
creating build/bdist.linux-x86_64/wheel/mesos.executor-1.2.0.dist-info/WHEEL
removing 'build/bdist.linux-x86_64/egg' (and everything under it)
running bdist_wheel
running build
installing to build/bdist.linux-x86_64/wheel
running install
running install_lib
Skipping installation of build/bdist.linux-x86_64/wheel/mesos/__init__.py (namespace package)
copying mesos/scheduler/_scheduler.so -> build/bdist.linux-x86_64/wheel/mesos/scheduler
copying mesos/scheduler/__init__.py -> build/bdist.linux-x86_64/wheel/mesos/scheduler
running install_egg_info
Copying src/mesos.scheduler.egg-info to build/bdist.linux-x86_64/wheel/mesos.scheduler-1.2.0-py2.7.egg-info
Installing build/bdist.linux-x86_64/wheel/mesos.scheduler-1.2.0-py2.7-nspkg.pth
running install_scripts
creating build/bdist.linux-x86_64/wheel/mesos.scheduler-1.2.0.dist-info/WHEEL
make  dynamic-reservation-framework test-http-framework test-framework test-executor test-http-executor long-lived-framework long-lived-executor no-executor-framework docker-no-executor-framework balloon-framework balloon-executor load-generator-framework persistent-volume-framework disk-full-framework test-helper mesos-tests examples/java/test-executor examples/java/test-exception-framework examples/java/test-framework examples/java/test-log examples/java/test-multiple-executors-framework examples/java/v1-test-framework examples/python/test_executor.py examples/python/test-executor examples/python/test_framework.py examples/python/test-framework \
	  tests/balloon_framework_test.sh tests/disk_full_framework_test.sh tests/dynamic_reservation_framework_test.sh tests/java_exception_test.sh tests/java_framework_test.sh tests/java_log_test.sh tests/java_v0_framework_test.sh tests/java_v1_framework_test.sh tests/no_executor_framework_test.sh tests/persistent_volume_framework_test.sh tests/python_framework_test.sh tests/test_http_framework_test.sh tests/test_framework_test.sh
make[4]: Entering directory `/mesos/mesos-1.2.0/_build/src'
g++ -DPACKAGE_NAME=\"mesos\" -DPACKAGE_TARNAME=\"mesos\" -DPACKAGE_VERSION=\"1.2.0\" -DPACKAGE_STRING=\"mesos\ 1.2.0\" -DPACKAGE_BUGREPORT=\"\" -DPACKAGE_URL=\"\" -DPACKAGE=\"mesos\" -DVERSION=\"1.2.0\" -DSTDC_HEADERS=1 -DHAVE_SYS_TYPES_H=1 -DHAVE_SYS_STAT_H=1 -DHAVE_STDLIB_H=1 -DHAVE_STRING_H=1 -DHAVE_MEMORY_H=1 -DHAVE_STRINGS_H=1 -DHAVE_INTTYPES_H=1 -DHAVE_STDINT_H=1 -DHAVE_UNISTD_H=1 -DHAVE_DLFCN_H=1 -DLT_OBJDIR=\".libs/\" -DHAVE_CXX11=1 -DHAVE_PTHREAD_PRIO_INHERIT=1 -DHAVE_PTHREAD=1 -DHAVE_LIBZ=1 -DHAVE_FTS_H=1 -DHAVE_APR_POOLS_H=1 -DHAVE_LIBAPR_1=1 -DHAVE_LIBCURL=1 -DMESOS_HAS_JAVA=1 -DHAVE_LIBSASL2=1 -DHAVE_SVN_VERSION_H=1 -DHAVE_LIBSVN_SUBR_1=1 -DHAVE_SVN_DELTA_H=1 -DHAVE_LIBSVN_DELTA_1=1 -DHAVE_LIBZ=1 -DHAVE_PYTHON=\"2.7\" -DMESOS_HAS_PYTHON=1 -I. -I../../src   -Wall -Werror -Wsign-compare -DLIBDIR=\"/mesos/mesos-1.2.0/_inst/lib\" -DPKGLIBEXECDIR=\"/mesos/mesos-1.2.0/_inst/libexec/mesos\" -DPKGDATADIR=\"/mesos/mesos-1.2.0/_inst/share/mesos\" -DPKGMODULEDIR=\"/mesos/mesos-1.2.0/_inst/lib/mesos/modules\" -I../../include -I../include -I../include/mesos -DPICOJSON_USE_INT64 -D__STDC_FORMAT_MACROS -isystem ../3rdparty/boost-1.53.0 -I../3rdparty/elfio-3.2 -I../3rdparty/glog-0.3.3/src -I../3rdparty/leveldb-1.4/include -I../../3rdparty/libprocess/include -I../3rdparty/nvml-352.79 -I../3rdparty/picojson-1.3.0 -I../3rdparty/protobuf-2.6.1/src -I../../3rdparty/stout/include -I../3rdparty/zookeeper-3.4.8/src/c/include -I../3rdparty/zookeeper-3.4.8/src/c/generated -DHAS_AUTHENTICATION=1 -I/usr/include/subversion-1 -I/usr/include/apr-1 -I/usr/include/apr-1.0  -pthread -g1 -O0 -Wno-unused-local-typedefs -std=c++11 -MT examples/dynamic_reservation_framework-dynamic_reservation_framework.o -MD -MP -MF examples/.deps/dynamic_reservation_framework-dynamic_reservation_framework.Tpo -c -o examples/dynamic_reservation_framework-dynamic_reservation_framework.o `test -f 'examples/dynamic_reservation_framework.cpp' || echo '../../src/'`examples/dynamic_reservation_framework.cpp
g++ -DPACKAGE_NAME=\"mesos\" -DPACKAGE_TARNAME=\"mesos\" -DPACKAGE_VERSION=\"1.2.0\" -DPACKAGE_STRING=\"mesos\ 1.2.0\" -DPACKAGE_BUGREPORT=\"\" -DPACKAGE_URL=\"\" -DPACKAGE=\"mesos\" -DVERSION=\"1.2.0\" -DSTDC_HEADERS=1 -DHAVE_SYS_TYPES_H=1 -DHAVE_SYS_STAT_H=1 -DHAVE_STDLIB_H=1 -DHAVE_STRING_H=1 -DHAVE_MEMORY_H=1 -DHAVE_STRINGS_H=1 -DHAVE_INTTYPES_H=1 -DHAVE_STDINT_H=1 -DHAVE_UNISTD_H=1 -DHAVE_DLFCN_H=1 -DLT_OBJDIR=\".libs/\" -DHAVE_CXX11=1 -DHAVE_PTHREAD_PRIO_INHERIT=1 -DHAVE_PTHREAD=1 -DHAVE_LIBZ=1 -DHAVE_FTS_H=1 -DHAVE_APR_POOLS_H=1 -DHAVE_LIBAPR_1=1 -DHAVE_LIBCURL=1 -DMESOS_HAS_JAVA=1 -DHAVE_LIBSASL2=1 -DHAVE_SVN_VERSION_H=1 -DHAVE_LIBSVN_SUBR_1=1 -DHAVE_SVN_DELTA_H=1 -DHAVE_LIBSVN_DELTA_1=1 -DHAVE_LIBZ=1 -DHAVE_PYTHON=\"2.7\" -DMESOS_HAS_PYTHON=1 -I. -I../../src   -Wall -Werror -Wsign-compare -DLIBDIR=\"/mesos/mesos-1.2.0/_inst/lib\" -DPKGLIBEXECDIR=\"/mesos/mesos-1.2.0/_inst/libexec/mesos\" -DPKGDATADIR=\"/mesos/mesos-1.2.0/_inst/share/mesos\" -DPKGMODULEDIR=\"/mesos/mesos-1.2.0/_inst/lib/mesos/modules\" -I../../include -I../include -I../include/mesos -DPICOJSON_USE_INT64 -D__STDC_FORMAT_MACROS -isystem ../3rdparty/boost-1.53.0 -I../3rdparty/elfio-3.2 -I../3rdparty/glog-0.3.3/src -I../3rdparty/leveldb-1.4/include -I../../3rdparty/libprocess/include -I../3rdparty/nvml-352.79 -I../3rdparty/picojson-1.3.0 -I../3rdparty/protobuf-2.6.1/src -I../../3rdparty/stout/include -I../3rdparty/zookeeper-3.4.8/src/c/include -I../3rdparty/zookeeper-3.4.8/src/c/generated -DHAS_AUTHENTICATION=1 -I/usr/include/subversion-1 -I/usr/include/apr-1 -I/usr/include/apr-1.0  -pthread -g1 -O0 -Wno-unused-local-typedefs -std=c++11 -MT examples/test_http_framework-test_http_framework.o -MD -MP -MF examples/.deps/test_http_framework-test_http_framework.Tpo -c -o examples/test_http_framework-test_http_framework.o `test -f 'examples/test_http_framework.cpp' || echo '../../src/'`examples/test_http_framework.cpp
g++ -DPACKAGE_NAME=\"mesos\" -DPACKAGE_TARNAME=\"mesos\" -DPACKAGE_VERSION=\"1.2.0\" -DPACKAGE_STRING=\"mesos\ 1.2.0\" -DPACKAGE_BUGREPORT=\"\" -DPACKAGE_URL=\"\" -DPACKAGE=\"mesos\" -DVERSION=\"1.2.0\" -DSTDC_HEADERS=1 -DHAVE_SYS_TYPES_H=1 -DHAVE_SYS_STAT_H=1 -DHAVE_STDLIB_H=1 -DHAVE_STRING_H=1 -DHAVE_MEMORY_H=1 -DHAVE_STRINGS_H=1 -DHAVE_INTTYPES_H=1 -DHAVE_STDINT_H=1 -DHAVE_UNISTD_H=1 -DHAVE_DLFCN_H=1 -DLT_OBJDIR=\".libs/\" -DHAVE_CXX11=1 -DHAVE_PTHREAD_PRIO_INHERIT=1 -DHAVE_PTHREAD=1 -DHAVE_LIBZ=1 -DHAVE_FTS_H=1 -DHAVE_APR_POOLS_H=1 -DHAVE_LIBAPR_1=1 -DHAVE_LIBCURL=1 -DMESOS_HAS_JAVA=1 -DHAVE_LIBSASL2=1 -DHAVE_SVN_VERSION_H=1 -DHAVE_LIBSVN_SUBR_1=1 -DHAVE_SVN_DELTA_H=1 -DHAVE_LIBSVN_DELTA_1=1 -DHAVE_LIBZ=1 -DHAVE_PYTHON=\"2.7\" -DMESOS_HAS_PYTHON=1 -I. -I../../src   -Wall -Werror -Wsign-compare -DLIBDIR=\"/mesos/mesos-1.2.0/_inst/lib\" -DPKGLIBEXECDIR=\"/mesos/mesos-1.2.0/_inst/libexec/mesos\" -DPKGDATADIR=\"/mesos/mesos-1.2.0/_inst/share/mesos\" -DPKGMODULEDIR=\"/mesos/mesos-1.2.0/_inst/lib/mesos/modules\" -I../../include -I../include -I../include/mesos -DPICOJSON_USE_INT64 -D__STDC_FORMAT_MACROS -isystem ../3rdparty/boost-1.53.0 -I../3rdparty/elfio-3.2 -I../3rdparty/glog-0.3.3/src -I../3rdparty/leveldb-1.4/include -I../../3rdparty/libprocess/include -I../3rdparty/nvml-352.79 -I../3rdparty/picojson-1.3.0 -I../3rdparty/protobuf-2.6.1/src -I../../3rdparty/stout/include -I../3rdparty/zookeeper-3.4.8/src/c/include -I../3rdparty/zookeeper-3.4.8/src/c/generated -DHAS_AUTHENTICATION=1 -I/usr/include/subversion-1 -I/usr/include/apr-1 -I/usr/include/apr-1.0  -pthread -g1 -O0 -Wno-unused-local-typedefs -std=c++11 -MT examples/test_framework-test_framework.o -MD -MP -MF examples/.deps/test_framework-test_framework.Tpo -c -o examples/test_framework-test_framework.o `test -f 'examples/test_framework.cpp' || echo '../../src/'`examples/test_framework.cpp
g++ -DPACKAGE_NAME=\"mesos\" -DPACKAGE_TARNAME=\"mesos\" -DPACKAGE_VERSION=\"1.2.0\" -DPACKAGE_STRING=\"mesos\ 1.2.0\" -DPACKAGE_BUGREPORT=\"\" -DPACKAGE_URL=\"\" -DPACKAGE=\"mesos\" -DVERSION=\"1.2.0\" -DSTDC_HEADERS=1 -DHAVE_SYS_TYPES_H=1 -DHAVE_SYS_STAT_H=1 -DHAVE_STDLIB_H=1 -DHAVE_STRING_H=1 -DHAVE_MEMORY_H=1 -DHAVE_STRINGS_H=1 -DHAVE_INTTYPES_H=1 -DHAVE_STDINT_H=1 -DHAVE_UNISTD_H=1 -DHAVE_DLFCN_H=1 -DLT_OBJDIR=\".libs/\" -DHAVE_CXX11=1 -DHAVE_PTHREAD_PRIO_INHERIT=1 -DHAVE_PTHREAD=1 -DHAVE_LIBZ=1 -DHAVE_FTS_H=1 -DHAVE_APR_POOLS_H=1 -DHAVE_LIBAPR_1=1 -DHAVE_LIBCURL=1 -DMESOS_HAS_JAVA=1 -DHAVE_LIBSASL2=1 -DHAVE_SVN_VERSION_H=1 -DHAVE_LIBSVN_SUBR_1=1 -DHAVE_SVN_DELTA_H=1 -DHAVE_LIBSVN_DELTA_1=1 -DHAVE_LIBZ=1 -DHAVE_PYTHON=\"2.7\" -DMESOS_HAS_PYTHON=1 -I. -I../../src   -Wall -Werror -Wsign-compare -DLIBDIR=\"/mesos/mesos-1.2.0/_inst/lib\" -DPKGLIBEXECDIR=\"/mesos/mesos-1.2.0/_inst/libexec/mesos\" -DPKGDATADIR=\"/mesos/mesos-1.2.0/_inst/share/mesos\" -DPKGMODULEDIR=\"/mesos/mesos-1.2.0/_inst/lib/mesos/modules\" -I../../include -I../include -I../include/mesos -DPICOJSON_USE_INT64 -D__STDC_FORMAT_MACROS -isystem ../3rdparty/boost-1.53.0 -I../3rdparty/elfio-3.2 -I../3rdparty/glog-0.3.3/src -I../3rdparty/leveldb-1.4/include -I../../3rdparty/libprocess/include -I../3rdparty/nvml-352.79 -I../3rdparty/picojson-1.3.0 -I../3rdparty/protobuf-2.6.1/src -I../../3rdparty/stout/include -I../3rdparty/zookeeper-3.4.8/src/c/include -I../3rdparty/zookeeper-3.4.8/src/c/generated -DHAS_AUTHENTICATION=1 -I/usr/include/subversion-1 -I/usr/include/apr-1 -I/usr/include/apr-1.0  -pthread -g1 -O0 -Wno-unused-local-typedefs -std=c++11 -MT examples/test_executor-test_executor.o -MD -MP -MF examples/.deps/test_executor-test_executor.Tpo -c -o examples/test_executor-test_executor.o `test -f 'examples/test_executor.cpp' || echo '../../src/'`examples/test_executor.cpp
g++ -DPACKAGE_NAME=\"mesos\" -DPACKAGE_TARNAME=\"mesos\" -DPACKAGE_VERSION=\"1.2.0\" -DPACKAGE_STRING=\"mesos\ 1.2.0\" -DPACKAGE_BUGREPORT=\"\" -DPACKAGE_URL=\"\" -DPACKAGE=\"mesos\" -DVERSION=\"1.2.0\" -DSTDC_HEADERS=1 -DHAVE_SYS_TYPES_H=1 -DHAVE_SYS_STAT_H=1 -DHAVE_STDLIB_H=1 -DHAVE_STRING_H=1 -DHAVE_MEMORY_H=1 -DHAVE_STRINGS_H=1 -DHAVE_INTTYPES_H=1 -DHAVE_STDINT_H=1 -DHAVE_UNISTD_H=1 -DHAVE_DLFCN_H=1 -DLT_OBJDIR=\".libs/\" -DHAVE_CXX11=1 -DHAVE_PTHREAD_PRIO_INHERIT=1 -DHAVE_PTHREAD=1 -DHAVE_LIBZ=1 -DHAVE_FTS_H=1 -DHAVE_APR_POOLS_H=1 -DHAVE_LIBAPR_1=1 -DHAVE_LIBCURL=1 -DMESOS_HAS_JAVA=1 -DHAVE_LIBSASL2=1 -DHAVE_SVN_VERSION_H=1 -DHAVE_LIBSVN_SUBR_1=1 -DHAVE_SVN_DELTA_H=1 -DHAVE_LIBSVN_DELTA_1=1 -DHAVE_LIBZ=1 -DHAVE_PYTHON=\"2.7\" -DMESOS_HAS_PYTHON=1 -I. -I../../src   -Wall -Werror -Wsign-compare -DLIBDIR=\"/mesos/mesos-1.2.0/_inst/lib\" -DPKGLIBEXECDIR=\"/mesos/mesos-1.2.0/_inst/libexec/mesos\" -DPKGDATADIR=\"/mesos/mesos-1.2.0/_inst/share/mesos\" -DPKGMODULEDIR=\"/mesos/mesos-1.2.0/_inst/lib/mesos/modules\" -I../../include -I../include -I../include/mesos -DPICOJSON_USE_INT64 -D__STDC_FORMAT_MACROS -isystem ../3rdparty/boost-1.53.0 -I../3rdparty/elfio-3.2 -I../3rdparty/glog-0.3.3/src -I../3rdparty/leveldb-1.4/include -I../../3rdparty/libprocess/include -I../3rdparty/nvml-352.79 -I../3rdparty/picojson-1.3.0 -I../3rdparty/protobuf-2.6.1/src -I../../3rdparty/stout/include -I../3rdparty/zookeeper-3.4.8/src/c/include -I../3rdparty/zookeeper-3.4.8/src/c/generated -DHAS_AUTHENTICATION=1 -I/usr/include/subversion-1 -I/usr/include/apr-1 -I/usr/include/apr-1.0  -pthread -g1 -O0 -Wno-unused-local-typedefs -std=c++11 -MT examples/test_http_executor-test_http_executor.o -MD -MP -MF examples/.deps/test_http_executor-test_http_executor.Tpo -c -o examples/test_http_executor-test_http_executor.o `test -f 'examples/test_http_executor.cpp' || echo '../../src/'`examples/test_http_executor.cpp
g++ -DPACKAGE_NAME=\"mesos\" -DPACKAGE_TARNAME=\"mesos\" -DPACKAGE_VERSION=\"1.2.0\" -DPACKAGE_STRING=\"mesos\ 1.2.0\" -DPACKAGE_BUGREPORT=\"\" -DPACKAGE_URL=\"\" -DPACKAGE=\"mesos\" -DVERSION=\"1.2.0\" -DSTDC_HEADERS=1 -DHAVE_SYS_TYPES_H=1 -DHAVE_SYS_STAT_H=1 -DHAVE_STDLIB_H=1 -DHAVE_STRING_H=1 -DHAVE_MEMORY_H=1 -DHAVE_STRINGS_H=1 -DHAVE_INTTYPES_H=1 -DHAVE_STDINT_H=1 -DHAVE_UNISTD_H=1 -DHAVE_DLFCN_H=1 -DLT_OBJDIR=\".libs/\" -DHAVE_CXX11=1 -DHAVE_PTHREAD_PRIO_INHERIT=1 -DHAVE_PTHREAD=1 -DHAVE_LIBZ=1 -DHAVE_FTS_H=1 -DHAVE_APR_POOLS_H=1 -DHAVE_LIBAPR_1=1 -DHAVE_LIBCURL=1 -DMESOS_HAS_JAVA=1 -DHAVE_LIBSASL2=1 -DHAVE_SVN_VERSION_H=1 -DHAVE_LIBSVN_SUBR_1=1 -DHAVE_SVN_DELTA_H=1 -DHAVE_LIBSVN_DELTA_1=1 -DHAVE_LIBZ=1 -DHAVE_PYTHON=\"2.7\" -DMESOS_HAS_PYTHON=1 -I. -I../../src   -Wall -Werror -Wsign-compare -DLIBDIR=\"/mesos/mesos-1.2.0/_inst/lib\" -DPKGLIBEXECDIR=\"/mesos/mesos-1.2.0/_inst/libexec/mesos\" -DPKGDATADIR=\"/mesos/mesos-1.2.0/_inst/share/mesos\" -DPKGMODULEDIR=\"/mesos/mesos-1.2.0/_inst/lib/mesos/modules\" -I../../include -I../include -I../include/mesos -DPICOJSON_USE_INT64 -D__STDC_FORMAT_MACROS -isystem ../3rdparty/boost-1.53.0 -I../3rdparty/elfio-3.2 -I../3rdparty/glog-0.3.3/src -I../3rdparty/leveldb-1.4/include -I../../3rdparty/libprocess/include -I../3rdparty/nvml-352.79 -I../3rdparty/picojson-1.3.0 -I../3rdparty/protobuf-2.6.1/src -I../../3rdparty/stout/include -I../3rdparty/zookeeper-3.4.8/src/c/include -I../3rdparty/zookeeper-3.4.8/src/c/generated -DHAS_AUTHENTICATION=1 -I/usr/include/subversion-1 -I/usr/include/apr-1 -I/usr/include/apr-1.0  -pthread -g1 -O0 -Wno-unused-local-typedefs -std=c++11 -MT examples/long_lived_framework-long_lived_framework.o -MD -MP -MF examples/.deps/long_lived_framework-long_lived_framework.Tpo -c -o examples/long_lived_framework-long_lived_framework.o `test -f 'examples/long_lived_framework.cpp' || echo '../../src/'`examples/long_lived_framework.cpp
mv -f examples/.deps/test_executor-test_executor.Tpo examples/.deps/test_executor-test_executor.Po
g++ -DPACKAGE_NAME=\"mesos\" -DPACKAGE_TARNAME=\"mesos\" -DPACKAGE_VERSION=\"1.2.0\" -DPACKAGE_STRING=\"mesos\ 1.2.0\" -DPACKAGE_BUGREPORT=\"\" -DPACKAGE_URL=\"\" -DPACKAGE=\"mesos\" -DVERSION=\"1.2.0\" -DSTDC_HEADERS=1 -DHAVE_SYS_TYPES_H=1 -DHAVE_SYS_STAT_H=1 -DHAVE_STDLIB_H=1 -DHAVE_STRING_H=1 -DHAVE_MEMORY_H=1 -DHAVE_STRINGS_H=1 -DHAVE_INTTYPES_H=1 -DHAVE_STDINT_H=1 -DHAVE_UNISTD_H=1 -DHAVE_DLFCN_H=1 -DLT_OBJDIR=\".libs/\" -DHAVE_CXX11=1 -DHAVE_PTHREAD_PRIO_INHERIT=1 -DHAVE_PTHREAD=1 -DHAVE_LIBZ=1 -DHAVE_FTS_H=1 -DHAVE_APR_POOLS_H=1 -DHAVE_LIBAPR_1=1 -DHAVE_LIBCURL=1 -DMESOS_HAS_JAVA=1 -DHAVE_LIBSASL2=1 -DHAVE_SVN_VERSION_H=1 -DHAVE_LIBSVN_SUBR_1=1 -DHAVE_SVN_DELTA_H=1 -DHAVE_LIBSVN_DELTA_1=1 -DHAVE_LIBZ=1 -DHAVE_PYTHON=\"2.7\" -DMESOS_HAS_PYTHON=1 -I. -I../../src   -Wall -Werror -Wsign-compare -DLIBDIR=\"/mesos/mesos-1.2.0/_inst/lib\" -DPKGLIBEXECDIR=\"/mesos/mesos-1.2.0/_inst/libexec/mesos\" -DPKGDATADIR=\"/mesos/mesos-1.2.0/_inst/share/mesos\" -DPKGMODULEDIR=\"/mesos/mesos-1.2.0/_inst/lib/mesos/modules\" -I../../include -I../include -I../include/mesos -DPICOJSON_USE_INT64 -D__STDC_FORMAT_MACROS -isystem ../3rdparty/boost-1.53.0 -I../3rdparty/elfio-3.2 -I../3rdparty/glog-0.3.3/src -I../3rdparty/leveldb-1.4/include -I../../3rdparty/libprocess/include -I../3rdparty/nvml-352.79 -I../3rdparty/picojson-1.3.0 -I../3rdparty/protobuf-2.6.1/src -I../../3rdparty/stout/include -I../3rdparty/zookeeper-3.4.8/src/c/include -I../3rdparty/zookeeper-3.4.8/src/c/generated -DHAS_AUTHENTICATION=1 -I/usr/include/subversion-1 -I/usr/include/apr-1 -I/usr/include/apr-1.0  -pthread -g1 -O0 -Wno-unused-local-typedefs -std=c++11 -MT examples/long_lived_executor-long_lived_executor.o -MD -MP -MF examples/.deps/long_lived_executor-long_lived_executor.Tpo -c -o examples/long_lived_executor-long_lived_executor.o `test -f 'examples/long_lived_executor.cpp' || echo '../../src/'`examples/long_lived_executor.cpp
mv -f examples/.deps/test_framework-test_framework.Tpo examples/.deps/test_framework-test_framework.Po
g++ -DPACKAGE_NAME=\"mesos\" -DPACKAGE_TARNAME=\"mesos\" -DPACKAGE_VERSION=\"1.2.0\" -DPACKAGE_STRING=\"mesos\ 1.2.0\" -DPACKAGE_BUGREPORT=\"\" -DPACKAGE_URL=\"\" -DPACKAGE=\"mesos\" -DVERSION=\"1.2.0\" -DSTDC_HEADERS=1 -DHAVE_SYS_TYPES_H=1 -DHAVE_SYS_STAT_H=1 -DHAVE_STDLIB_H=1 -DHAVE_STRING_H=1 -DHAVE_MEMORY_H=1 -DHAVE_STRINGS_H=1 -DHAVE_INTTYPES_H=1 -DHAVE_STDINT_H=1 -DHAVE_UNISTD_H=1 -DHAVE_DLFCN_H=1 -DLT_OBJDIR=\".libs/\" -DHAVE_CXX11=1 -DHAVE_PTHREAD_PRIO_INHERIT=1 -DHAVE_PTHREAD=1 -DHAVE_LIBZ=1 -DHAVE_FTS_H=1 -DHAVE_APR_POOLS_H=1 -DHAVE_LIBAPR_1=1 -DHAVE_LIBCURL=1 -DMESOS_HAS_JAVA=1 -DHAVE_LIBSASL2=1 -DHAVE_SVN_VERSION_H=1 -DHAVE_LIBSVN_SUBR_1=1 -DHAVE_SVN_DELTA_H=1 -DHAVE_LIBSVN_DELTA_1=1 -DHAVE_LIBZ=1 -DHAVE_PYTHON=\"2.7\" -DMESOS_HAS_PYTHON=1 -I. -I../../src   -Wall -Werror -Wsign-compare -DLIBDIR=\"/mesos/mesos-1.2.0/_inst/lib\" -DPKGLIBEXECDIR=\"/mesos/mesos-1.2.0/_inst/libexec/mesos\" -DPKGDATADIR=\"/mesos/mesos-1.2.0/_inst/share/mesos\" -DPKGMODULEDIR=\"/mesos/mesos-1.2.0/_inst/lib/mesos/modules\" -I../../include -I../include -I../include/mesos -DPICOJSON_USE_INT64 -D__STDC_FORMAT_MACROS -isystem ../3rdparty/boost-1.53.0 -I../3rdparty/elfio-3.2 -I../3rdparty/glog-0.3.3/src -I../3rdparty/leveldb-1.4/include -I../../3rdparty/libprocess/include -I../3rdparty/nvml-352.79 -I../3rdparty/picojson-1.3.0 -I../3rdparty/protobuf-2.6.1/src -I../../3rdparty/stout/include -I../3rdparty/zookeeper-3.4.8/src/c/include -I../3rdparty/zookeeper-3.4.8/src/c/generated -DHAS_AUTHENTICATION=1 -I/usr/include/subversion-1 -I/usr/include/apr-1 -I/usr/include/apr-1.0  -pthread -g1 -O0 -Wno-unused-local-typedefs -std=c++11 -MT examples/no_executor_framework-no_executor_framework.o -MD -MP -MF examples/.deps/no_executor_framework-no_executor_framework.Tpo -c -o examples/no_executor_framework-no_executor_framework.o `test -f 'examples/no_executor_framework.cpp' || echo '../../src/'`examples/no_executor_framework.cpp
mv -f examples/.deps/test_http_executor-test_http_executor.Tpo examples/.deps/test_http_executor-test_http_executor.Po
mv -f examples/.deps/dynamic_reservation_framework-dynamic_reservation_framework.Tpo examples/.deps/dynamic_reservation_framework-dynamic_reservation_framework.Po
g++ -DPACKAGE_NAME=\"mesos\" -DPACKAGE_TARNAME=\"mesos\" -DPACKAGE_VERSION=\"1.2.0\" -DPACKAGE_STRING=\"mesos\ 1.2.0\" -DPACKAGE_BUGREPORT=\"\" -DPACKAGE_URL=\"\" -DPACKAGE=\"mesos\" -DVERSION=\"1.2.0\" -DSTDC_HEADERS=1 -DHAVE_SYS_TYPES_H=1 -DHAVE_SYS_STAT_H=1 -DHAVE_STDLIB_H=1 -DHAVE_STRING_H=1 -DHAVE_MEMORY_H=1 -DHAVE_STRINGS_H=1 -DHAVE_INTTYPES_H=1 -DHAVE_STDINT_H=1 -DHAVE_UNISTD_H=1 -DHAVE_DLFCN_H=1 -DLT_OBJDIR=\".libs/\" -DHAVE_CXX11=1 -DHAVE_PTHREAD_PRIO_INHERIT=1 -DHAVE_PTHREAD=1 -DHAVE_LIBZ=1 -DHAVE_FTS_H=1 -DHAVE_APR_POOLS_H=1 -DHAVE_LIBAPR_1=1 -DHAVE_LIBCURL=1 -DMESOS_HAS_JAVA=1 -DHAVE_LIBSASL2=1 -DHAVE_SVN_VERSION_H=1 -DHAVE_LIBSVN_SUBR_1=1 -DHAVE_SVN_DELTA_H=1 -DHAVE_LIBSVN_DELTA_1=1 -DHAVE_LIBZ=1 -DHAVE_PYTHON=\"2.7\" -DMESOS_HAS_PYTHON=1 -I. -I../../src   -Wall -Werror -Wsign-compare -DLIBDIR=\"/mesos/mesos-1.2.0/_inst/lib\" -DPKGLIBEXECDIR=\"/mesos/mesos-1.2.0/_inst/libexec/mesos\" -DPKGDATADIR=\"/mesos/mesos-1.2.0/_inst/share/mesos\" -DPKGMODULEDIR=\"/mesos/mesos-1.2.0/_inst/lib/mesos/modules\" -I../../include -I../include -I../include/mesos -DPICOJSON_USE_INT64 -D__STDC_FORMAT_MACROS -isystem ../3rdparty/boost-1.53.0 -I../3rdparty/elfio-3.2 -I../3rdparty/glog-0.3.3/src -I../3rdparty/leveldb-1.4/include -I../../3rdparty/libprocess/include -I../3rdparty/nvml-352.79 -I../3rdparty/picojson-1.3.0 -I../3rdparty/protobuf-2.6.1/src -I../../3rdparty/stout/include -I../3rdparty/zookeeper-3.4.8/src/c/include -I../3rdparty/zookeeper-3.4.8/src/c/generated -DHAS_AUTHENTICATION=1 -I/usr/include/subversion-1 -I/usr/include/apr-1 -I/usr/include/apr-1.0  -pthread -g1 -O0 -Wno-unused-local-typedefs -std=c++11 -MT examples/docker_no_executor_framework-docker_no_executor_framework.o -MD -MP -MF examples/.deps/docker_no_executor_framework-docker_no_executor_framework.Tpo -c -o examples/docker_no_executor_framework-docker_no_executor_framework.o `test -f 'examples/docker_no_executor_framework.cpp' || echo '../../src/'`examples/docker_no_executor_framework.cpp
g++ -DPACKAGE_NAME=\"mesos\" -DPACKAGE_TARNAME=\"mesos\" -DPACKAGE_VERSION=\"1.2.0\" -DPACKAGE_STRING=\"mesos\ 1.2.0\" -DPACKAGE_BUGREPORT=\"\" -DPACKAGE_URL=\"\" -DPACKAGE=\"mesos\" -DVERSION=\"1.2.0\" -DSTDC_HEADERS=1 -DHAVE_SYS_TYPES_H=1 -DHAVE_SYS_STAT_H=1 -DHAVE_STDLIB_H=1 -DHAVE_STRING_H=1 -DHAVE_MEMORY_H=1 -DHAVE_STRINGS_H=1 -DHAVE_INTTYPES_H=1 -DHAVE_STDINT_H=1 -DHAVE_UNISTD_H=1 -DHAVE_DLFCN_H=1 -DLT_OBJDIR=\".libs/\" -DHAVE_CXX11=1 -DHAVE_PTHREAD_PRIO_INHERIT=1 -DHAVE_PTHREAD=1 -DHAVE_LIBZ=1 -DHAVE_FTS_H=1 -DHAVE_APR_POOLS_H=1 -DHAVE_LIBAPR_1=1 -DHAVE_LIBCURL=1 -DMESOS_HAS_JAVA=1 -DHAVE_LIBSASL2=1 -DHAVE_SVN_VERSION_H=1 -DHAVE_LIBSVN_SUBR_1=1 -DHAVE_SVN_DELTA_H=1 -DHAVE_LIBSVN_DELTA_1=1 -DHAVE_LIBZ=1 -DHAVE_PYTHON=\"2.7\" -DMESOS_HAS_PYTHON=1 -I. -I../../src   -Wall -Werror -Wsign-compare -DLIBDIR=\"/mesos/mesos-1.2.0/_inst/lib\" -DPKGLIBEXECDIR=\"/mesos/mesos-1.2.0/_inst/libexec/mesos\" -DPKGDATADIR=\"/mesos/mesos-1.2.0/_inst/share/mesos\" -DPKGMODULEDIR=\"/mesos/mesos-1.2.0/_inst/lib/mesos/modules\" -I../../include -I../include -I../include/mesos -DPICOJSON_USE_INT64 -D__STDC_FORMAT_MACROS -isystem ../3rdparty/boost-1.53.0 -I../3rdparty/elfio-3.2 -I../3rdparty/glog-0.3.3/src -I../3rdparty/leveldb-1.4/include -I../../3rdparty/libprocess/include -I../3rdparty/nvml-352.79 -I../3rdparty/picojson-1.3.0 -I../3rdparty/protobuf-2.6.1/src -I../../3rdparty/stout/include -I../3rdparty/zookeeper-3.4.8/src/c/include -I../3rdparty/zookeeper-3.4.8/src/c/generated -DHAS_AUTHENTICATION=1 -I/usr/include/subversion-1 -I/usr/include/apr-1 -I/usr/include/apr-1.0  -pthread -g1 -O0 -Wno-unused-local-typedefs -std=c++11 -MT examples/balloon_framework-balloon_framework.o -MD -MP -MF examples/.deps/balloon_framework-balloon_framework.Tpo -c -o examples/balloon_framework-balloon_framework.o `test -f 'examples/balloon_framework.cpp' || echo '../../src/'`examples/balloon_framework.cpp
mv -f examples/.deps/test_http_framework-test_http_framework.Tpo examples/.deps/test_http_framework-test_http_framework.Po
g++ -DPACKAGE_NAME=\"mesos\" -DPACKAGE_TARNAME=\"mesos\" -DPACKAGE_VERSION=\"1.2.0\" -DPACKAGE_STRING=\"mesos\ 1.2.0\" -DPACKAGE_BUGREPORT=\"\" -DPACKAGE_URL=\"\" -DPACKAGE=\"mesos\" -DVERSION=\"1.2.0\" -DSTDC_HEADERS=1 -DHAVE_SYS_TYPES_H=1 -DHAVE_SYS_STAT_H=1 -DHAVE_STDLIB_H=1 -DHAVE_STRING_H=1 -DHAVE_MEMORY_H=1 -DHAVE_STRINGS_H=1 -DHAVE_INTTYPES_H=1 -DHAVE_STDINT_H=1 -DHAVE_UNISTD_H=1 -DHAVE_DLFCN_H=1 -DLT_OBJDIR=\".libs/\" -DHAVE_CXX11=1 -DHAVE_PTHREAD_PRIO_INHERIT=1 -DHAVE_PTHREAD=1 -DHAVE_LIBZ=1 -DHAVE_FTS_H=1 -DHAVE_APR_POOLS_H=1 -DHAVE_LIBAPR_1=1 -DHAVE_LIBCURL=1 -DMESOS_HAS_JAVA=1 -DHAVE_LIBSASL2=1 -DHAVE_SVN_VERSION_H=1 -DHAVE_LIBSVN_SUBR_1=1 -DHAVE_SVN_DELTA_H=1 -DHAVE_LIBSVN_DELTA_1=1 -DHAVE_LIBZ=1 -DHAVE_PYTHON=\"2.7\" -DMESOS_HAS_PYTHON=1 -I. -I../../src   -Wall -Werror -Wsign-compare -DLIBDIR=\"/mesos/mesos-1.2.0/_inst/lib\" -DPKGLIBEXECDIR=\"/mesos/mesos-1.2.0/_inst/libexec/mesos\" -DPKGDATADIR=\"/mesos/mesos-1.2.0/_inst/share/mesos\" -DPKGMODULEDIR=\"/mesos/mesos-1.2.0/_inst/lib/mesos/modules\" -I../../include -I../include -I../include/mesos -DPICOJSON_USE_INT64 -D__STDC_FORMAT_MACROS -isystem ../3rdparty/boost-1.53.0 -I../3rdparty/elfio-3.2 -I../3rdparty/glog-0.3.3/src -I../3rdparty/leveldb-1.4/include -I../../3rdparty/libprocess/include -I../3rdparty/nvml-352.79 -I../3rdparty/picojson-1.3.0 -I../3rdparty/protobuf-2.6.1/src -I../../3rdparty/stout/include -I../3rdparty/zookeeper-3.4.8/src/c/include -I../3rdparty/zookeeper-3.4.8/src/c/generated -DHAS_AUTHENTICATION=1 -I/usr/include/subversion-1 -I/usr/include/apr-1 -I/usr/include/apr-1.0  -pthread -g1 -O0 -Wno-unused-local-typedefs -std=c++11 -MT examples/balloon_executor-balloon_executor.o -MD -MP -MF examples/.deps/balloon_executor-balloon_executor.Tpo -c -o examples/balloon_executor-balloon_executor.o `test -f 'examples/balloon_executor.cpp' || echo '../../src/'`examples/balloon_executor.cpp
mv -f examples/.deps/long_lived_framework-long_lived_framework.Tpo examples/.deps/long_lived_framework-long_lived_framework.Po
g++ -DPACKAGE_NAME=\"mesos\" -DPACKAGE_TARNAME=\"mesos\" -DPACKAGE_VERSION=\"1.2.0\" -DPACKAGE_STRING=\"mesos\ 1.2.0\" -DPACKAGE_BUGREPORT=\"\" -DPACKAGE_URL=\"\" -DPACKAGE=\"mesos\" -DVERSION=\"1.2.0\" -DSTDC_HEADERS=1 -DHAVE_SYS_TYPES_H=1 -DHAVE_SYS_STAT_H=1 -DHAVE_STDLIB_H=1 -DHAVE_STRING_H=1 -DHAVE_MEMORY_H=1 -DHAVE_STRINGS_H=1 -DHAVE_INTTYPES_H=1 -DHAVE_STDINT_H=1 -DHAVE_UNISTD_H=1 -DHAVE_DLFCN_H=1 -DLT_OBJDIR=\".libs/\" -DHAVE_CXX11=1 -DHAVE_PTHREAD_PRIO_INHERIT=1 -DHAVE_PTHREAD=1 -DHAVE_LIBZ=1 -DHAVE_FTS_H=1 -DHAVE_APR_POOLS_H=1 -DHAVE_LIBAPR_1=1 -DHAVE_LIBCURL=1 -DMESOS_HAS_JAVA=1 -DHAVE_LIBSASL2=1 -DHAVE_SVN_VERSION_H=1 -DHAVE_LIBSVN_SUBR_1=1 -DHAVE_SVN_DELTA_H=1 -DHAVE_LIBSVN_DELTA_1=1 -DHAVE_LIBZ=1 -DHAVE_PYTHON=\"2.7\" -DMESOS_HAS_PYTHON=1 -I. -I../../src   -Wall -Werror -Wsign-compare -DLIBDIR=\"/mesos/mesos-1.2.0/_inst/lib\" -DPKGLIBEXECDIR=\"/mesos/mesos-1.2.0/_inst/libexec/mesos\" -DPKGDATADIR=\"/mesos/mesos-1.2.0/_inst/share/mesos\" -DPKGMODULEDIR=\"/mesos/mesos-1.2.0/_inst/lib/mesos/modules\" -I../../include -I../include -I../include/mesos -DPICOJSON_USE_INT64 -D__STDC_FORMAT_MACROS -isystem ../3rdparty/boost-1.53.0 -I../3rdparty/elfio-3.2 -I../3rdparty/glog-0.3.3/src -I../3rdparty/leveldb-1.4/include -I../../3rdparty/libprocess/include -I../3rdparty/nvml-352.79 -I../3rdparty/picojson-1.3.0 -I../3rdparty/protobuf-2.6.1/src -I../../3rdparty/stout/include -I../3rdparty/zookeeper-3.4.8/src/c/include -I../3rdparty/zookeeper-3.4.8/src/c/generated -DHAS_AUTHENTICATION=1 -I/usr/include/subversion-1 -I/usr/include/apr-1 -I/usr/include/apr-1.0  -pthread -g1 -O0 -Wno-unused-local-typedefs -std=c++11 -MT examples/load_generator_framework-load_generator_framework.o -MD -MP -MF examples/.deps/load_generator_framework-load_generator_framework.Tpo -c -o examples/load_generator_framework-load_generator_framework.o `test -f 'examples/load_generator_framework.cpp' || echo '../../src/'`examples/load_generator_framework.cpp
mv -f examples/.deps/long_lived_executor-long_lived_executor.Tpo examples/.deps/long_lived_executor-long_lived_executor.Po
g++ -DPACKAGE_NAME=\"mesos\" -DPACKAGE_TARNAME=\"mesos\" -DPACKAGE_VERSION=\"1.2.0\" -DPACKAGE_STRING=\"mesos\ 1.2.0\" -DPACKAGE_BUGREPORT=\"\" -DPACKAGE_URL=\"\" -DPACKAGE=\"mesos\" -DVERSION=\"1.2.0\" -DSTDC_HEADERS=1 -DHAVE_SYS_TYPES_H=1 -DHAVE_SYS_STAT_H=1 -DHAVE_STDLIB_H=1 -DHAVE_STRING_H=1 -DHAVE_MEMORY_H=1 -DHAVE_STRINGS_H=1 -DHAVE_INTTYPES_H=1 -DHAVE_STDINT_H=1 -DHAVE_UNISTD_H=1 -DHAVE_DLFCN_H=1 -DLT_OBJDIR=\".libs/\" -DHAVE_CXX11=1 -DHAVE_PTHREAD_PRIO_INHERIT=1 -DHAVE_PTHREAD=1 -DHAVE_LIBZ=1 -DHAVE_FTS_H=1 -DHAVE_APR_POOLS_H=1 -DHAVE_LIBAPR_1=1 -DHAVE_LIBCURL=1 -DMESOS_HAS_JAVA=1 -DHAVE_LIBSASL2=1 -DHAVE_SVN_VERSION_H=1 -DHAVE_LIBSVN_SUBR_1=1 -DHAVE_SVN_DELTA_H=1 -DHAVE_LIBSVN_DELTA_1=1 -DHAVE_LIBZ=1 -DHAVE_PYTHON=\"2.7\" -DMESOS_HAS_PYTHON=1 -I. -I../../src   -Wall -Werror -Wsign-compare -DLIBDIR=\"/mesos/mesos-1.2.0/_inst/lib\" -DPKGLIBEXECDIR=\"/mesos/mesos-1.2.0/_inst/libexec/mesos\" -DPKGDATADIR=\"/mesos/mesos-1.2.0/_inst/share/mesos\" -DPKGMODULEDIR=\"/mesos/mesos-1.2.0/_inst/lib/mesos/modules\" -I../../include -I../include -I../include/mesos -DPICOJSON_USE_INT64 -D__STDC_FORMAT_MACROS -isystem ../3rdparty/boost-1.53.0 -I../3rdparty/elfio-3.2 -I../3rdparty/glog-0.3.3/src -I../3rdparty/leveldb-1.4/include -I../../3rdparty/libprocess/include -I../3rdparty/nvml-352.79 -I../3rdparty/picojson-1.3.0 -I../3rdparty/protobuf-2.6.1/src -I../../3rdparty/stout/include -I../3rdparty/zookeeper-3.4.8/src/c/include -I../3rdparty/zookeeper-3.4.8/src/c/generated -DHAS_AUTHENTICATION=1 -I/usr/include/subversion-1 -I/usr/include/apr-1 -I/usr/include/apr-1.0  -pthread -g1 -O0 -Wno-unused-local-typedefs -std=c++11 -MT examples/persistent_volume_framework-persistent_volume_framework.o -MD -MP -MF examples/.deps/persistent_volume_framework-persistent_volume_framework.Tpo -c -o examples/persistent_volume_framework-persistent_volume_framework.o `test -f 'examples/persistent_volume_framework.cpp' || echo '../../src/'`examples/persistent_volume_framework.cpp
mv -f examples/.deps/docker_no_executor_framework-docker_no_executor_framework.Tpo examples/.deps/docker_no_executor_framework-docker_no_executor_framework.Po
g++ -DPACKAGE_NAME=\"mesos\" -DPACKAGE_TARNAME=\"mesos\" -DPACKAGE_VERSION=\"1.2.0\" -DPACKAGE_STRING=\"mesos\ 1.2.0\" -DPACKAGE_BUGREPORT=\"\" -DPACKAGE_URL=\"\" -DPACKAGE=\"mesos\" -DVERSION=\"1.2.0\" -DSTDC_HEADERS=1 -DHAVE_SYS_TYPES_H=1 -DHAVE_SYS_STAT_H=1 -DHAVE_STDLIB_H=1 -DHAVE_STRING_H=1 -DHAVE_MEMORY_H=1 -DHAVE_STRINGS_H=1 -DHAVE_INTTYPES_H=1 -DHAVE_STDINT_H=1 -DHAVE_UNISTD_H=1 -DHAVE_DLFCN_H=1 -DLT_OBJDIR=\".libs/\" -DHAVE_CXX11=1 -DHAVE_PTHREAD_PRIO_INHERIT=1 -DHAVE_PTHREAD=1 -DHAVE_LIBZ=1 -DHAVE_FTS_H=1 -DHAVE_APR_POOLS_H=1 -DHAVE_LIBAPR_1=1 -DHAVE_LIBCURL=1 -DMESOS_HAS_JAVA=1 -DHAVE_LIBSASL2=1 -DHAVE_SVN_VERSION_H=1 -DHAVE_LIBSVN_SUBR_1=1 -DHAVE_SVN_DELTA_H=1 -DHAVE_LIBSVN_DELTA_1=1 -DHAVE_LIBZ=1 -DHAVE_PYTHON=\"2.7\" -DMESOS_HAS_PYTHON=1 -I. -I../../src   -Wall -Werror -Wsign-compare -DLIBDIR=\"/mesos/mesos-1.2.0/_inst/lib\" -DPKGLIBEXECDIR=\"/mesos/mesos-1.2.0/_inst/libexec/mesos\" -DPKGDATADIR=\"/mesos/mesos-1.2.0/_inst/share/mesos\" -DPKGMODULEDIR=\"/mesos/mesos-1.2.0/_inst/lib/mesos/modules\" -I../../include -I../include -I../include/mesos -DPICOJSON_USE_INT64 -D__STDC_FORMAT_MACROS -isystem ../3rdparty/boost-1.53.0 -I../3rdparty/elfio-3.2 -I../3rdparty/glog-0.3.3/src -I../3rdparty/leveldb-1.4/include -I../../3rdparty/libprocess/include -I../3rdparty/nvml-352.79 -I../3rdparty/picojson-1.3.0 -I../3rdparty/protobuf-2.6.1/src -I../../3rdparty/stout/include -I../3rdparty/zookeeper-3.4.8/src/c/include -I../3rdparty/zookeeper-3.4.8/src/c/generated -DHAS_AUTHENTICATION=1 -I/usr/include/subversion-1 -I/usr/include/apr-1 -I/usr/include/apr-1.0  -pthread -g1 -O0 -Wno-unused-local-typedefs -std=c++11 -MT examples/disk_full_framework-disk_full_framework.o -MD -MP -MF examples/.deps/disk_full_framework-disk_full_framework.Tpo -c -o examples/disk_full_framework-disk_full_framework.o `test -f 'examples/disk_full_framework.cpp' || echo '../../src/'`examples/disk_full_framework.cpp
mv -f examples/.deps/balloon_executor-balloon_executor.Tpo examples/.deps/balloon_executor-balloon_executor.Po
g++ -DPACKAGE_NAME=\"mesos\" -DPACKAGE_TARNAME=\"mesos\" -DPACKAGE_VERSION=\"1.2.0\" -DPACKAGE_STRING=\"mesos\ 1.2.0\" -DPACKAGE_BUGREPORT=\"\" -DPACKAGE_URL=\"\" -DPACKAGE=\"mesos\" -DVERSION=\"1.2.0\" -DSTDC_HEADERS=1 -DHAVE_SYS_TYPES_H=1 -DHAVE_SYS_STAT_H=1 -DHAVE_STDLIB_H=1 -DHAVE_STRING_H=1 -DHAVE_MEMORY_H=1 -DHAVE_STRINGS_H=1 -DHAVE_INTTYPES_H=1 -DHAVE_STDINT_H=1 -DHAVE_UNISTD_H=1 -DHAVE_DLFCN_H=1 -DLT_OBJDIR=\".libs/\" -DHAVE_CXX11=1 -DHAVE_PTHREAD_PRIO_INHERIT=1 -DHAVE_PTHREAD=1 -DHAVE_LIBZ=1 -DHAVE_FTS_H=1 -DHAVE_APR_POOLS_H=1 -DHAVE_LIBAPR_1=1 -DHAVE_LIBCURL=1 -DMESOS_HAS_JAVA=1 -DHAVE_LIBSASL2=1 -DHAVE_SVN_VERSION_H=1 -DHAVE_LIBSVN_SUBR_1=1 -DHAVE_SVN_DELTA_H=1 -DHAVE_LIBSVN_DELTA_1=1 -DHAVE_LIBZ=1 -DHAVE_PYTHON=\"2.7\" -DMESOS_HAS_PYTHON=1 -I. -I../../src   -Wall -Werror -Wsign-compare -DLIBDIR=\"/mesos/mesos-1.2.0/_inst/lib\" -DPKGLIBEXECDIR=\"/mesos/mesos-1.2.0/_inst/libexec/mesos\" -DPKGDATADIR=\"/mesos/mesos-1.2.0/_inst/share/mesos\" -DPKGMODULEDIR=\"/mesos/mesos-1.2.0/_inst/lib/mesos/modules\" -I../../include -I../include -I../include/mesos -DPICOJSON_USE_INT64 -D__STDC_FORMAT_MACROS -isystem ../3rdparty/boost-1.53.0 -I../3rdparty/elfio-3.2 -I../3rdparty/glog-0.3.3/src -I../3rdparty/leveldb-1.4/include -I../../3rdparty/libprocess/include -I../3rdparty/nvml-352.79 -I../3rdparty/picojson-1.3.0 -I../3rdparty/protobuf-2.6.1/src -I../../3rdparty/stout/include -I../3rdparty/zookeeper-3.4.8/src/c/include -I../3rdparty/zookeeper-3.4.8/src/c/generated -DHAS_AUTHENTICATION=1 -DSOURCE_DIR=\"/mesos/mesos-1.2.0/_build/..\" -DBUILD_DIR=\"/mesos/mesos-1.2.0/_build\" -I../3rdparty/gmock-1.7.0/gtest/include -isystem ../3rdparty/gmock-1.7.0/include -DTESTLIBEXECDIR=\"/mesos/mesos-1.2.0/_inst/libexec/mesos/tests\" -DSBINDIR=\"/mesos/mesos-1.2.0/_inst/sbin\" -I/usr/lib/jvm/java-7-openjdk-amd64/include -I/usr/lib/jvm/java-7-openjdk-amd64/include/linux -DZOOKEEPER_VERSION=\"3.4.8\" -I/usr/include/subversion-1 -I/usr/include/apr-1 -I/usr/include/apr-1.0  -pthread -g1 -O0 -Wno-unused-local-typedefs -std=c++11 -MT slave/qos_controllers/mesos_tests-load.o -MD -MP -MF slave/qos_controllers/.deps/mesos_tests-load.Tpo -c -o slave/qos_controllers/mesos_tests-load.o `test -f 'slave/qos_controllers/load.cpp' || echo '../../src/'`slave/qos_controllers/load.cpp
mv -f examples/.deps/no_executor_framework-no_executor_framework.Tpo examples/.deps/no_executor_framework-no_executor_framework.Po
g++ -DPACKAGE_NAME=\"mesos\" -DPACKAGE_TARNAME=\"mesos\" -DPACKAGE_VERSION=\"1.2.0\" -DPACKAGE_STRING=\"mesos\ 1.2.0\" -DPACKAGE_BUGREPORT=\"\" -DPACKAGE_URL=\"\" -DPACKAGE=\"mesos\" -DVERSION=\"1.2.0\" -DSTDC_HEADERS=1 -DHAVE_SYS_TYPES_H=1 -DHAVE_SYS_STAT_H=1 -DHAVE_STDLIB_H=1 -DHAVE_STRING_H=1 -DHAVE_MEMORY_H=1 -DHAVE_STRINGS_H=1 -DHAVE_INTTYPES_H=1 -DHAVE_STDINT_H=1 -DHAVE_UNISTD_H=1 -DHAVE_DLFCN_H=1 -DLT_OBJDIR=\".libs/\" -DHAVE_CXX11=1 -DHAVE_PTHREAD_PRIO_INHERIT=1 -DHAVE_PTHREAD=1 -DHAVE_LIBZ=1 -DHAVE_FTS_H=1 -DHAVE_APR_POOLS_H=1 -DHAVE_LIBAPR_1=1 -DHAVE_LIBCURL=1 -DMESOS_HAS_JAVA=1 -DHAVE_LIBSASL2=1 -DHAVE_SVN_VERSION_H=1 -DHAVE_LIBSVN_SUBR_1=1 -DHAVE_SVN_DELTA_H=1 -DHAVE_LIBSVN_DELTA_1=1 -DHAVE_LIBZ=1 -DHAVE_PYTHON=\"2.7\" -DMESOS_HAS_PYTHON=1 -I. -I../../src   -Wall -Werror -Wsign-compare -DLIBDIR=\"/mesos/mesos-1.2.0/_inst/lib\" -DPKGLIBEXECDIR=\"/mesos/mesos-1.2.0/_inst/libexec/mesos\" -DPKGDATADIR=\"/mesos/mesos-1.2.0/_inst/share/mesos\" -DPKGMODULEDIR=\"/mesos/mesos-1.2.0/_inst/lib/mesos/modules\" -I../../include -I../include -I../include/mesos -DPICOJSON_USE_INT64 -D__STDC_FORMAT_MACROS -isystem ../3rdparty/boost-1.53.0 -I../3rdparty/elfio-3.2 -I../3rdparty/glog-0.3.3/src -I../3rdparty/leveldb-1.4/include -I../../3rdparty/libprocess/include -I../3rdparty/nvml-352.79 -I../3rdparty/picojson-1.3.0 -I../3rdparty/protobuf-2.6.1/src -I../../3rdparty/stout/include -I../3rdparty/zookeeper-3.4.8/src/c/include -I../3rdparty/zookeeper-3.4.8/src/c/generated -DHAS_AUTHENTICATION=1 -DSOURCE_DIR=\"/mesos/mesos-1.2.0/_build/..\" -DBUILD_DIR=\"/mesos/mesos-1.2.0/_build\" -I../3rdparty/gmock-1.7.0/gtest/include -isystem ../3rdparty/gmock-1.7.0/include -DTESTLIBEXECDIR=\"/mesos/mesos-1.2.0/_inst/libexec/mesos/tests\" -DSBINDIR=\"/mesos/mesos-1.2.0/_inst/sbin\" -I/usr/lib/jvm/java-7-openjdk-amd64/include -I/usr/lib/jvm/java-7-openjdk-amd64/include/linux -DZOOKEEPER_VERSION=\"3.4.8\" -I/usr/include/subversion-1 -I/usr/include/apr-1 -I/usr/include/apr-1.0  -pthread -g1 -O0 -Wno-unused-local-typedefs -std=c++11 -MT tests/mesos_tests-active_user_test_helper.o -MD -MP -MF tests/.deps/mesos_tests-active_user_test_helper.Tpo -c -o tests/mesos_tests-active_user_test_helper.o `test -f 'tests/active_user_test_helper.cpp' || echo '../../src/'`tests/active_user_test_helper.cpp
mv -f examples/.deps/balloon_framework-balloon_framework.Tpo examples/.deps/balloon_framework-balloon_framework.Po
g++ -DPACKAGE_NAME=\"mesos\" -DPACKAGE_TARNAME=\"mesos\" -DPACKAGE_VERSION=\"1.2.0\" -DPACKAGE_STRING=\"mesos\ 1.2.0\" -DPACKAGE_BUGREPORT=\"\" -DPACKAGE_URL=\"\" -DPACKAGE=\"mesos\" -DVERSION=\"1.2.0\" -DSTDC_HEADERS=1 -DHAVE_SYS_TYPES_H=1 -DHAVE_SYS_STAT_H=1 -DHAVE_STDLIB_H=1 -DHAVE_STRING_H=1 -DHAVE_MEMORY_H=1 -DHAVE_STRINGS_H=1 -DHAVE_INTTYPES_H=1 -DHAVE_STDINT_H=1 -DHAVE_UNISTD_H=1 -DHAVE_DLFCN_H=1 -DLT_OBJDIR=\".libs/\" -DHAVE_CXX11=1 -DHAVE_PTHREAD_PRIO_INHERIT=1 -DHAVE_PTHREAD=1 -DHAVE_LIBZ=1 -DHAVE_FTS_H=1 -DHAVE_APR_POOLS_H=1 -DHAVE_LIBAPR_1=1 -DHAVE_LIBCURL=1 -DMESOS_HAS_JAVA=1 -DHAVE_LIBSASL2=1 -DHAVE_SVN_VERSION_H=1 -DHAVE_LIBSVN_SUBR_1=1 -DHAVE_SVN_DELTA_H=1 -DHAVE_LIBSVN_DELTA_1=1 -DHAVE_LIBZ=1 -DHAVE_PYTHON=\"2.7\" -DMESOS_HAS_PYTHON=1 -I. -I../../src   -Wall -Werror -Wsign-compare -DLIBDIR=\"/mesos/mesos-1.2.0/_inst/lib\" -DPKGLIBEXECDIR=\"/mesos/mesos-1.2.0/_inst/libexec/mesos\" -DPKGDATADIR=\"/mesos/mesos-1.2.0/_inst/share/mesos\" -DPKGMODULEDIR=\"/mesos/mesos-1.2.0/_inst/lib/mesos/modules\" -I../../include -I../include -I../include/mesos -DPICOJSON_USE_INT64 -D__STDC_FORMAT_MACROS -isystem ../3rdparty/boost-1.53.0 -I../3rdparty/elfio-3.2 -I../3rdparty/glog-0.3.3/src -I../3rdparty/leveldb-1.4/include -I../../3rdparty/libprocess/include -I../3rdparty/nvml-352.79 -I../3rdparty/picojson-1.3.0 -I../3rdparty/protobuf-2.6.1/src -I../../3rdparty/stout/include -I../3rdparty/zookeeper-3.4.8/src/c/include -I../3rdparty/zookeeper-3.4.8/src/c/generated -DHAS_AUTHENTICATION=1 -DSOURCE_DIR=\"/mesos/mesos-1.2.0/_build/..\" -DBUILD_DIR=\"/mesos/mesos-1.2.0/_build\" -I../3rdparty/gmock-1.7.0/gtest/include -isystem ../3rdparty/gmock-1.7.0/include -DTESTLIBEXECDIR=\"/mesos/mesos-1.2.0/_inst/libexec/mesos/tests\" -DSBINDIR=\"/mesos/mesos-1.2.0/_inst/sbin\" -I/usr/lib/jvm/java-7-openjdk-amd64/include -I/usr/lib/jvm/java-7-openjdk-amd64/include/linux -DZOOKEEPER_VERSION=\"3.4.8\" -I/usr/include/subversion-1 -I/usr/include/apr-1 -I/usr/include/apr-1.0  -pthread -g1 -O0 -Wno-unused-local-typedefs -std=c++11 -MT tests/mesos_tests-anonymous_tests.o -MD -MP -MF tests/.deps/mesos_tests-anonymous_tests.Tpo -c -o tests/mesos_tests-anonymous_tests.o `test -f 'tests/anonymous_tests.cpp' || echo '../../src/'`tests/anonymous_tests.cpp
mv -f examples/.deps/load_generator_framework-load_generator_framework.Tpo examples/.deps/load_generator_framework-load_generator_framework.Po
g++ -DPACKAGE_NAME=\"mesos\" -DPACKAGE_TARNAME=\"mesos\" -DPACKAGE_VERSION=\"1.2.0\" -DPACKAGE_STRING=\"mesos\ 1.2.0\" -DPACKAGE_BUGREPORT=\"\" -DPACKAGE_URL=\"\" -DPACKAGE=\"mesos\" -DVERSION=\"1.2.0\" -DSTDC_HEADERS=1 -DHAVE_SYS_TYPES_H=1 -DHAVE_SYS_STAT_H=1 -DHAVE_STDLIB_H=1 -DHAVE_STRING_H=1 -DHAVE_MEMORY_H=1 -DHAVE_STRINGS_H=1 -DHAVE_INTTYPES_H=1 -DHAVE_STDINT_H=1 -DHAVE_UNISTD_H=1 -DHAVE_DLFCN_H=1 -DLT_OBJDIR=\".libs/\" -DHAVE_CXX11=1 -DHAVE_PTHREAD_PRIO_INHERIT=1 -DHAVE_PTHREAD=1 -DHAVE_LIBZ=1 -DHAVE_FTS_H=1 -DHAVE_APR_POOLS_H=1 -DHAVE_LIBAPR_1=1 -DHAVE_LIBCURL=1 -DMESOS_HAS_JAVA=1 -DHAVE_LIBSASL2=1 -DHAVE_SVN_VERSION_H=1 -DHAVE_LIBSVN_SUBR_1=1 -DHAVE_SVN_DELTA_H=1 -DHAVE_LIBSVN_DELTA_1=1 -DHAVE_LIBZ=1 -DHAVE_PYTHON=\"2.7\" -DMESOS_HAS_PYTHON=1 -I. -I../../src   -Wall -Werror -Wsign-compare -DLIBDIR=\"/mesos/mesos-1.2.0/_inst/lib\" -DPKGLIBEXECDIR=\"/mesos/mesos-1.2.0/_inst/libexec/mesos\" -DPKGDATADIR=\"/mesos/mesos-1.2.0/_inst/share/mesos\" -DPKGMODULEDIR=\"/mesos/mesos-1.2.0/_inst/lib/mesos/modules\" -I../../include -I../include -I../include/mesos -DPICOJSON_USE_INT64 -D__STDC_FORMAT_MACROS -isystem ../3rdparty/boost-1.53.0 -I../3rdparty/elfio-3.2 -I../3rdparty/glog-0.3.3/src -I../3rdparty/leveldb-1.4/include -I../../3rdparty/libprocess/include -I../3rdparty/nvml-352.79 -I../3rdparty/picojson-1.3.0 -I../3rdparty/protobuf-2.6.1/src -I../../3rdparty/stout/include -I../3rdparty/zookeeper-3.4.8/src/c/include -I../3rdparty/zookeeper-3.4.8/src/c/generated -DHAS_AUTHENTICATION=1 -DSOURCE_DIR=\"/mesos/mesos-1.2.0/_build/..\" -DBUILD_DIR=\"/mesos/mesos-1.2.0/_build\" -I../3rdparty/gmock-1.7.0/gtest/include -isystem ../3rdparty/gmock-1.7.0/include -DTESTLIBEXECDIR=\"/mesos/mesos-1.2.0/_inst/libexec/mesos/tests\" -DSBINDIR=\"/mesos/mesos-1.2.0/_inst/sbin\" -I/usr/lib/jvm/java-7-openjdk-amd64/include -I/usr/lib/jvm/java-7-openjdk-amd64/include/linux -DZOOKEEPER_VERSION=\"3.4.8\" -I/usr/include/subversion-1 -I/usr/include/apr-1 -I/usr/include/apr-1.0  -pthread -g1 -O0 -Wno-unused-local-typedefs -std=c++11 -MT tests/mesos_tests-api_tests.o -MD -MP -MF tests/.deps/mesos_tests-api_tests.Tpo -c -o tests/mesos_tests-api_tests.o `test -f 'tests/api_tests.cpp' || echo '../../src/'`tests/api_tests.cpp
mv -f examples/.deps/persistent_volume_framework-persistent_volume_framework.Tpo examples/.deps/persistent_volume_framework-persistent_volume_framework.Po
g++ -DPACKAGE_NAME=\"mesos\" -DPACKAGE_TARNAME=\"mesos\" -DPACKAGE_VERSION=\"1.2.0\" -DPACKAGE_STRING=\"mesos\ 1.2.0\" -DPACKAGE_BUGREPORT=\"\" -DPACKAGE_URL=\"\" -DPACKAGE=\"mesos\" -DVERSION=\"1.2.0\" -DSTDC_HEADERS=1 -DHAVE_SYS_TYPES_H=1 -DHAVE_SYS_STAT_H=1 -DHAVE_STDLIB_H=1 -DHAVE_STRING_H=1 -DHAVE_MEMORY_H=1 -DHAVE_STRINGS_H=1 -DHAVE_INTTYPES_H=1 -DHAVE_STDINT_H=1 -DHAVE_UNISTD_H=1 -DHAVE_DLFCN_H=1 -DLT_OBJDIR=\".libs/\" -DHAVE_CXX11=1 -DHAVE_PTHREAD_PRIO_INHERIT=1 -DHAVE_PTHREAD=1 -DHAVE_LIBZ=1 -DHAVE_FTS_H=1 -DHAVE_APR_POOLS_H=1 -DHAVE_LIBAPR_1=1 -DHAVE_LIBCURL=1 -DMESOS_HAS_JAVA=1 -DHAVE_LIBSASL2=1 -DHAVE_SVN_VERSION_H=1 -DHAVE_LIBSVN_SUBR_1=1 -DHAVE_SVN_DELTA_H=1 -DHAVE_LIBSVN_DELTA_1=1 -DHAVE_LIBZ=1 -DHAVE_PYTHON=\"2.7\" -DMESOS_HAS_PYTHON=1 -I. -I../../src   -Wall -Werror -Wsign-compare -DLIBDIR=\"/mesos/mesos-1.2.0/_inst/lib\" -DPKGLIBEXECDIR=\"/mesos/mesos-1.2.0/_inst/libexec/mesos\" -DPKGDATADIR=\"/mesos/mesos-1.2.0/_inst/share/mesos\" -DPKGMODULEDIR=\"/mesos/mesos-1.2.0/_inst/lib/mesos/modules\" -I../../include -I../include -I../include/mesos -DPICOJSON_USE_INT64 -D__STDC_FORMAT_MACROS -isystem ../3rdparty/boost-1.53.0 -I../3rdparty/elfio-3.2 -I../3rdparty/glog-0.3.3/src -I../3rdparty/leveldb-1.4/include -I../../3rdparty/libprocess/include -I../3rdparty/nvml-352.79 -I../3rdparty/picojson-1.3.0 -I../3rdparty/protobuf-2.6.1/src -I../../3rdparty/stout/include -I../3rdparty/zookeeper-3.4.8/src/c/include -I../3rdparty/zookeeper-3.4.8/src/c/generated -DHAS_AUTHENTICATION=1 -DSOURCE_DIR=\"/mesos/mesos-1.2.0/_build/..\" -DBUILD_DIR=\"/mesos/mesos-1.2.0/_build\" -I../3rdparty/gmock-1.7.0/gtest/include -isystem ../3rdparty/gmock-1.7.0/include -DTESTLIBEXECDIR=\"/mesos/mesos-1.2.0/_inst/libexec/mesos/tests\" -DSBINDIR=\"/mesos/mesos-1.2.0/_inst/sbin\" -I/usr/lib/jvm/java-7-openjdk-amd64/include -I/usr/lib/jvm/java-7-openjdk-amd64/include/linux -DZOOKEEPER_VERSION=\"3.4.8\" -I/usr/include/subversion-1 -I/usr/include/apr-1 -I/usr/include/apr-1.0  -pthread -g1 -O0 -Wno-unused-local-typedefs -std=c++11 -MT tests/mesos_tests-attributes_tests.o -MD -MP -MF tests/.deps/mesos_tests-attributes_tests.Tpo -c -o tests/mesos_tests-attributes_tests.o `test -f 'tests/attributes_tests.cpp' || echo '../../src/'`tests/attributes_tests.cpp
mv -f tests/.deps/mesos_tests-active_user_test_helper.Tpo tests/.deps/mesos_tests-active_user_test_helper.Po
g++ -DPACKAGE_NAME=\"mesos\" -DPACKAGE_TARNAME=\"mesos\" -DPACKAGE_VERSION=\"1.2.0\" -DPACKAGE_STRING=\"mesos\ 1.2.0\" -DPACKAGE_BUGREPORT=\"\" -DPACKAGE_URL=\"\" -DPACKAGE=\"mesos\" -DVERSION=\"1.2.0\" -DSTDC_HEADERS=1 -DHAVE_SYS_TYPES_H=1 -DHAVE_SYS_STAT_H=1 -DHAVE_STDLIB_H=1 -DHAVE_STRING_H=1 -DHAVE_MEMORY_H=1 -DHAVE_STRINGS_H=1 -DHAVE_INTTYPES_H=1 -DHAVE_STDINT_H=1 -DHAVE_UNISTD_H=1 -DHAVE_DLFCN_H=1 -DLT_OBJDIR=\".libs/\" -DHAVE_CXX11=1 -DHAVE_PTHREAD_PRIO_INHERIT=1 -DHAVE_PTHREAD=1 -DHAVE_LIBZ=1 -DHAVE_FTS_H=1 -DHAVE_APR_POOLS_H=1 -DHAVE_LIBAPR_1=1 -DHAVE_LIBCURL=1 -DMESOS_HAS_JAVA=1 -DHAVE_LIBSASL2=1 -DHAVE_SVN_VERSION_H=1 -DHAVE_LIBSVN_SUBR_1=1 -DHAVE_SVN_DELTA_H=1 -DHAVE_LIBSVN_DELTA_1=1 -DHAVE_LIBZ=1 -DHAVE_PYTHON=\"2.7\" -DMESOS_HAS_PYTHON=1 -I. -I../../src   -Wall -Werror -Wsign-compare -DLIBDIR=\"/mesos/mesos-1.2.0/_inst/lib\" -DPKGLIBEXECDIR=\"/mesos/mesos-1.2.0/_inst/libexec/mesos\" -DPKGDATADIR=\"/mesos/mesos-1.2.0/_inst/share/mesos\" -DPKGMODULEDIR=\"/mesos/mesos-1.2.0/_inst/lib/mesos/modules\" -I../../include -I../include -I../include/mesos -DPICOJSON_USE_INT64 -D__STDC_FORMAT_MACROS -isystem ../3rdparty/boost-1.53.0 -I../3rdparty/elfio-3.2 -I../3rdparty/glog-0.3.3/src -I../3rdparty/leveldb-1.4/include -I../../3rdparty/libprocess/include -I../3rdparty/nvml-352.79 -I../3rdparty/picojson-1.3.0 -I../3rdparty/protobuf-2.6.1/src -I../../3rdparty/stout/include -I../3rdparty/zookeeper-3.4.8/src/c/include -I../3rdparty/zookeeper-3.4.8/src/c/generated -DHAS_AUTHENTICATION=1 -DSOURCE_DIR=\"/mesos/mesos-1.2.0/_build/..\" -DBUILD_DIR=\"/mesos/mesos-1.2.0/_build\" -I../3rdparty/gmock-1.7.0/gtest/include -isystem ../3rdparty/gmock-1.7.0/include -DTESTLIBEXECDIR=\"/mesos/mesos-1.2.0/_inst/libexec/mesos/tests\" -DSBINDIR=\"/mesos/mesos-1.2.0/_inst/sbin\" -I/usr/lib/jvm/java-7-openjdk-amd64/include -I/usr/lib/jvm/java-7-openjdk-amd64/include/linux -DZOOKEEPER_VERSION=\"3.4.8\" -I/usr/include/subversion-1 -I/usr/include/apr-1 -I/usr/include/apr-1.0  -pthread -g1 -O0 -Wno-unused-local-typedefs -std=c++11 -MT tests/mesos_tests-authentication_tests.o -MD -MP -MF tests/.deps/mesos_tests-authentication_tests.Tpo -c -o tests/mesos_tests-authentication_tests.o `test -f 'tests/authentication_tests.cpp' || echo '../../src/'`tests/authentication_tests.cpp
mv -f tests/.deps/mesos_tests-attributes_tests.Tpo tests/.deps/mesos_tests-attributes_tests.Po
g++ -DPACKAGE_NAME=\"mesos\" -DPACKAGE_TARNAME=\"mesos\" -DPACKAGE_VERSION=\"1.2.0\" -DPACKAGE_STRING=\"mesos\ 1.2.0\" -DPACKAGE_BUGREPORT=\"\" -DPACKAGE_URL=\"\" -DPACKAGE=\"mesos\" -DVERSION=\"1.2.0\" -DSTDC_HEADERS=1 -DHAVE_SYS_TYPES_H=1 -DHAVE_SYS_STAT_H=1 -DHAVE_STDLIB_H=1 -DHAVE_STRING_H=1 -DHAVE_MEMORY_H=1 -DHAVE_STRINGS_H=1 -DHAVE_INTTYPES_H=1 -DHAVE_STDINT_H=1 -DHAVE_UNISTD_H=1 -DHAVE_DLFCN_H=1 -DLT_OBJDIR=\".libs/\" -DHAVE_CXX11=1 -DHAVE_PTHREAD_PRIO_INHERIT=1 -DHAVE_PTHREAD=1 -DHAVE_LIBZ=1 -DHAVE_FTS_H=1 -DHAVE_APR_POOLS_H=1 -DHAVE_LIBAPR_1=1 -DHAVE_LIBCURL=1 -DMESOS_HAS_JAVA=1 -DHAVE_LIBSASL2=1 -DHAVE_SVN_VERSION_H=1 -DHAVE_LIBSVN_SUBR_1=1 -DHAVE_SVN_DELTA_H=1 -DHAVE_LIBSVN_DELTA_1=1 -DHAVE_LIBZ=1 -DHAVE_PYTHON=\"2.7\" -DMESOS_HAS_PYTHON=1 -I. -I../../src   -Wall -Werror -Wsign-compare -DLIBDIR=\"/mesos/mesos-1.2.0/_inst/lib\" -DPKGLIBEXECDIR=\"/mesos/mesos-1.2.0/_inst/libexec/mesos\" -DPKGDATADIR=\"/mesos/mesos-1.2.0/_inst/share/mesos\" -DPKGMODULEDIR=\"/mesos/mesos-1.2.0/_inst/lib/mesos/modules\" -I../../include -I../include -I../include/mesos -DPICOJSON_USE_INT64 -D__STDC_FORMAT_MACROS -isystem ../3rdparty/boost-1.53.0 -I../3rdparty/elfio-3.2 -I../3rdparty/glog-0.3.3/src -I../3rdparty/leveldb-1.4/include -I../../3rdparty/libprocess/include -I../3rdparty/nvml-352.79 -I../3rdparty/picojson-1.3.0 -I../3rdparty/protobuf-2.6.1/src -I../../3rdparty/stout/include -I../3rdparty/zookeeper-3.4.8/src/c/include -I../3rdparty/zookeeper-3.4.8/src/c/generated -DHAS_AUTHENTICATION=1 -DSOURCE_DIR=\"/mesos/mesos-1.2.0/_build/..\" -DBUILD_DIR=\"/mesos/mesos-1.2.0/_build\" -I../3rdparty/gmock-1.7.0/gtest/include -isystem ../3rdparty/gmock-1.7.0/include -DTESTLIBEXECDIR=\"/mesos/mesos-1.2.0/_inst/libexec/mesos/tests\" -DSBINDIR=\"/mesos/mesos-1.2.0/_inst/sbin\" -I/usr/lib/jvm/java-7-openjdk-amd64/include -I/usr/lib/jvm/java-7-openjdk-amd64/include/linux -DZOOKEEPER_VERSION=\"3.4.8\" -I/usr/include/subversion-1 -I/usr/include/apr-1 -I/usr/include/apr-1.0  -pthread -g1 -O0 -Wno-unused-local-typedefs -std=c++11 -MT tests/mesos_tests-authorization_tests.o -MD -MP -MF tests/.deps/mesos_tests-authorization_tests.Tpo -c -o tests/mesos_tests-authorization_tests.o `test -f 'tests/authorization_tests.cpp' || echo '../../src/'`tests/authorization_tests.cpp
mv -f slave/qos_controllers/.deps/mesos_tests-load.Tpo slave/qos_controllers/.deps/mesos_tests-load.Po
g++ -DPACKAGE_NAME=\"mesos\" -DPACKAGE_TARNAME=\"mesos\" -DPACKAGE_VERSION=\"1.2.0\" -DPACKAGE_STRING=\"mesos\ 1.2.0\" -DPACKAGE_BUGREPORT=\"\" -DPACKAGE_URL=\"\" -DPACKAGE=\"mesos\" -DVERSION=\"1.2.0\" -DSTDC_HEADERS=1 -DHAVE_SYS_TYPES_H=1 -DHAVE_SYS_STAT_H=1 -DHAVE_STDLIB_H=1 -DHAVE_STRING_H=1 -DHAVE_MEMORY_H=1 -DHAVE_STRINGS_H=1 -DHAVE_INTTYPES_H=1 -DHAVE_STDINT_H=1 -DHAVE_UNISTD_H=1 -DHAVE_DLFCN_H=1 -DLT_OBJDIR=\".libs/\" -DHAVE_CXX11=1 -DHAVE_PTHREAD_PRIO_INHERIT=1 -DHAVE_PTHREAD=1 -DHAVE_LIBZ=1 -DHAVE_FTS_H=1 -DHAVE_APR_POOLS_H=1 -DHAVE_LIBAPR_1=1 -DHAVE_LIBCURL=1 -DMESOS_HAS_JAVA=1 -DHAVE_LIBSASL2=1 -DHAVE_SVN_VERSION_H=1 -DHAVE_LIBSVN_SUBR_1=1 -DHAVE_SVN_DELTA_H=1 -DHAVE_LIBSVN_DELTA_1=1 -DHAVE_LIBZ=1 -DHAVE_PYTHON=\"2.7\" -DMESOS_HAS_PYTHON=1 -I. -I../../src   -Wall -Werror -Wsign-compare -DLIBDIR=\"/mesos/mesos-1.2.0/_inst/lib\" -DPKGLIBEXECDIR=\"/mesos/mesos-1.2.0/_inst/libexec/mesos\" -DPKGDATADIR=\"/mesos/mesos-1.2.0/_inst/share/mesos\" -DPKGMODULEDIR=\"/mesos/mesos-1.2.0/_inst/lib/mesos/modules\" -I../../include -I../include -I../include/mesos -DPICOJSON_USE_INT64 -D__STDC_FORMAT_MACROS -isystem ../3rdparty/boost-1.53.0 -I../3rdparty/elfio-3.2 -I../3rdparty/glog-0.3.3/src -I../3rdparty/leveldb-1.4/include -I../../3rdparty/libprocess/include -I../3rdparty/nvml-352.79 -I../3rdparty/picojson-1.3.0 -I../3rdparty/protobuf-2.6.1/src -I../../3rdparty/stout/include -I../3rdparty/zookeeper-3.4.8/src/c/include -I../3rdparty/zookeeper-3.4.8/src/c/generated -DHAS_AUTHENTICATION=1 -DSOURCE_DIR=\"/mesos/mesos-1.2.0/_build/..\" -DBUILD_DIR=\"/mesos/mesos-1.2.0/_build\" -I../3rdparty/gmock-1.7.0/gtest/include -isystem ../3rdparty/gmock-1.7.0/include -DTESTLIBEXECDIR=\"/mesos/mesos-1.2.0/_inst/libexec/mesos/tests\" -DSBINDIR=\"/mesos/mesos-1.2.0/_inst/sbin\" -I/usr/lib/jvm/java-7-openjdk-amd64/include -I/usr/lib/jvm/java-7-openjdk-amd64/include/linux -DZOOKEEPER_VERSION=\"3.4.8\" -I/usr/include/subversion-1 -I/usr/include/apr-1 -I/usr/include/apr-1.0  -pthread -g1 -O0 -Wno-unused-local-typedefs -std=c++11 -MT tests/mesos_tests-cluster.o -MD -MP -MF tests/.deps/mesos_tests-cluster.Tpo -c -o tests/mesos_tests-cluster.o `test -f 'tests/cluster.cpp' || echo '../../src/'`tests/cluster.cpp
mv -f examples/.deps/disk_full_framework-disk_full_framework.Tpo examples/.deps/disk_full_framework-disk_full_framework.Po
g++ -DPACKAGE_NAME=\"mesos\" -DPACKAGE_TARNAME=\"mesos\" -DPACKAGE_VERSION=\"1.2.0\" -DPACKAGE_STRING=\"mesos\ 1.2.0\" -DPACKAGE_BUGREPORT=\"\" -DPACKAGE_URL=\"\" -DPACKAGE=\"mesos\" -DVERSION=\"1.2.0\" -DSTDC_HEADERS=1 -DHAVE_SYS_TYPES_H=1 -DHAVE_SYS_STAT_H=1 -DHAVE_STDLIB_H=1 -DHAVE_STRING_H=1 -DHAVE_MEMORY_H=1 -DHAVE_STRINGS_H=1 -DHAVE_INTTYPES_H=1 -DHAVE_STDINT_H=1 -DHAVE_UNISTD_H=1 -DHAVE_DLFCN_H=1 -DLT_OBJDIR=\".libs/\" -DHAVE_CXX11=1 -DHAVE_PTHREAD_PRIO_INHERIT=1 -DHAVE_PTHREAD=1 -DHAVE_LIBZ=1 -DHAVE_FTS_H=1 -DHAVE_APR_POOLS_H=1 -DHAVE_LIBAPR_1=1 -DHAVE_LIBCURL=1 -DMESOS_HAS_JAVA=1 -DHAVE_LIBSASL2=1 -DHAVE_SVN_VERSION_H=1 -DHAVE_LIBSVN_SUBR_1=1 -DHAVE_SVN_DELTA_H=1 -DHAVE_LIBSVN_DELTA_1=1 -DHAVE_LIBZ=1 -DHAVE_PYTHON=\"2.7\" -DMESOS_HAS_PYTHON=1 -I. -I../../src   -Wall -Werror -Wsign-compare -DLIBDIR=\"/mesos/mesos-1.2.0/_inst/lib\" -DPKGLIBEXECDIR=\"/mesos/mesos-1.2.0/_inst/libexec/mesos\" -DPKGDATADIR=\"/mesos/mesos-1.2.0/_inst/share/mesos\" -DPKGMODULEDIR=\"/mesos/mesos-1.2.0/_inst/lib/mesos/modules\" -I../../include -I../include -I../include/mesos -DPICOJSON_USE_INT64 -D__STDC_FORMAT_MACROS -isystem ../3rdparty/boost-1.53.0 -I../3rdparty/elfio-3.2 -I../3rdparty/glog-0.3.3/src -I../3rdparty/leveldb-1.4/include -I../../3rdparty/libprocess/include -I../3rdparty/nvml-352.79 -I../3rdparty/picojson-1.3.0 -I../3rdparty/protobuf-2.6.1/src -I../../3rdparty/stout/include -I../3rdparty/zookeeper-3.4.8/src/c/include -I../3rdparty/zookeeper-3.4.8/src/c/generated -DHAS_AUTHENTICATION=1 -DSOURCE_DIR=\"/mesos/mesos-1.2.0/_build/..\" -DBUILD_DIR=\"/mesos/mesos-1.2.0/_build\" -I../3rdparty/gmock-1.7.0/gtest/include -isystem ../3rdparty/gmock-1.7.0/include -DTESTLIBEXECDIR=\"/mesos/mesos-1.2.0/_inst/libexec/mesos/tests\" -DSBINDIR=\"/mesos/mesos-1.2.0/_inst/sbin\" -I/usr/lib/jvm/java-7-openjdk-amd64/include -I/usr/lib/jvm/java-7-openjdk-amd64/include/linux -DZOOKEEPER_VERSION=\"3.4.8\" -I/usr/include/subversion-1 -I/usr/include/apr-1 -I/usr/include/apr-1.0  -pthread -g1 -O0 -Wno-unused-local-typedefs -std=c++11 -MT tests/mesos_tests-command_executor_tests.o -MD -MP -MF tests/.deps/mesos_tests-command_executor_tests.Tpo -c -o tests/mesos_tests-command_executor_tests.o `test -f 'tests/command_executor_tests.cpp' || echo '../../src/'`tests/command_executor_tests.cpp
mv -f tests/.deps/mesos_tests-anonymous_tests.Tpo tests/.deps/mesos_tests-anonymous_tests.Po
g++ -DPACKAGE_NAME=\"mesos\" -DPACKAGE_TARNAME=\"mesos\" -DPACKAGE_VERSION=\"1.2.0\" -DPACKAGE_STRING=\"mesos\ 1.2.0\" -DPACKAGE_BUGREPORT=\"\" -DPACKAGE_URL=\"\" -DPACKAGE=\"mesos\" -DVERSION=\"1.2.0\" -DSTDC_HEADERS=1 -DHAVE_SYS_TYPES_H=1 -DHAVE_SYS_STAT_H=1 -DHAVE_STDLIB_H=1 -DHAVE_STRING_H=1 -DHAVE_MEMORY_H=1 -DHAVE_STRINGS_H=1 -DHAVE_INTTYPES_H=1 -DHAVE_STDINT_H=1 -DHAVE_UNISTD_H=1 -DHAVE_DLFCN_H=1 -DLT_OBJDIR=\".libs/\" -DHAVE_CXX11=1 -DHAVE_PTHREAD_PRIO_INHERIT=1 -DHAVE_PTHREAD=1 -DHAVE_LIBZ=1 -DHAVE_FTS_H=1 -DHAVE_APR_POOLS_H=1 -DHAVE_LIBAPR_1=1 -DHAVE_LIBCURL=1 -DMESOS_HAS_JAVA=1 -DHAVE_LIBSASL2=1 -DHAVE_SVN_VERSION_H=1 -DHAVE_LIBSVN_SUBR_1=1 -DHAVE_SVN_DELTA_H=1 -DHAVE_LIBSVN_DELTA_1=1 -DHAVE_LIBZ=1 -DHAVE_PYTHON=\"2.7\" -DMESOS_HAS_PYTHON=1 -I. -I../../src   -Wall -Werror -Wsign-compare -DLIBDIR=\"/mesos/mesos-1.2.0/_inst/lib\" -DPKGLIBEXECDIR=\"/mesos/mesos-1.2.0/_inst/libexec/mesos\" -DPKGDATADIR=\"/mesos/mesos-1.2.0/_inst/share/mesos\" -DPKGMODULEDIR=\"/mesos/mesos-1.2.0/_inst/lib/mesos/modules\" -I../../include -I../include -I../include/mesos -DPICOJSON_USE_INT64 -D__STDC_FORMAT_MACROS -isystem ../3rdparty/boost-1.53.0 -I../3rdparty/elfio-3.2 -I../3rdparty/glog-0.3.3/src -I../3rdparty/leveldb-1.4/include -I../../3rdparty/libprocess/include -I../3rdparty/nvml-352.79 -I../3rdparty/picojson-1.3.0 -I../3rdparty/protobuf-2.6.1/src -I../../3rdparty/stout/include -I../3rdparty/zookeeper-3.4.8/src/c/include -I../3rdparty/zookeeper-3.4.8/src/c/generated -DHAS_AUTHENTICATION=1 -DSOURCE_DIR=\"/mesos/mesos-1.2.0/_build/..\" -DBUILD_DIR=\"/mesos/mesos-1.2.0/_build\" -I../3rdparty/gmock-1.7.0/gtest/include -isystem ../3rdparty/gmock-1.7.0/include -DTESTLIBEXECDIR=\"/mesos/mesos-1.2.0/_inst/libexec/mesos/tests\" -DSBINDIR=\"/mesos/mesos-1.2.0/_inst/sbin\" -I/usr/lib/jvm/java-7-openjdk-amd64/include -I/usr/lib/jvm/java-7-openjdk-amd64/include/linux -DZOOKEEPER_VERSION=\"3.4.8\" -I/usr/include/subversion-1 -I/usr/include/apr-1 -I/usr/include/apr-1.0  -pthread -g1 -O0 -Wno-unused-local-typedefs -std=c++11 -MT tests/mesos_tests-container_logger_tests.o -MD -MP -MF tests/.deps/mesos_tests-container_logger_tests.Tpo -c -o tests/mesos_tests-container_logger_tests.o `test -f 'tests/container_logger_tests.cpp' || echo '../../src/'`tests/container_logger_tests.cpp
mv -f tests/.deps/mesos_tests-authorization_tests.Tpo tests/.deps/mesos_tests-authorization_tests.Po
g++ -DPACKAGE_NAME=\"mesos\" -DPACKAGE_TARNAME=\"mesos\" -DPACKAGE_VERSION=\"1.2.0\" -DPACKAGE_STRING=\"mesos\ 1.2.0\" -DPACKAGE_BUGREPORT=\"\" -DPACKAGE_URL=\"\" -DPACKAGE=\"mesos\" -DVERSION=\"1.2.0\" -DSTDC_HEADERS=1 -DHAVE_SYS_TYPES_H=1 -DHAVE_SYS_STAT_H=1 -DHAVE_STDLIB_H=1 -DHAVE_STRING_H=1 -DHAVE_MEMORY_H=1 -DHAVE_STRINGS_H=1 -DHAVE_INTTYPES_H=1 -DHAVE_STDINT_H=1 -DHAVE_UNISTD_H=1 -DHAVE_DLFCN_H=1 -DLT_OBJDIR=\".libs/\" -DHAVE_CXX11=1 -DHAVE_PTHREAD_PRIO_INHERIT=1 -DHAVE_PTHREAD=1 -DHAVE_LIBZ=1 -DHAVE_FTS_H=1 -DHAVE_APR_POOLS_H=1 -DHAVE_LIBAPR_1=1 -DHAVE_LIBCURL=1 -DMESOS_HAS_JAVA=1 -DHAVE_LIBSASL2=1 -DHAVE_SVN_VERSION_H=1 -DHAVE_LIBSVN_SUBR_1=1 -DHAVE_SVN_DELTA_H=1 -DHAVE_LIBSVN_DELTA_1=1 -DHAVE_LIBZ=1 -DHAVE_PYTHON=\"2.7\" -DMESOS_HAS_PYTHON=1 -I. -I../../src   -Wall -Werror -Wsign-compare -DLIBDIR=\"/mesos/mesos-1.2.0/_inst/lib\" -DPKGLIBEXECDIR=\"/mesos/mesos-1.2.0/_inst/libexec/mesos\" -DPKGDATADIR=\"/mesos/mesos-1.2.0/_inst/share/mesos\" -DPKGMODULEDIR=\"/mesos/mesos-1.2.0/_inst/lib/mesos/modules\" -I../../include -I../include -I../include/mesos -DPICOJSON_USE_INT64 -D__STDC_FORMAT_MACROS -isystem ../3rdparty/boost-1.53.0 -I../3rdparty/elfio-3.2 -I../3rdparty/glog-0.3.3/src -I../3rdparty/leveldb-1.4/include -I../../3rdparty/libprocess/include -I../3rdparty/nvml-352.79 -I../3rdparty/picojson-1.3.0 -I../3rdparty/protobuf-2.6.1/src -I../../3rdparty/stout/include -I../3rdparty/zookeeper-3.4.8/src/c/include -I../3rdparty/zookeeper-3.4.8/src/c/generated -DHAS_AUTHENTICATION=1 -DSOURCE_DIR=\"/mesos/mesos-1.2.0/_build/..\" -DBUILD_DIR=\"/mesos/mesos-1.2.0/_build\" -I../3rdparty/gmock-1.7.0/gtest/include -isystem ../3rdparty/gmock-1.7.0/include -DTESTLIBEXECDIR=\"/mesos/mesos-1.2.0/_inst/libexec/mesos/tests\" -DSBINDIR=\"/mesos/mesos-1.2.0/_inst/sbin\" -I/usr/lib/jvm/java-7-openjdk-amd64/include -I/usr/lib/jvm/java-7-openjdk-amd64/include/linux -DZOOKEEPER_VERSION=\"3.4.8\" -I/usr/include/subversion-1 -I/usr/include/apr-1 -I/usr/include/apr-1.0  -pthread -g1 -O0 -Wno-unused-local-typedefs -std=c++11 -MT tests/mesos_tests-containerizer.o -MD -MP -MF tests/.deps/mesos_tests-containerizer.Tpo -c -o tests/mesos_tests-containerizer.o `test -f 'tests/containerizer.cpp' || echo '../../src/'`tests/containerizer.cpp
mv -f tests/.deps/mesos_tests-cluster.Tpo tests/.deps/mesos_tests-cluster.Po
g++ -DPACKAGE_NAME=\"mesos\" -DPACKAGE_TARNAME=\"mesos\" -DPACKAGE_VERSION=\"1.2.0\" -DPACKAGE_STRING=\"mesos\ 1.2.0\" -DPACKAGE_BUGREPORT=\"\" -DPACKAGE_URL=\"\" -DPACKAGE=\"mesos\" -DVERSION=\"1.2.0\" -DSTDC_HEADERS=1 -DHAVE_SYS_TYPES_H=1 -DHAVE_SYS_STAT_H=1 -DHAVE_STDLIB_H=1 -DHAVE_STRING_H=1 -DHAVE_MEMORY_H=1 -DHAVE_STRINGS_H=1 -DHAVE_INTTYPES_H=1 -DHAVE_STDINT_H=1 -DHAVE_UNISTD_H=1 -DHAVE_DLFCN_H=1 -DLT_OBJDIR=\".libs/\" -DHAVE_CXX11=1 -DHAVE_PTHREAD_PRIO_INHERIT=1 -DHAVE_PTHREAD=1 -DHAVE_LIBZ=1 -DHAVE_FTS_H=1 -DHAVE_APR_POOLS_H=1 -DHAVE_LIBAPR_1=1 -DHAVE_LIBCURL=1 -DMESOS_HAS_JAVA=1 -DHAVE_LIBSASL2=1 -DHAVE_SVN_VERSION_H=1 -DHAVE_LIBSVN_SUBR_1=1 -DHAVE_SVN_DELTA_H=1 -DHAVE_LIBSVN_DELTA_1=1 -DHAVE_LIBZ=1 -DHAVE_PYTHON=\"2.7\" -DMESOS_HAS_PYTHON=1 -I. -I../../src   -Wall -Werror -Wsign-compare -DLIBDIR=\"/mesos/mesos-1.2.0/_inst/lib\" -DPKGLIBEXECDIR=\"/mesos/mesos-1.2.0/_inst/libexec/mesos\" -DPKGDATADIR=\"/mesos/mesos-1.2.0/_inst/share/mesos\" -DPKGMODULEDIR=\"/mesos/mesos-1.2.0/_inst/lib/mesos/modules\" -I../../include -I../include -I../include/mesos -DPICOJSON_USE_INT64 -D__STDC_FORMAT_MACROS -isystem ../3rdparty/boost-1.53.0 -I../3rdparty/elfio-3.2 -I../3rdparty/glog-0.3.3/src -I../3rdparty/leveldb-1.4/include -I../../3rdparty/libprocess/include -I../3rdparty/nvml-352.79 -I../3rdparty/picojson-1.3.0 -I../3rdparty/protobuf-2.6.1/src -I../../3rdparty/stout/include -I../3rdparty/zookeeper-3.4.8/src/c/include -I../3rdparty/zookeeper-3.4.8/src/c/generated -DHAS_AUTHENTICATION=1 -DSOURCE_DIR=\"/mesos/mesos-1.2.0/_build/..\" -DBUILD_DIR=\"/mesos/mesos-1.2.0/_build\" -I../3rdparty/gmock-1.7.0/gtest/include -isystem ../3rdparty/gmock-1.7.0/include -DTESTLIBEXECDIR=\"/mesos/mesos-1.2.0/_inst/libexec/mesos/tests\" -DSBINDIR=\"/mesos/mesos-1.2.0/_inst/sbin\" -I/usr/lib/jvm/java-7-openjdk-amd64/include -I/usr/lib/jvm/java-7-openjdk-amd64/include/linux -DZOOKEEPER_VERSION=\"3.4.8\" -I/usr/include/subversion-1 -I/usr/include/apr-1 -I/usr/include/apr-1.0  -pthread -g1 -O0 -Wno-unused-local-typedefs -std=c++11 -MT tests/mesos_tests-cram_md5_authentication_tests.o -MD -MP -MF tests/.deps/mesos_tests-cram_md5_authentication_tests.Tpo -c -o tests/mesos_tests-cram_md5_authentication_tests.o `test -f 'tests/cram_md5_authentication_tests.cpp' || echo '../../src/'`tests/cram_md5_authentication_tests.cpp
mv -f tests/.deps/mesos_tests-authentication_tests.Tpo tests/.deps/mesos_tests-authentication_tests.Po
g++ -DPACKAGE_NAME=\"mesos\" -DPACKAGE_TARNAME=\"mesos\" -DPACKAGE_VERSION=\"1.2.0\" -DPACKAGE_STRING=\"mesos\ 1.2.0\" -DPACKAGE_BUGREPORT=\"\" -DPACKAGE_URL=\"\" -DPACKAGE=\"mesos\" -DVERSION=\"1.2.0\" -DSTDC_HEADERS=1 -DHAVE_SYS_TYPES_H=1 -DHAVE_SYS_STAT_H=1 -DHAVE_STDLIB_H=1 -DHAVE_STRING_H=1 -DHAVE_MEMORY_H=1 -DHAVE_STRINGS_H=1 -DHAVE_INTTYPES_H=1 -DHAVE_STDINT_H=1 -DHAVE_UNISTD_H=1 -DHAVE_DLFCN_H=1 -DLT_OBJDIR=\".libs/\" -DHAVE_CXX11=1 -DHAVE_PTHREAD_PRIO_INHERIT=1 -DHAVE_PTHREAD=1 -DHAVE_LIBZ=1 -DHAVE_FTS_H=1 -DHAVE_APR_POOLS_H=1 -DHAVE_LIBAPR_1=1 -DHAVE_LIBCURL=1 -DMESOS_HAS_JAVA=1 -DHAVE_LIBSASL2=1 -DHAVE_SVN_VERSION_H=1 -DHAVE_LIBSVN_SUBR_1=1 -DHAVE_SVN_DELTA_H=1 -DHAVE_LIBSVN_DELTA_1=1 -DHAVE_LIBZ=1 -DHAVE_PYTHON=\"2.7\" -DMESOS_HAS_PYTHON=1 -I. -I../../src   -Wall -Werror -Wsign-compare -DLIBDIR=\"/mesos/mesos-1.2.0/_inst/lib\" -DPKGLIBEXECDIR=\"/mesos/mesos-1.2.0/_inst/libexec/mesos\" -DPKGDATADIR=\"/mesos/mesos-1.2.0/_inst/share/mesos\" -DPKGMODULEDIR=\"/mesos/mesos-1.2.0/_inst/lib/mesos/modules\" -I../../include -I../include -I../include/mesos -DPICOJSON_USE_INT64 -D__STDC_FORMAT_MACROS -isystem ../3rdparty/boost-1.53.0 -I../3rdparty/elfio-3.2 -I../3rdparty/glog-0.3.3/src -I../3rdparty/leveldb-1.4/include -I../../3rdparty/libprocess/include -I../3rdparty/nvml-352.79 -I../3rdparty/picojson-1.3.0 -I../3rdparty/protobuf-2.6.1/src -I../../3rdparty/stout/include -I../3rdparty/zookeeper-3.4.8/src/c/include -I../3rdparty/zookeeper-3.4.8/src/c/generated -DHAS_AUTHENTICATION=1 -DSOURCE_DIR=\"/mesos/mesos-1.2.0/_build/..\" -DBUILD_DIR=\"/mesos/mesos-1.2.0/_build\" -I../3rdparty/gmock-1.7.0/gtest/include -isystem ../3rdparty/gmock-1.7.0/include -DTESTLIBEXECDIR=\"/mesos/mesos-1.2.0/_inst/libexec/mesos/tests\" -DSBINDIR=\"/mesos/mesos-1.2.0/_inst/sbin\" -I/usr/lib/jvm/java-7-openjdk-amd64/include -I/usr/lib/jvm/java-7-openjdk-amd64/include/linux -DZOOKEEPER_VERSION=\"3.4.8\" -I/usr/include/subversion-1 -I/usr/include/apr-1 -I/usr/include/apr-1.0  -pthread -g1 -O0 -Wno-unused-local-typedefs -std=c++11 -MT tests/mesos_tests-credentials_tests.o -MD -MP -MF tests/.deps/mesos_tests-credentials_tests.Tpo -c -o tests/mesos_tests-credentials_tests.o `test -f 'tests/credentials_tests.cpp' || echo '../../src/'`tests/credentials_tests.cpp
mv -f tests/.deps/mesos_tests-command_executor_tests.Tpo tests/.deps/mesos_tests-command_executor_tests.Po
g++ -DPACKAGE_NAME=\"mesos\" -DPACKAGE_TARNAME=\"mesos\" -DPACKAGE_VERSION=\"1.2.0\" -DPACKAGE_STRING=\"mesos\ 1.2.0\" -DPACKAGE_BUGREPORT=\"\" -DPACKAGE_URL=\"\" -DPACKAGE=\"mesos\" -DVERSION=\"1.2.0\" -DSTDC_HEADERS=1 -DHAVE_SYS_TYPES_H=1 -DHAVE_SYS_STAT_H=1 -DHAVE_STDLIB_H=1 -DHAVE_STRING_H=1 -DHAVE_MEMORY_H=1 -DHAVE_STRINGS_H=1 -DHAVE_INTTYPES_H=1 -DHAVE_STDINT_H=1 -DHAVE_UNISTD_H=1 -DHAVE_DLFCN_H=1 -DLT_OBJDIR=\".libs/\" -DHAVE_CXX11=1 -DHAVE_PTHREAD_PRIO_INHERIT=1 -DHAVE_PTHREAD=1 -DHAVE_LIBZ=1 -DHAVE_FTS_H=1 -DHAVE_APR_POOLS_H=1 -DHAVE_LIBAPR_1=1 -DHAVE_LIBCURL=1 -DMESOS_HAS_JAVA=1 -DHAVE_LIBSASL2=1 -DHAVE_SVN_VERSION_H=1 -DHAVE_LIBSVN_SUBR_1=1 -DHAVE_SVN_DELTA_H=1 -DHAVE_LIBSVN_DELTA_1=1 -DHAVE_LIBZ=1 -DHAVE_PYTHON=\"2.7\" -DMESOS_HAS_PYTHON=1 -I. -I../../src   -Wall -Werror -Wsign-compare -DLIBDIR=\"/mesos/mesos-1.2.0/_inst/lib\" -DPKGLIBEXECDIR=\"/mesos/mesos-1.2.0/_inst/libexec/mesos\" -DPKGDATADIR=\"/mesos/mesos-1.2.0/_inst/share/mesos\" -DPKGMODULEDIR=\"/mesos/mesos-1.2.0/_inst/lib/mesos/modules\" -I../../include -I../include -I../include/mesos -DPICOJSON_USE_INT64 -D__STDC_FORMAT_MACROS -isystem ../3rdparty/boost-1.53.0 -I../3rdparty/elfio-3.2 -I../3rdparty/glog-0.3.3/src -I../3rdparty/leveldb-1.4/include -I../../3rdparty/libprocess/include -I../3rdparty/nvml-352.79 -I../3rdparty/picojson-1.3.0 -I../3rdparty/protobuf-2.6.1/src -I../../3rdparty/stout/include -I../3rdparty/zookeeper-3.4.8/src/c/include -I../3rdparty/zookeeper-3.4.8/src/c/generated -DHAS_AUTHENTICATION=1 -DSOURCE_DIR=\"/mesos/mesos-1.2.0/_build/..\" -DBUILD_DIR=\"/mesos/mesos-1.2.0/_build\" -I../3rdparty/gmock-1.7.0/gtest/include -isystem ../3rdparty/gmock-1.7.0/include -DTESTLIBEXECDIR=\"/mesos/mesos-1.2.0/_inst/libexec/mesos/tests\" -DSBINDIR=\"/mesos/mesos-1.2.0/_inst/sbin\" -I/usr/lib/jvm/java-7-openjdk-amd64/include -I/usr/lib/jvm/java-7-openjdk-amd64/include/linux -DZOOKEEPER_VERSION=\"3.4.8\" -I/usr/include/subversion-1 -I/usr/include/apr-1 -I/usr/include/apr-1.0  -pthread -g1 -O0 -Wno-unused-local-typedefs -std=c++11 -MT tests/mesos_tests-default_executor_tests.o -MD -MP -MF tests/.deps/mesos_tests-default_executor_tests.Tpo -c -o tests/mesos_tests-default_executor_tests.o `test -f 'tests/default_executor_tests.cpp' || echo '../../src/'`tests/default_executor_tests.cpp
g++: internal compiler error: Killed (program cc1plus)
Please submit a full bug report,
with preprocessed source if appropriate.
See <file:///usr/share/doc/gcc-4.8/README.Bugs> for instructions.
make[4]: *** [tests/mesos_tests-api_tests.o] Error 4
make[4]: *** Waiting for unfinished jobs....
mv -f tests/.deps/mesos_tests-container_logger_tests.Tpo tests/.deps/mesos_tests-container_logger_tests.Po
mv -f tests/.deps/mesos_tests-cram_md5_authentication_tests.Tpo tests/.deps/mesos_tests-cram_md5_authentication_tests.Po
mv -f tests/.deps/mesos_tests-credentials_tests.Tpo tests/.deps/mesos_tests-credentials_tests.Po
mv -f tests/.deps/mesos_tests-containerizer.Tpo tests/.deps/mesos_tests-containerizer.Po
mv -f tests/.deps/mesos_tests-default_executor_tests.Tpo tests/.deps/mesos_tests-default_executor_tests.Po
make[4]: Leaving directory `/mesos/mesos-1.2.0/_build/src'
make[3]: *** [check-am] Error 2
make[3]: Leaving directory `/mesos/mesos-1.2.0/_build/src'
make[2]: *** [check] Error 2
make[2]: Leaving directory `/mesos/mesos-1.2.0/_build/src'
make[1]: *** [check-recursive] Error 1
make[1]: Leaving directory `/mesos/mesos-1.2.0/_build'
make: *** [distcheck] Error 1
+ docker rmi mesos-1478499172-23140
Untagged: mesos-1478499172-23140:latest
Deleted: sha256:203685244784b641116c5131cfc6b666a1d801b8b22a4e28007f0bd7173b9b72
Deleted: sha256:e0f39c9a9d01057ffd952c391789cfba226f11a84423776cb1ab8395a4744c3d
Deleted: sha256:5064fee6f657df8dc7745ca4c6f04cd42089d2ab6ed1f8ded45140d2b909002b
Deleted: sha256:b9c1201615c382a35457e166730afd53d371551cb11c57212ccdf61a63e0e5ed
Deleted: sha256:7a484ae697d61098cbb8aa9365907af0f05fb238ba554180cfc915269cdf84f7
Deleted: sha256:a5690a91acb12a8ac94d0d16869014061dfa3a36de261d0ea0a3b2e2c315b076
Deleted: sha256:a9b3a7f9669ab109297b36c1dcfbb0318e247c0bd152c70c0c569bfcc958b163
Deleted: sha256:6acc4f649a39bfc6032fc48b68e1ef4234dc6ca2a1759652bff9ccbe25bc3411
Deleted: sha256:1f79ce9d42363cccf721e3512be287800c492cfef1be627eef79c3087d656caa
Deleted: sha256:0dc8c87377320cc0b745f4f81d56a643e1d580dc43f1364004745b353d3435bf
Deleted: sha256:1448293ba853f3201f32e2edc2bb83645e906d09a53174973d83a6538f4cea11
Deleted: sha256:e523af565e8ca3204c9d3397f6fe26d72a4f89d2acd7c16f9357e1aaca59eab8
Deleted: sha256:4dbc62d2abf52087e36e576d8aa20cc775ce66c9a1ff908578d52a3bc5bf0c2a
Deleted: sha256:965853f523abbb59109ecfb6ca1bcaf8aa4fcb487ead193278c9b151742995b5
Deleted: sha256:b068e6ae95e9d7af7d40673799e1bf7496ab9bfb5887b6424aa8476dc397263e
Deleted: sha256:1b3eaed968efd5a58ac882919f1e7e7df4e9d2bf30a90cb92e75e4020f42b02d
Deleted: sha256:4663c0eb86a0663d782b5bfd4fd8eb26df43ed7f32c7744ff0e13ef6d350ed30
Deleted: sha256:bfe82e3eff8fb259249f0f53804407ad7e66ced51c79e925a3fc7b01b0a68269
Deleted: sha256:1b28e5b129774b8047f70749bd34fd15cd5a051262a134f79696790226d3b425
Deleted: sha256:8fa066e5a45ccc6fc735050045bbe4344d5ec3f59ba32127c4229874b12fcb2d
Deleted: sha256:e141ba9536bf64d051ca2f17c9740eed6c8d9804ce64eff54eb1df24df489345
Deleted: sha256:ae58193f21480c6acd0a7625d9b860a6a5b962dc92ca8c78c0e756d6701948d9
Deleted: sha256:01bcc652c205eec649246bcea0e3e2920cd91cab05f67d8ab01f1d801bc46026
Deleted: sha256:00c10aed4feef7505479808ce356a1064e9687b9ca5a6fcbc91a6499d968822e
Build step 'Execute shell' marked build as failure

Mime
View raw message