mesos-builds mailing list archives

Site index · List index
Message view « Date » · « Thread »
Top « Date » · « Thread »
From Apache Jenkins Server <jenk...@builds.apache.org>
Subject Build failed in Jenkins: Mesos » autotools,clang,--verbose --enable-libevent --enable-ssl,GLOG_v=1 MESOS_VERBOSE=1,ubuntu:14.04,(docker||Hadoop)&&(!ubuntu-us1)&&(!ubuntu-6)&&(!ubuntu-eu2) #2928
Date Tue, 15 Nov 2016 19:53:59 GMT
See <https://builds.apache.org/job/Mesos/BUILDTOOL=autotools,COMPILER=clang,CONFIGURATION=--verbose%20--enable-libevent%20--enable-ssl,ENVIRONMENT=GLOG_v=1%20MESOS_VERBOSE=1,OS=ubuntu%3A14.04,label_exp=(docker%7C%7CHadoop)&&(!ubuntu-us1)&&(!ubuntu-6)&&(!ubuntu-eu2)/2928/changes>

Changes:

[toenshoff] Added Mesos 1.1.0 release blog post.

[toenshoff] Updated releases.yml for Mesos 1.1.0.

------------------------------------------
[...truncated 222797 lines...]
I1115 19:50:09.376428 29352 containerizer.cpp:202] Using isolation: posix/cpu,posix/mem,filesystem/posix,network/cni
W1115 19:50:09.377007 29352 backend.cpp:76] Failed to create 'aufs' backend: AufsBackend requires
root privileges, but is running as user mesos
W1115 19:50:09.377156 29352 backend.cpp:76] Failed to create 'bind' backend: BindBackend requires
root privileges
I1115 19:50:09.379873 29383 slave.cpp:208] Mesos agent started on (644)@172.17.0.2:34552
I1115 19:50:09.379914 29383 slave.cpp:209] Flags at startup: --acls="" --appc_simple_discovery_uri_prefix="http://"
--appc_store_dir="/tmp/mesos/store/appc" --authenticate_http_readonly="true" --authenticate_http_readwrite="true"
--authenticatee="crammd5" --authentication_backoff_factor="1secs" --authorizer="local" --cgroups_cpu_enable_pids_and_tids_count="false"
--cgroups_enable_cfs="false" --cgroups_hierarchy="/sys/fs/cgroup" --cgroups_limit_swap="false"
--cgroups_root="mesos" --container_disk_watch_interval="15secs" --containerizers="mesos" --credential="/tmp/Endpoint_SlaveEndpointTest_AuthorizedRequest_1_B3iQ6e/credential"
--default_role="*" --disk_watch_interval="1mins" --docker="docker" --docker_kill_orphans="true"
--docker_registry="https://registry-1.docker.io" --docker_remove_delay="6hrs" --docker_socket="/var/run/docker.sock"
--docker_stop_timeout="0ns" --docker_store_dir="/tmp/mesos/store/docker" --docker_volume_checkpoint_dir="/var/run/mesos/isolators/docker/volume"
--enforce_container_disk_quota="false" --executor_registration_timeout="1mins" --executor_shutdown_grace_period="5secs"
--fetcher_cache_dir="/tmp/Endpoint_SlaveEndpointTest_AuthorizedRequest_1_B3iQ6e/fetch" --fetcher_cache_size="2GB"
--frameworks_home="" --gc_delay="1weeks" --gc_disk_headroom="0.1" --hadoop_home="" --help="false"
--hostname_lookup="true" --http_authenticators="basic" --http_command_executor="false" --http_credentials="/tmp/Endpoint_SlaveEndpointTest_AuthorizedRequest_1_B3iQ6e/http_credentials"
--image_provisioner_backend="copy" --initialize_driver_logging="true" --isolation="posix/cpu,posix/mem"
--launcher="posix" --launcher_dir="/mesos/mesos-1.2.0/_build/src" --logbufsecs="0" --logging_level="INFO"
--max_completed_executors_per_framework="150" --oversubscribed_resources_interval="15secs"
--perf_duration="10secs" --perf_interval="1mins" --qos_correction_interval_min="0ns" --quiet="false"
--recover="reconnect" --recovery_timeout="15mins" --registration_backoff_factor="10ms" --resources="cpus:2;gpus:0;mem:1024;disk:1024;ports:[31000-32000]"
--revocable_cpu_low_priority="true" --runtime_dir="/tmp/Endpoint_SlaveEndpointTest_AuthorizedRequest_1_B3iQ6e"
--sandbox_directory="/mnt/mesos/sandbox" --strict="true" --switch_user="true" --systemd_enable_support="true"
--systemd_runtime_directory="/run/systemd/system" --version="false" --work_dir="/tmp/Endpoint_SlaveEndpointTest_AuthorizedRequest_1_9Y1L4Y"
I1115 19:50:09.380880 29383 credentials.hpp:86] Loading credential for authentication from
'/tmp/Endpoint_SlaveEndpointTest_AuthorizedRequest_1_B3iQ6e/credential'
I1115 19:50:09.381124 29383 slave.cpp:346] Agent using credential for: test-principal
I1115 19:50:09.381162 29383 credentials.hpp:37] Loading credentials for authentication from
'/tmp/Endpoint_SlaveEndpointTest_AuthorizedRequest_1_B3iQ6e/http_credentials'
I1115 19:50:09.381525 29383 http.cpp:895] Using default 'basic' HTTP authenticator for realm
'mesos-agent-readonly'
I1115 19:50:09.381708 29383 http.cpp:895] Using default 'basic' HTTP authenticator for realm
'mesos-agent-readwrite'
I1115 19:50:09.383352 29383 slave.cpp:533] Agent resources: cpus(*):2; mem(*):1024; disk(*):1024;
ports(*):[31000-32000]
I1115 19:50:09.383447 29383 slave.cpp:541] Agent attributes: [  ]
I1115 19:50:09.383471 29383 slave.cpp:546] Agent hostname: 5558e43bf859
I1115 19:50:09.385063 29384 state.cpp:57] Recovering state from '/tmp/Endpoint_SlaveEndpointTest_AuthorizedRequest_1_9Y1L4Y/meta'
I1115 19:50:09.385360 29380 status_update_manager.cpp:203] Recovering status update manager
I1115 19:50:09.385565 29383 containerizer.cpp:561] Recovering containerizer
I1115 19:50:09.386783 29371 provisioner.cpp:253] Provisioner recovery complete
I1115 19:50:09.387228 29372 slave.cpp:5411] Finished recovery
I1115 19:50:09.387709 29372 slave.cpp:5585] Querying resource estimator for oversubscribable
resources
I1115 19:50:09.387929 29384 slave.cpp:5599] Received oversubscribable resources {} from the
resource estimator
I1115 19:50:09.389338 29381 process.cpp:3570] Handling HTTP event for process 'slave(644)'
with path: '/slave(644)/monitor/statistics.json'
I1115 19:50:09.390053 29377 http.cpp:847] Authorizing principal 'test-principal' to GET the
'/monitor/statistics.json' endpoint
I1115 19:50:09.392823 29380 slave.cpp:787] Agent terminating
[       OK ] Endpoint/SlaveEndpointTest.AuthorizedRequest/1 (25 ms)
[ RUN      ] Endpoint/SlaveEndpointTest.AuthorizedRequest/2
I1115 19:50:09.402277 29352 containerizer.cpp:202] Using isolation: posix/cpu,posix/mem,filesystem/posix,network/cni
W1115 19:50:09.402986 29352 backend.cpp:76] Failed to create 'aufs' backend: AufsBackend requires
root privileges, but is running as user mesos
W1115 19:50:09.403159 29352 backend.cpp:76] Failed to create 'bind' backend: BindBackend requires
root privileges
I1115 19:50:09.406389 29372 slave.cpp:208] Mesos agent started on (645)@172.17.0.2:34552
I1115 19:50:09.406431 29372 slave.cpp:209] Flags at startup: --acls="" --appc_simple_discovery_uri_prefix="http://"
--appc_store_dir="/tmp/mesos/store/appc" --authenticate_http_readonly="true" --authenticate_http_readwrite="true"
--authenticatee="crammd5" --authentication_backoff_factor="1secs" --authorizer="local" --cgroups_cpu_enable_pids_and_tids_count="false"
--cgroups_enable_cfs="false" --cgroups_hierarchy="/sys/fs/cgroup" --cgroups_limit_swap="false"
--cgroups_root="mesos" --container_disk_watch_interval="15secs" --containerizers="mesos" --credential="/tmp/Endpoint_SlaveEndpointTest_AuthorizedRequest_2_R8tIth/credential"
--default_role="*" --disk_watch_interval="1mins" --docker="docker" --docker_kill_orphans="true"
--docker_registry="https://registry-1.docker.io" --docker_remove_delay="6hrs" --docker_socket="/var/run/docker.sock"
--docker_stop_timeout="0ns" --docker_store_dir="/tmp/mesos/store/docker" --docker_volume_checkpoint_dir="/var/run/mesos/isolators/docker/volume"
--enforce_container_disk_quota="false" --executor_registration_timeout="1mins" --executor_shutdown_grace_period="5secs"
--fetcher_cache_dir="/tmp/Endpoint_SlaveEndpointTest_AuthorizedRequest_2_R8tIth/fetch" --fetcher_cache_size="2GB"
--frameworks_home="" --gc_delay="1weeks" --gc_disk_headroom="0.1" --hadoop_home="" --help="false"
--hostname_lookup="true" --http_authenticators="basic" --http_command_executor="false" --http_credentials="/tmp/Endpoint_SlaveEndpointTest_AuthorizedRequest_2_R8tIth/http_credentials"
--image_provisioner_backend="copy" --initialize_driver_logging="true" --isolation="posix/cpu,posix/mem"
--launcher="posix" --launcher_dir="/mesos/mesos-1.2.0/_build/src" --logbufsecs="0" --logging_level="INFO"
--max_completed_executors_per_framework="150" --oversubscribed_resources_interval="15secs"
--perf_duration="10secs" --perf_interval="1mins" --qos_correction_interval_min="0ns" --quiet="false"
--recover="reconnect" --recovery_timeout="15mins" --registration_backoff_factor="10ms" --resources="cpus:2;gpus:0;mem:1024;disk:1024;ports:[31000-32000]"
--revocable_cpu_low_priority="true" --runtime_dir="/tmp/Endpoint_SlaveEndpointTest_AuthorizedRequest_2_R8tIth"
--sandbox_directory="/mnt/mesos/sandbox" --strict="true" --switch_user="true" --systemd_enable_support="true"
--systemd_runtime_directory="/run/systemd/system" --version="false" --work_dir="/tmp/Endpoint_SlaveEndpointTest_AuthorizedRequest_2_XMbqn1"
I1115 19:50:09.406882 29372 credentials.hpp:86] Loading credential for authentication from
'/tmp/Endpoint_SlaveEndpointTest_AuthorizedRequest_2_R8tIth/credential'
I1115 19:50:09.407030 29372 slave.cpp:346] Agent using credential for: test-principal
I1115 19:50:09.407054 29372 credentials.hpp:37] Loading credentials for authentication from
'/tmp/Endpoint_SlaveEndpointTest_AuthorizedRequest_2_R8tIth/http_credentials'
I1115 19:50:09.407246 29372 http.cpp:895] Using default 'basic' HTTP authenticator for realm
'mesos-agent-readonly'
I1115 19:50:09.407359 29372 http.cpp:895] Using default 'basic' HTTP authenticator for realm
'mesos-agent-readwrite'
I1115 19:50:09.408398 29372 slave.cpp:533] Agent resources: cpus(*):2; mem(*):1024; disk(*):1024;
ports(*):[31000-32000]
I1115 19:50:09.408473 29372 slave.cpp:541] Agent attributes: [  ]
I1115 19:50:09.408491 29372 slave.cpp:546] Agent hostname: 5558e43bf859
I1115 19:50:09.409773 29384 state.cpp:57] Recovering state from '/tmp/Endpoint_SlaveEndpointTest_AuthorizedRequest_2_XMbqn1/meta'
I1115 19:50:09.410056 29376 status_update_manager.cpp:203] Recovering status update manager
I1115 19:50:09.410251 29370 containerizer.cpp:561] Recovering containerizer
I1115 19:50:09.411511 29375 provisioner.cpp:253] Provisioner recovery complete
I1115 19:50:09.412093 29380 slave.cpp:5411] Finished recovery
I1115 19:50:09.412606 29380 slave.cpp:5585] Querying resource estimator for oversubscribable
resources
I1115 19:50:09.412814 29371 slave.cpp:5599] Received oversubscribable resources {} from the
resource estimator
I1115 19:50:09.414186 29381 process.cpp:3570] Handling HTTP event for process 'slave(645)'
with path: '/slave(645)/containers'
I1115 19:50:09.414857 29377 http.cpp:847] Authorizing principal 'test-principal' to GET the
'/containers' endpoint
I1115 19:50:09.417507 29379 slave.cpp:787] Agent terminating
[       OK ] Endpoint/SlaveEndpointTest.AuthorizedRequest/2 (25 ms)
[ RUN      ] Endpoint/SlaveEndpointTest.UnauthorizedRequest/0
I1115 19:50:09.427985 29352 containerizer.cpp:202] Using isolation: posix/cpu,posix/mem,filesystem/posix,network/cni
W1115 19:50:09.428691 29352 backend.cpp:76] Failed to create 'aufs' backend: AufsBackend requires
root privileges, but is running as user mesos
W1115 19:50:09.428879 29352 backend.cpp:76] Failed to create 'bind' backend: BindBackend requires
root privileges
I1115 19:50:09.432457 29380 slave.cpp:208] Mesos agent started on (646)@172.17.0.2:34552
I1115 19:50:09.432507 29380 slave.cpp:209] Flags at startup: --acls="" --appc_simple_discovery_uri_prefix="http://"
--appc_store_dir="/tmp/mesos/store/appc" --authenticate_http_readonly="true" --authenticate_http_readwrite="true"
--authenticatee="crammd5" --authentication_backoff_factor="1secs" --authorizer="local" --cgroups_cpu_enable_pids_and_tids_count="false"
--cgroups_enable_cfs="false" --cgroups_hierarchy="/sys/fs/cgroup" --cgroups_limit_swap="false"
--cgroups_root="mesos" --container_disk_watch_interval="15secs" --containerizers="mesos" --credential="/tmp/Endpoint_SlaveEndpointTest_UnauthorizedRequest_0_N1Td7j/credential"
--default_role="*" --disk_watch_interval="1mins" --docker="docker" --docker_kill_orphans="true"
--docker_registry="https://registry-1.docker.io" --docker_remove_delay="6hrs" --docker_socket="/var/run/docker.sock"
--docker_stop_timeout="0ns" --docker_store_dir="/tmp/mesos/store/docker" --docker_volume_checkpoint_dir="/var/run/mesos/isolators/docker/volume"
--enforce_container_disk_quota="false" --executor_registration_timeout="1mins" --executor_shutdown_grace_period="5secs"
--fetcher_cache_dir="/tmp/Endpoint_SlaveEndpointTest_UnauthorizedRequest_0_N1Td7j/fetch" --fetcher_cache_size="2GB"
--frameworks_home="" --gc_delay="1weeks" --gc_disk_headroom="0.1" --hadoop_home="" --help="false"
--hostname_lookup="true" --http_authenticators="basic" --http_command_executor="false" --http_credentials="/tmp/Endpoint_SlaveEndpointTest_UnauthorizedRequest_0_N1Td7j/http_credentials"
--image_provisioner_backend="copy" --initialize_driver_logging="true" --isolation="posix/cpu,posix/mem"
--launcher="posix" --launcher_dir="/mesos/mesos-1.2.0/_build/src" --logbufsecs="0" --logging_level="INFO"
--max_completed_executors_per_framework="150" --oversubscribed_resources_interval="15secs"
--perf_duration="10secs" --perf_interval="1mins" --qos_correction_interval_min="0ns" --quiet="false"
--recover="reconnect" --recovery_timeout="15mins" --registration_backoff_factor="10ms" --resources="cpus:2;gpus:0;mem:1024;disk:1024;ports:[31000-32000]"
--revocable_cpu_low_priority="true" --runtime_dir="/tmp/Endpoint_SlaveEndpointTest_UnauthorizedRequest_0_N1Td7j"
--sandbox_directory="/mnt/mesos/sandbox" --strict="true" --switch_user="true" --systemd_enable_support="true"
--systemd_runtime_directory="/run/systemd/system" --version="false" --work_dir="/tmp/Endpoint_SlaveEndpointTest_UnauthorizedRequest_0_toRIW3"
I1115 19:50:09.433413 29380 credentials.hpp:86] Loading credential for authentication from
'/tmp/Endpoint_SlaveEndpointTest_UnauthorizedRequest_0_N1Td7j/credential'
I1115 19:50:09.433660 29380 slave.cpp:346] Agent using credential for: test-principal
I1115 19:50:09.433696 29380 credentials.hpp:37] Loading credentials for authentication from
'/tmp/Endpoint_SlaveEndpointTest_UnauthorizedRequest_0_N1Td7j/http_credentials'
I1115 19:50:09.433997 29380 http.cpp:895] Using default 'basic' HTTP authenticator for realm
'mesos-agent-readonly'
I1115 19:50:09.434159 29380 http.cpp:895] Using default 'basic' HTTP authenticator for realm
'mesos-agent-readwrite'
I1115 19:50:09.435423 29380 slave.cpp:533] Agent resources: cpus(*):2; mem(*):1024; disk(*):1024;
ports(*):[31000-32000]
I1115 19:50:09.435518 29380 slave.cpp:541] Agent attributes: [  ]
I1115 19:50:09.435534 29380 slave.cpp:546] Agent hostname: 5558e43bf859
I1115 19:50:09.437073 29373 state.cpp:57] Recovering state from '/tmp/Endpoint_SlaveEndpointTest_UnauthorizedRequest_0_toRIW3/meta'
I1115 19:50:09.437321 29370 status_update_manager.cpp:203] Recovering status update manager
I1115 19:50:09.437687 29375 containerizer.cpp:561] Recovering containerizer
I1115 19:50:09.439074 29372 provisioner.cpp:253] Provisioner recovery complete
I1115 19:50:09.439553 29381 slave.cpp:5411] Finished recovery
I1115 19:50:09.440115 29381 slave.cpp:5585] Querying resource estimator for oversubscribable
resources
I1115 19:50:09.440340 29379 slave.cpp:5599] Received oversubscribable resources {} from the
resource estimator
I1115 19:50:09.441897 29383 process.cpp:3570] Handling HTTP event for process 'slave(646)'
with path: '/slave(646)/monitor/statistics'
I1115 19:50:09.442795 29371 http.cpp:847] Authorizing principal 'test-principal' to GET the
'/monitor/statistics' endpoint
I1115 19:50:09.444922 29377 slave.cpp:787] Agent terminating
[       OK ] Endpoint/SlaveEndpointTest.UnauthorizedRequest/0 (27 ms)
[ RUN      ] Endpoint/SlaveEndpointTest.UnauthorizedRequest/1
I1115 19:50:09.455675 29352 containerizer.cpp:202] Using isolation: posix/cpu,posix/mem,filesystem/posix,network/cni
W1115 19:50:09.456308 29352 backend.cpp:76] Failed to create 'aufs' backend: AufsBackend requires
root privileges, but is running as user mesos
W1115 19:50:09.456434 29352 backend.cpp:76] Failed to create 'bind' backend: BindBackend requires
root privileges
I1115 19:50:09.458775 29375 slave.cpp:208] Mesos agent started on (647)@172.17.0.2:34552
I1115 19:50:09.458813 29375 slave.cpp:209] Flags at startup: --acls="" --appc_simple_discovery_uri_prefix="http://"
--appc_store_dir="/tmp/mesos/store/appc" --authenticate_http_readonly="true" --authenticate_http_readwrite="true"
--authenticatee="crammd5" --authentication_backoff_factor="1secs" --authorizer="local" --cgroups_cpu_enable_pids_and_tids_count="false"
--cgroups_enable_cfs="false" --cgroups_hierarchy="/sys/fs/cgroup" --cgroups_limit_swap="false"
--cgroups_root="mesos" --container_disk_watch_interval="15secs" --containerizers="mesos" --credential="/tmp/Endpoint_SlaveEndpointTest_UnauthorizedRequest_1_ksrC2m/credential"
--default_role="*" --disk_watch_interval="1mins" --docker="docker" --docker_kill_orphans="true"
--docker_registry="https://registry-1.docker.io" --docker_remove_delay="6hrs" --docker_socket="/var/run/docker.sock"
--docker_stop_timeout="0ns" --docker_store_dir="/tmp/mesos/store/docker" --docker_volume_checkpoint_dir="/var/run/mesos/isolators/docker/volume"
--enforce_container_disk_quota="false" --executor_registration_timeout="1mins" --executor_shutdown_grace_period="5secs"
--fetcher_cache_dir="/tmp/Endpoint_SlaveEndpointTest_UnauthorizedRequest_1_ksrC2m/fetch" --fetcher_cache_size="2GB"
--frameworks_home="" --gc_delay="1weeks" --gc_disk_headroom="0.1" --hadoop_home="" --help="false"
--hostname_lookup="true" --http_authenticators="basic" --http_command_executor="false" --http_credentials="/tmp/Endpoint_SlaveEndpointTest_UnauthorizedRequest_1_ksrC2m/http_credentials"
--image_provisioner_backend="copy" --initialize_driver_logging="true" --isolation="posix/cpu,posix/mem"
--launcher="posix" --launcher_dir="/mesos/mesos-1.2.0/_build/src" --logbufsecs="0" --logging_level="INFO"
--max_completed_executors_per_framework="150" --oversubscribed_resources_interval="15secs"
--perf_duration="10secs" --perf_interval="1mins" --qos_correction_interval_min="0ns" --quiet="false"
--recover="reconnect" --recovery_timeout="15mins" --registration_backoff_factor="10ms" --resources="cpus:2;gpus:0;mem:1024;disk:1024;ports:[31000-32000]"
--revocable_cpu_low_priority="true" --runtime_dir="/tmp/Endpoint_SlaveEndpointTest_UnauthorizedRequest_1_ksrC2m"
--sandbox_directory="/mnt/mesos/sandbox" --strict="true" --switch_user="true" --systemd_enable_support="true"
--systemd_runtime_directory="/run/systemd/system" --version="false" --work_dir="/tmp/Endpoint_SlaveEndpointTest_UnauthorizedRequest_1_acXDN6"
I1115 19:50:09.459316 29375 credentials.hpp:86] Loading credential for authentication from
'/tmp/Endpoint_SlaveEndpointTest_UnauthorizedRequest_1_ksrC2m/credential'
I1115 19:50:09.459434 29375 slave.cpp:346] Agent using credential for: test-principal
I1115 19:50:09.459452 29375 credentials.hpp:37] Loading credentials for authentication from
'/tmp/Endpoint_SlaveEndpointTest_UnauthorizedRequest_1_ksrC2m/http_credentials'
I1115 19:50:09.459631 29375 http.cpp:895] Using default 'basic' HTTP authenticator for realm
'mesos-agent-readonly'
I1115 19:50:09.459734 29375 http.cpp:895] Using default 'basic' HTTP authenticator for realm
'mesos-agent-readwrite'
I1115 19:50:09.460645 29375 slave.cpp:533] Agent resources: cpus(*):2; mem(*):1024; disk(*):1024;
ports(*):[31000-32000]
I1115 19:50:09.460721 29375 slave.cpp:541] Agent attributes: [  ]
I1115 19:50:09.460739 29375 slave.cpp:546] Agent hostname: 5558e43bf859
I1115 19:50:09.462231 29371 state.cpp:57] Recovering state from '/tmp/Endpoint_SlaveEndpointTest_UnauthorizedRequest_1_acXDN6/meta'
I1115 19:50:09.462509 29373 status_update_manager.cpp:203] Recovering status update manager
I1115 19:50:09.462726 29378 containerizer.cpp:561] Recovering containerizer
I1115 19:50:09.463801 29379 provisioner.cpp:253] Provisioner recovery complete
I1115 19:50:09.464177 29378 slave.cpp:5411] Finished recovery
I1115 19:50:09.464584 29378 slave.cpp:5585] Querying resource estimator for oversubscribable
resources
I1115 19:50:09.464785 29385 slave.cpp:5599] Received oversubscribable resources {} from the
resource estimator
I1115 19:50:09.465975 29371 process.cpp:3570] Handling HTTP event for process 'slave(647)'
with path: '/slave(647)/monitor/statistics.json'
I1115 19:50:09.466991 29370 http.cpp:847] Authorizing principal 'test-principal' to GET the
'/monitor/statistics.json' endpoint
I1115 19:50:09.469528 29374 slave.cpp:787] Agent terminating
[       OK ] Endpoint/SlaveEndpointTest.UnauthorizedRequest/1 (24 ms)
[ RUN      ] Endpoint/SlaveEndpointTest.UnauthorizedRequest/2
I1115 19:50:09.479691 29352 containerizer.cpp:202] Using isolation: posix/cpu,posix/mem,filesystem/posix,network/cni
W1115 19:50:09.480319 29352 backend.cpp:76] Failed to create 'aufs' backend: AufsBackend requires
root privileges, but is running as user mesos
W1115 19:50:09.480478 29352 backend.cpp:76] Failed to create 'bind' backend: BindBackend requires
root privileges
I1115 19:50:09.483322 29377 slave.cpp:208] Mesos agent started on (648)@172.17.0.2:34552
I1115 19:50:09.483363 29377 slave.cpp:209] Flags at startup: --acls="" --appc_simple_discovery_uri_prefix="http://"
--appc_store_dir="/tmp/mesos/store/appc" --authenticate_http_readonly="true" --authenticate_http_readwrite="true"
--authenticatee="crammd5" --authentication_backoff_factor="1secs" --authorizer="local" --cgroups_cpu_enable_pids_and_tids_count="false"
--cgroups_enable_cfs="false" --cgroups_hierarchy="/sys/fs/cgroup" --cgroups_limit_swap="false"
--cgroups_root="mesos" --container_disk_watch_interval="15secs" --containerizers="mesos" --credential="/tmp/Endpoint_SlaveEndpointTest_UnauthorizedRequest_2_EwcWdq/credential"
--default_role="*" --disk_watch_interval="1mins" --docker="docker" --docker_kill_orphans="true"
--docker_registry="https://registry-1.docker.io" --docker_remove_delay="6hrs" --docker_socket="/var/run/docker.sock"
--docker_stop_timeout="0ns" --docker_store_dir="/tmp/mesos/store/docker" --docker_volume_checkpoint_dir="/var/run/mesos/isolators/docker/volume"
--enforce_container_disk_quota="false" --executor_registration_timeout="1mins" --executor_shutdown_grace_period="5secs"
--fetcher_cache_dir="/tmp/Endpoint_SlaveEndpointTest_UnauthorizedRequest_2_EwcWdq/fetch" --fetcher_cache_size="2GB"
--frameworks_home="" --gc_delay="1weeks" --gc_disk_headroom="0.1" --hadoop_home="" --help="false"
--hostname_lookup="true" --http_authenticators="basic" --http_command_executor="false" --http_credentials="/tmp/Endpoint_SlaveEndpointTest_UnauthorizedRequest_2_EwcWdq/http_credentials"
--image_provisioner_backend="copy" --initialize_driver_logging="true" --isolation="posix/cpu,posix/mem"
--launcher="posix" --launcher_dir="/mesos/mesos-1.2.0/_build/src" --logbufsecs="0" --logging_level="INFO"
--max_completed_executors_per_framework="150" --oversubscribed_resources_interval="15secs"
--perf_duration="10secs" --perf_interval="1mins" --qos_correction_interval_min="0ns" --quiet="false"
--recover="reconnect" --recovery_timeout="15mins" --registration_backoff_factor="10ms" --resources="cpus:2;gpus:0;mem:1024;disk:1024;ports:[31000-32000]"
--revocable_cpu_low_priority="true" --runtime_dir="/tmp/Endpoint_SlaveEndpointTest_UnauthorizedRequest_2_EwcWdq"
--sandbox_directory="/mnt/mesos/sandbox" --strict="true" --switch_user="true" --systemd_enable_support="true"
--systemd_runtime_directory="/run/systemd/system" --version="false" --work_dir="/tmp/Endpoint_SlaveEndpointTest_UnauthorizedRequest_2_1wVZU9"
I1115 19:50:09.483975 29377 credentials.hpp:86] Loading credential for authentication from
'/tmp/Endpoint_SlaveEndpointTest_UnauthorizedRequest_2_EwcWdq/credential'
I1115 19:50:09.484120 29377 slave.cpp:346] Agent using credential for: test-principal
I1115 19:50:09.484143 29377 credentials.hpp:37] Loading credentials for authentication from
'/tmp/Endpoint_SlaveEndpointTest_UnauthorizedRequest_2_EwcWdq/http_credentials'
I1115 19:50:09.484362 29377 http.cpp:895] Using default 'basic' HTTP authenticator for realm
'mesos-agent-readonly'
I1115 19:50:09.484498 29377 http.cpp:895] Using default 'basic' HTTP authenticator for realm
'mesos-agent-readwrite'
I1115 19:50:09.485656 29377 slave.cpp:533] Agent resources: cpus(*):2; mem(*):1024; disk(*):1024;
ports(*):[31000-32000]
I1115 19:50:09.485743 29377 slave.cpp:541] Agent attributes: [  ]
I1115 19:50:09.485757 29377 slave.cpp:546] Agent hostname: 5558e43bf859
I1115 19:50:09.486932 29378 state.cpp:57] Recovering state from '/tmp/Endpoint_SlaveEndpointTest_UnauthorizedRequest_2_1wVZU9/meta'
I1115 19:50:09.487278 29385 status_update_manager.cpp:203] Recovering status update manager
I1115 19:50:09.487429 29372 containerizer.cpp:561] Recovering containerizer
I1115 19:50:09.488481 29377 provisioner.cpp:253] Provisioner recovery complete
I1115 19:50:09.488803 29384 slave.cpp:5411] Finished recovery
I1115 19:50:09.489277 29384 slave.cpp:5585] Querying resource estimator for oversubscribable
resources
I1115 19:50:09.489454 29381 slave.cpp:5599] Received oversubscribable resources {} from the
resource estimator
I1115 19:50:09.490623 29384 process.cpp:3570] Handling HTTP event for process 'slave(648)'
with path: '/slave(648)/containers'
I1115 19:50:09.491313 29384 http.cpp:847] Authorizing principal 'test-principal' to GET the
'/containers' endpoint
I1115 19:50:09.492918 29384 slave.cpp:787] Agent terminating
[       OK ] Endpoint/SlaveEndpointTest.UnauthorizedRequest/2 (22 ms)
[ RUN      ] Endpoint/SlaveEndpointTest.NoAuthorizer/0
I1115 19:50:09.501991 29352 containerizer.cpp:202] Using isolation: posix/cpu,posix/mem,filesystem/posix,network/cni
W1115 19:50:09.502677 29352 backend.cpp:76] Failed to create 'aufs' backend: AufsBackend requires
root privileges, but is running as user mesos
W1115 19:50:09.502881 29352 backend.cpp:76] Failed to create 'bind' backend: BindBackend requires
root privileges
I1115 19:50:09.504411 29352 cluster.cpp:435] Creating default 'local' authorizer
I1115 19:50:09.506239 29374 slave.cpp:208] Mesos agent started on (649)@172.17.0.2:34552
I1115 19:50:09.506275 29374 slave.cpp:209] Flags at startup: --acls="" --appc_simple_discovery_uri_prefix="http://"
--appc_store_dir="/tmp/mesos/store/appc" --authenticate_http_readonly="true" --authenticate_http_readwrite="true"
--authenticatee="crammd5" --authentication_backoff_factor="1secs" --authorizer="local" --cgroups_cpu_enable_pids_and_tids_count="false"
--cgroups_enable_cfs="false" --cgroups_hierarchy="/sys/fs/cgroup" --cgroups_limit_swap="false"
--cgroups_root="mesos" --container_disk_watch_interval="15secs" --containerizers="mesos" --credential="/tmp/Endpoint_SlaveEndpointTest_NoAuthorizer_0_sEG1Dt/credential"
--default_role="*" --disk_watch_interval="1mins" --docker="docker" --docker_kill_orphans="true"
--docker_registry="https://registry-1.docker.io" --docker_remove_delay="6hrs" --docker_socket="/var/run/docker.sock"
--docker_stop_timeout="0ns" --docker_store_dir="/tmp/mesos/store/docker" --docker_volume_checkpoint_dir="/var/run/mesos/isolators/docker/volume"
--enforce_container_disk_quota="false" --executor_registration_timeout="1mins" --executor_shutdown_grace_period="5secs"
--fetcher_cache_dir="/tmp/Endpoint_SlaveEndpointTest_NoAuthorizer_0_sEG1Dt/fetch" --fetcher_cache_size="2GB"
--frameworks_home="" --gc_delay="1weeks" --gc_disk_headroom="0.1" --hadoop_home="" --help="false"
--hostname_lookup="true" --http_authenticators="basic" --http_command_executor="false" --http_credentials="/tmp/Endpoint_SlaveEndpointTest_NoAuthorizer_0_sEG1Dt/http_credentials"
--image_provisioner_backend="copy" --initialize_driver_logging="true" --isolation="posix/cpu,posix/mem"
--launcher="posix" --launcher_dir="/mesos/mesos-1.2.0/_build/src" --logbufsecs="0" --logging_level="INFO"
--max_completed_executors_per_framework="150" --oversubscribed_resources_interval="15secs"
--perf_duration="10secs" --perf_interval="1mins" --qos_correction_interval_min="0ns" --quiet="false"
--recover="reconnect" --recovery_timeout="15mins" --registration_backoff_factor="10ms" --resources="cpus:2;gpus:0;mem:1024;disk:1024;ports:[31000-32000]"
--revocable_cpu_low_priority="true" --runtime_dir="/tmp/Endpoint_SlaveEndpointTest_NoAuthorizer_0_sEG1Dt"
--sandbox_directory="/mnt/mesos/sandbox" --strict="true" --switch_user="true" --systemd_enable_support="true"
--systemd_runtime_directory="/run/systemd/system" --version="false" --work_dir="/tmp/Endpoint_SlaveEndpointTest_NoAuthorizer_0_isuvhd"
I1115 19:50:09.506690 29374 credentials.hpp:86] Loading credential for authentication from
'/tmp/Endpoint_SlaveEndpointTest_NoAuthorizer_0_sEG1Dt/credential'
I1115 19:50:09.506804 29374 slave.cpp:346] Agent using credential for: test-principal
I1115 19:50:09.506824 29374 credentials.hpp:37] Loading credentials for authentication from
'/tmp/Endpoint_SlaveEndpointTest_NoAuthorizer_0_sEG1Dt/http_credentials'
I1115 19:50:09.507020 29374 http.cpp:895] Using default 'basic' HTTP authenticator for realm
'mesos-agent-readonly'
I1115 19:50:09.507138 29374 http.cpp:895] Using default 'basic' HTTP authenticator for realm
'mesos-agent-readwrite'
I1115 19:50:09.508049 29374 slave.cpp:533] Agent resources: cpus(*):2; mem(*):1024; disk(*):1024;
ports(*):[31000-32000]
I1115 19:50:09.508119 29374 slave.cpp:541] Agent attributes: [  ]
I1115 19:50:09.508131 29374 slave.cpp:546] Agent hostname: 5558e43bf859
I1115 19:50:09.509256 29370 state.cpp:57] Recovering state from '/tmp/Endpoint_SlaveEndpointTest_NoAuthorizer_0_isuvhd/meta'
I1115 19:50:09.509562 29378 status_update_manager.cpp:203] Recovering status update manager
I1115 19:50:09.509757 29370 containerizer.cpp:561] Recovering containerizer
I1115 19:50:09.510761 29373 provisioner.cpp:253] Provisioner recovery complete
I1115 19:50:09.511085 29374 slave.cpp:5411] Finished recovery
I1115 19:50:09.511495 29374 slave.cpp:5585] Querying resource estimator for oversubscribable
resources
I1115 19:50:09.511693 29385 slave.cpp:5599] Received oversubscribable resources {} from the
resource estimator
I1115 19:50:09.512928 29372 process.cpp:3570] Handling HTTP event for process 'slave(649)'
with path: '/slave(649)/monitor/statistics'
I1115 19:50:09.513581 29384 http.cpp:847] Authorizing principal 'test-principal' to GET the
'/monitor/statistics' endpoint
I1115 19:50:09.516283 29384 slave.cpp:787] Agent terminating
[       OK ] Endpoint/SlaveEndpointTest.NoAuthorizer/0 (24 ms)
[ RUN      ] Endpoint/SlaveEndpointTest.NoAuthorizer/1
I1115 19:50:09.527016 29352 containerizer.cpp:202] Using isolation: posix/cpu,posix/mem,filesystem/posix,network/cni
W1115 19:50:09.527580 29352 backend.cpp:76] Failed to create 'aufs' backend: AufsBackend requires
root privileges, but is running as user mesos
W1115 19:50:09.527734 29352 backend.cpp:76] Failed to create 'bind' backend: BindBackend requires
root privileges
I1115 19:50:09.529036 29352 cluster.cpp:435] Creating default 'local' authorizer
I1115 19:50:09.530526 29370 slave.cpp:208] Mesos agent started on (650)@172.17.0.2:34552
I1115 19:50:09.530565 29370 slave.cpp:209] Flags at startup: --acls="" --appc_simple_discovery_uri_prefix="http://"
--appc_store_dir="/tmp/mesos/store/appc" --authenticate_http_readonly="true" --authenticate_http_readwrite="true"
--authenticatee="crammd5" --authentication_backoff_factor="1secs" --authorizer="local" --cgroups_cpu_enable_pids_and_tids_count="false"
--cgroups_enable_cfs="false" --cgroups_hierarchy="/sys/fs/cgroup" --cgroups_limit_swap="false"
--cgroups_root="mesos" --container_disk_watch_interval="15secs" --containerizers="mesos" --credential="/tmp/Endpoint_SlaveEndpointTest_NoAuthorizer_1_GA5Ijx/credential"
--default_role="*" --disk_watch_interval="1mins" --docker="docker" --docker_kill_orphans="true"
--docker_registry="https://registry-1.docker.io" --docker_remove_delay="6hrs" --docker_socket="/var/run/docker.sock"
--docker_stop_timeout="0ns" --docker_store_dir="/tmp/mesos/store/docker" --docker_volume_checkpoint_dir="/var/run/mesos/isolators/docker/volume"
--enforce_container_disk_quota="false" --executor_registration_timeout="1mins" --executor_shutdown_grace_period="5secs"
--fetcher_cache_dir="/tmp/Endpoint_SlaveEndpointTest_NoAuthorizer_1_GA5Ijx/fetch" --fetcher_cache_size="2GB"
--frameworks_home="" --gc_delay="1weeks" --gc_disk_headroom="0.1" --hadoop_home="" --help="false"
--hostname_lookup="true" --http_authenticators="basic" --http_command_executor="false" --http_credentials="/tmp/Endpoint_SlaveEndpointTest_NoAuthorizer_1_GA5Ijx/http_credentials"
--image_provisioner_backend="copy" --initialize_driver_logging="true" --isolation="posix/cpu,posix/mem"
--launcher="posix" --launcher_dir="/mesos/mesos-1.2.0/_build/src" --logbufsecs="0" --logging_level="INFO"
--max_completed_executors_per_framework="150" --oversubscribed_resources_interval="15secs"
--perf_duration="10secs" --perf_interval="1mins" --qos_correction_interval_min="0ns" --quiet="false"
--recover="reconnect" --recovery_timeout="15mins" --registration_backoff_factor="10ms" --resources="cpus:2;gpus:0;mem:1024;disk:1024;ports:[31000-32000]"
--revocable_cpu_low_priority="true" --runtime_dir="/tmp/Endpoint_SlaveEndpointTest_NoAuthorizer_1_GA5Ijx"
--sandbox_directory="/mnt/mesos/sandbox" --strict="true" --switch_user="true" --systemd_enable_support="true"
--systemd_runtime_directory="/run/systemd/system" --version="false" --work_dir="/tmp/Endpoint_SlaveEndpointTest_NoAuthorizer_1_o1UbTg"
I1115 19:50:09.531083 29370 credentials.hpp:86] Loading credential for authentication from
'/tmp/Endpoint_SlaveEndpointTest_NoAuthorizer_1_GA5Ijx/credential'
I1115 19:50:09.531216 29370 slave.cpp:346] Agent using credential for: test-principal
I1115 19:50:09.531237 29370 credentials.hpp:37] Loading credentials for authentication from
'/tmp/Endpoint_SlaveEndpointTest_NoAuthorizer_1_GA5Ijx/http_credentials'
I1115 19:50:09.531445 29370 http.cpp:895] Using default 'basic' HTTP authenticator for realm
'mesos-agent-readonly'
I1115 19:50:09.531587 29370 http.cpp:895] Using default 'basic' HTTP authenticator for realm
'mesos-agent-readwrite'
I1115 19:50:09.532675 29370 slave.cpp:533] Agent resources: cpus(*):2; mem(*):1024; disk(*):1024;
ports(*):[31000-32000]
I1115 19:50:09.532757 29370 slave.cpp:541] Agent attributes: [  ]
I1115 19:50:09.532771 29370 slave.cpp:546] Agent hostname: 5558e43bf859
I1115 19:50:09.534113 29377 state.cpp:57] Recovering state from '/tmp/Endpoint_SlaveEndpointTest_NoAuthorizer_1_o1UbTg/meta'
I1115 19:50:09.534600 29372 status_update_manager.cpp:203] Recovering status update manager
I1115 19:50:09.534801 29370 containerizer.cpp:561] Recovering containerizer
I1115 19:50:09.536124 29378 provisioner.cpp:253] Provisioner recovery complete
I1115 19:50:09.536509 29383 slave.cpp:5411] Finished recovery
I1115 19:50:09.536998 29383 slave.cpp:5585] Querying resource estimator for oversubscribable
resources
I1115 19:50:09.537214 29371 slave.cpp:5599] Received oversubscribable resources {} from the
resource estimator
I1115 19:50:09.538482 29375 process.cpp:3570] Handling HTTP event for process 'slave(650)'
with path: '/slave(650)/monitor/statistics.json'
I1115 19:50:09.539319 29378 http.cpp:847] Authorizing principal 'test-principal' to GET the
'/monitor/statistics.json' endpoint
I1115 19:50:09.542601 29385 slave.cpp:787] Agent terminating
[       OK ] Endpoint/SlaveEndpointTest.NoAuthorizer/1 (26 ms)
[ RUN      ] Endpoint/SlaveEndpointTest.NoAuthorizer/2
I1115 19:50:09.553544 29352 containerizer.cpp:202] Using isolation: posix/cpu,posix/mem,filesystem/posix,network/cni
W1115 19:50:09.554236 29352 backend.cpp:76] Failed to create 'aufs' backend: AufsBackend requires
root privileges, but is running as user mesos
W1115 19:50:09.554399 29352 backend.cpp:76] Failed to create 'bind' backend: BindBackend requires
root privileges
I1115 19:50:09.555874 29352 cluster.cpp:435] Creating default 'local' authorizer
I1115 19:50:09.557238 29383 slave.cpp:208] Mesos agent started on (651)@172.17.0.2:34552
I1115 19:50:09.557272 29383 slave.cpp:209] Flags at startup: --acls="" --appc_simple_discovery_uri_prefix="http://"
--appc_store_dir="/tmp/mesos/store/appc" --authenticate_http_readonly="true" --authenticate_http_readwrite="true"
--authenticatee="crammd5" --authentication_backoff_factor="1secs" --authorizer="local" --cgroups_cpu_enable_pids_and_tids_count="false"
--cgroups_enable_cfs="false" --cgroups_hierarchy="/sys/fs/cgroup" --cgroups_limit_swap="false"
--cgroups_root="mesos" --container_disk_watch_interval="15secs" --containerizers="mesos" --credential="/tmp/Endpoint_SlaveEndpointTest_NoAuthorizer_2_6jxpgB/credential"
--default_role="*" --disk_watch_interval="1mins" --docker="docker" --docker_kill_orphans="true"
--docker_registry="https://registry-1.docker.io" --docker_remove_delay="6hrs" --docker_socket="/var/run/docker.sock"
--docker_stop_timeout="0ns" --docker_store_dir="/tmp/mesos/store/docker" --docker_volume_checkpoint_dir="/var/run/mesos/isolators/docker/volume"
--enforce_container_disk_quota="false" --executor_registration_timeout="1mins" --executor_shutdown_grace_period="5secs"
--fetcher_cache_dir="/tmp/Endpoint_SlaveEndpointTest_NoAuthorizer_2_6jxpgB/fetch" --fetcher_cache_size="2GB"
--frameworks_home="" --gc_delay="1weeks" --gc_disk_headroom="0.1" --hadoop_home="" --help="false"
--hostname_lookup="true" --http_authenticators="basic" --http_command_executor="false" --http_credentials="/tmp/Endpoint_SlaveEndpointTest_NoAuthorizer_2_6jxpgB/http_credentials"
--image_provisioner_backend="copy" --initialize_driver_logging="true" --isolation="posix/cpu,posix/mem"
--launcher="posix" --launcher_dir="/mesos/mesos-1.2.0/_build/src" --logbufsecs="0" --logging_level="INFO"
--max_completed_executors_per_framework="150" --oversubscribed_resources_interval="15secs"
--perf_duration="10secs" --perf_interval="1mins" --qos_correction_interval_min="0ns" --quiet="false"
--recover="reconnect" --recovery_timeout="15mins" --registration_backoff_factor="10ms" --resources="cpus:2;gpus:0;mem:1024;disk:1024;ports:[31000-32000]"
--revocable_cpu_low_priority="true" --runtime_dir="/tmp/Endpoint_SlaveEndpointTest_NoAuthorizer_2_6jxpgB"
--sandbox_directory="/mnt/mesos/sandbox" --strict="true" --switch_user="true" --systemd_enable_support="true"
--systemd_runtime_directory="/run/systemd/system" --version="false" --work_dir="/tmp/Endpoint_SlaveEndpointTest_NoAuthorizer_2_4nGALk"
I1115 19:50:09.557656 29383 credentials.hpp:86] Loading credential for authentication from
'/tmp/Endpoint_SlaveEndpointTest_NoAuthorizer_2_6jxpgB/credential'
I1115 19:50:09.557767 29383 slave.cpp:346] Agent using credential for: test-principal
I1115 19:50:09.557786 29383 credentials.hpp:37] Loading credentials for authentication from
'/tmp/Endpoint_SlaveEndpointTest_NoAuthorizer_2_6jxpgB/http_credentials'
I1115 19:50:09.557991 29383 http.cpp:895] Using default 'basic' HTTP authenticator for realm
'mesos-agent-readonly'
I1115 19:50:09.558110 29383 http.cpp:895] Using default 'basic' HTTP authenticator for realm
'mesos-agent-readwrite'
I1115 19:50:09.559106 29383 slave.cpp:533] Agent resources: cpus(*):2; mem(*):1024; disk(*):1024;
ports(*):[31000-32000]
I1115 19:50:09.559207 29383 slave.cpp:541] Agent attributes: [  ]
I1115 19:50:09.559218 29383 slave.cpp:546] Agent hostname: 5558e43bf859
I1115 19:50:09.560526 29382 state.cpp:57] Recovering state from '/tmp/Endpoint_SlaveEndpointTest_NoAuthorizer_2_4nGALk/meta'
I1115 19:50:09.560736 29376 status_update_manager.cpp:203] Recovering status update manager
I1115 19:50:09.560914 29378 containerizer.cpp:561] Recovering containerizer
I1115 19:50:09.562028 29371 provisioner.cpp:253] Provisioner recovery complete
I1115 19:50:09.562316 29385 slave.cpp:5411] Finished recovery
I1115 19:50:09.562724 29385 slave.cpp:5585] Querying resource estimator for oversubscribable
resources
I1115 19:50:09.562906 29381 slave.cpp:5599] Received oversubscribable resources {} from the
resource estimator
I1115 19:50:09.564061 29377 process.cpp:3570] Handling HTTP event for process 'slave(651)'
with path: '/slave(651)/containers'
I1115 19:50:09.564697 29381 http.cpp:847] Authorizing principal 'test-principal' to GET the
'/containers' endpoint
I1115 19:50:09.567558 29377 slave.cpp:787] Agent terminating
[       OK ] Endpoint/SlaveEndpointTest.NoAuthorizer/2 (24 ms)
[----------] 9 tests from Endpoint/SlaveEndpointTest (231 ms total)

[----------] Global test environment tear-down
[==========] 1378 tests from 156 test cases ran. (479472 ms total)
[  PASSED  ] 1377 tests.
[  FAILED  ] 1 test, listed below:
[  FAILED  ] MasterTest.TaskStatusContainerStatus

 1 FAILED TEST
  YOU HAVE 4 DISABLED TESTS

make[4]: *** [check-local] Error 1
make[4]: Leaving directory `/mesos/mesos-1.2.0/_build/src'
make[3]: *** [check-am] Error 2
make[3]: Leaving directory `/mesos/mesos-1.2.0/_build/src'
make[2]: *** [check] Error 2
make[2]: Leaving directory `/mesos/mesos-1.2.0/_build/src'
make[1]: *** [check-recursive] Error 1
make[1]: Leaving directory `/mesos/mesos-1.2.0/_build'
make: *** [distcheck] Error 1
+ docker rmi mesos-1479236865-17538
Untagged: mesos-1479236865-17538:latest
Deleted: sha256:38378e2a750ccbbcf42c66e9226fc7e63e4a6209a47fa6b0b8f5dd527457297a
Deleted: sha256:88259ddbaf507ba064d1c3763e2a2aca77c43ff63e4950c27cadfb8ab52b53d5
Deleted: sha256:530598b57f7af143846ea5f61b4ab8a9cafed94fd5befc54728f16aa39ff8f67
Deleted: sha256:d6b4984577eb4269dd3e57f2386cc97f86ca85b63f658e3248ff5f4976d43e93
Deleted: sha256:f66560a261cdb7245669d0f5faee0a0a25b99f5a65d39274f2c8d2183cc3909b
Deleted: sha256:9742bef5bcc38b03ced147936e3a27a28f9212bd056b4185f8be182377bbe40a
Deleted: sha256:d67c189908b41a7b390d5d2cb2b3d848fcbbe52a85656f9ec3086d7f80717e87
Deleted: sha256:a46674a8b8abc20584c5af0e72f017a4395fea363b5f3a4a32ebc3d82aeb4891
Deleted: sha256:fff4ac0b8e82a94ba9daef834dd1922b0954afa21a5de04d36ce813a15b3d8c4
Deleted: sha256:af8bb6328f6008242389b96fbe56c81abb11b2fec7423fd4e7b59eb329c89240
Deleted: sha256:fc5346d4b960cf239a5173fd92a20350f746211688f7be64e9e88d28b74b512d
Deleted: sha256:53c7a21e6bcfa21afe7b2cee5e80b39b4679c98d637e3cbdad7b68087fd67a20
Deleted: sha256:74730258fcddc1d4b60aa388286a1d59d641fdea588ba3f72ad1bd30006eaf94
Deleted: sha256:c4940513df619e84cb48d16d3bbee82907fe315fd46f9a4c82ccff8caddf9870
Deleted: sha256:05b11454ed05e5cd73ee83915e8fdb7cdf1da7e32bdc9c425ff6336c8aeeac84
Deleted: sha256:7227bd31d73507911ae54dd3fb9d9faa463b3a46a8bff536419e67a754c79354
Deleted: sha256:e625408ebb55d3acf160a9947685e9edd2be12675fe3a9d6be35447832ce9e1d
Deleted: sha256:d454198532e7908d701e1db6c48be97bc336bca2e8f4e545ec37f0e9ad28abb9
Deleted: sha256:c9d01f0bdd716709d1a61ac4d9952264c6256fc886b2e410bdedee0a774cafaa
Deleted: sha256:d12a7439c680edb8afcf977df2f432fc67898ed8a82091ddecf5575f066743ee
Deleted: sha256:9353cdc6fec02da7a84703aa4c23cbe70a5d4cf970f7832397390589e010833d
Deleted: sha256:84503a9ab1078db64afb022e04f9e41c6764166768e0745ede15734a285daa6f
Deleted: sha256:fe0d41b05c60a77d50977c96a591f855c9b8da50ab23ce976d8778af858bc3b7
Deleted: sha256:5fc256026c1c8499718cdfd5bea5e2ae4d441436758e1299f2ac70776434433e
Build step 'Execute shell' marked build as failure

Mime
View raw message