mesos-builds mailing list archives

Site index · List index
Message view « Date » · « Thread »
Top « Date » · « Thread »
From Apache Jenkins Server <jenk...@builds.apache.org>
Subject Build failed in Jenkins: Mesos » autotools,clang,--verbose,GLOG_v=1 MESOS_VERBOSE=1,ubuntu:14.04,(docker||Hadoop)&&(!ubuntu-us1)&&(!ubuntu-6)&&(!ubuntu-eu2) #2927
Date Mon, 14 Nov 2016 15:15:09 GMT
See <https://builds.apache.org/job/Mesos/BUILDTOOL=autotools,COMPILER=clang,CONFIGURATION=--verbose,ENVIRONMENT=GLOG_v=1%20MESOS_VERBOSE=1,OS=ubuntu%3A14.04,label_exp=(docker%7C%7CHadoop)&&(!ubuntu-us1)&&(!ubuntu-6)&&(!ubuntu-eu2)/2927/changes>

Changes:

[alexr] Added Stephen Hankinson to contributors list.

------------------------------------------
[...truncated 217859 lines...]
W1114 15:14:25.358363 28144 backend.cpp:76] Failed to create 'aufs' backend: AufsBackend requires
root privileges, but is running as user mesos
W1114 15:14:25.358587 28144 backend.cpp:76] Failed to create 'bind' backend: BindBackend requires
root privileges
I1114 15:14:25.361495 28176 slave.cpp:208] Mesos agent started on (644)@172.17.0.3:49951
I1114 15:14:25.361529 28176 slave.cpp:209] Flags at startup: --acls="" --appc_simple_discovery_uri_prefix="http://"
--appc_store_dir="/tmp/mesos/store/appc" --authenticate_http_readonly="true" --authenticate_http_readwrite="true"
--authenticatee="crammd5" --authentication_backoff_factor="1secs" --authorizer="local" --cgroups_cpu_enable_pids_and_tids_count="false"
--cgroups_enable_cfs="false" --cgroups_hierarchy="/sys/fs/cgroup" --cgroups_limit_swap="false"
--cgroups_root="mesos" --container_disk_watch_interval="15secs" --containerizers="mesos" --credential="/tmp/Endpoint_SlaveEndpointTest_AuthorizedRequest_1_Oo81ob/credential"
--default_role="*" --disk_watch_interval="1mins" --docker="docker" --docker_kill_orphans="true"
--docker_registry="https://registry-1.docker.io" --docker_remove_delay="6hrs" --docker_socket="/var/run/docker.sock"
--docker_stop_timeout="0ns" --docker_store_dir="/tmp/mesos/store/docker" --docker_volume_checkpoint_dir="/var/run/mesos/isolators/docker/volume"
--enforce_container_disk_quota="false" --executor_registration_timeout="1mins" --executor_shutdown_grace_period="5secs"
--fetcher_cache_dir="/tmp/Endpoint_SlaveEndpointTest_AuthorizedRequest_1_Oo81ob/fetch" --fetcher_cache_size="2GB"
--frameworks_home="" --gc_delay="1weeks" --gc_disk_headroom="0.1" --hadoop_home="" --help="false"
--hostname_lookup="true" --http_authenticators="basic" --http_command_executor="false" --http_credentials="/tmp/Endpoint_SlaveEndpointTest_AuthorizedRequest_1_Oo81ob/http_credentials"
--image_provisioner_backend="copy" --initialize_driver_logging="true" --isolation="posix/cpu,posix/mem"
--launcher="posix" --launcher_dir="/mesos/mesos-1.2.0/_build/src" --logbufsecs="0" --logging_level="INFO"
--max_completed_executors_per_framework="150" --oversubscribed_resources_interval="15secs"
--perf_duration="10secs" --perf_interval="1mins" --qos_correction_interval_min="0ns" --quiet="false"
--recover="reconnect" --recovery_timeout="15mins" --registration_backoff_factor="10ms" --resources="cpus:2;gpus:0;mem:1024;disk:1024;ports:[31000-32000]"
--revocable_cpu_low_priority="true" --runtime_dir="/tmp/Endpoint_SlaveEndpointTest_AuthorizedRequest_1_Oo81ob"
--sandbox_directory="/mnt/mesos/sandbox" --strict="true" --switch_user="true" --systemd_enable_support="true"
--systemd_runtime_directory="/run/systemd/system" --version="false" --work_dir="/tmp/Endpoint_SlaveEndpointTest_AuthorizedRequest_1_SZeK9W"
I1114 15:14:25.362164 28176 credentials.hpp:86] Loading credential for authentication from
'/tmp/Endpoint_SlaveEndpointTest_AuthorizedRequest_1_Oo81ob/credential'
I1114 15:14:25.362334 28176 slave.cpp:346] Agent using credential for: test-principal
I1114 15:14:25.362359 28176 credentials.hpp:37] Loading credentials for authentication from
'/tmp/Endpoint_SlaveEndpointTest_AuthorizedRequest_1_Oo81ob/http_credentials'
I1114 15:14:25.362615 28176 http.cpp:895] Using default 'basic' HTTP authenticator for realm
'mesos-agent-readonly'
I1114 15:14:25.362802 28176 http.cpp:895] Using default 'basic' HTTP authenticator for realm
'mesos-agent-readwrite'
I1114 15:14:25.364150 28176 slave.cpp:533] Agent resources: cpus(*):2; mem(*):1024; disk(*):1024;
ports(*):[31000-32000]
I1114 15:14:25.364233 28176 slave.cpp:541] Agent attributes: [  ]
I1114 15:14:25.364249 28176 slave.cpp:546] Agent hostname: 82bbc75e9372
I1114 15:14:25.365658 28166 state.cpp:57] Recovering state from '/tmp/Endpoint_SlaveEndpointTest_AuthorizedRequest_1_SZeK9W/meta'
I1114 15:14:25.365944 28165 status_update_manager.cpp:203] Recovering status update manager
I1114 15:14:25.366235 28174 containerizer.cpp:561] Recovering containerizer
I1114 15:14:25.367779 28176 provisioner.cpp:253] Provisioner recovery complete
I1114 15:14:25.368190 28171 slave.cpp:5411] Finished recovery
I1114 15:14:25.368638 28171 slave.cpp:5585] Querying resource estimator for oversubscribable
resources
I1114 15:14:25.368841 28162 slave.cpp:5599] Received oversubscribable resources {} from the
resource estimator
I1114 15:14:25.370780 28177 process.cpp:3570] Handling HTTP event for process 'slave(644)'
with path: '/slave(644)/monitor/statistics.json'
I1114 15:14:25.371722 28166 http.cpp:847] Authorizing principal 'test-principal' to GET the
'/monitor/statistics.json' endpoint
I1114 15:14:25.375975 28176 slave.cpp:787] Agent terminating
[       OK ] Endpoint/SlaveEndpointTest.AuthorizedRequest/1 (28 ms)
[ RUN      ] Endpoint/SlaveEndpointTest.AuthorizedRequest/2
I1114 15:14:25.387403 28144 containerizer.cpp:202] Using isolation: posix/cpu,posix/mem,filesystem/posix,network/cni
W1114 15:14:25.388062 28144 backend.cpp:76] Failed to create 'aufs' backend: AufsBackend requires
root privileges, but is running as user mesos
W1114 15:14:25.388236 28144 backend.cpp:76] Failed to create 'bind' backend: BindBackend requires
root privileges
I1114 15:14:25.391160 28175 slave.cpp:208] Mesos agent started on (645)@172.17.0.3:49951
I1114 15:14:25.391206 28175 slave.cpp:209] Flags at startup: --acls="" --appc_simple_discovery_uri_prefix="http://"
--appc_store_dir="/tmp/mesos/store/appc" --authenticate_http_readonly="true" --authenticate_http_readwrite="true"
--authenticatee="crammd5" --authentication_backoff_factor="1secs" --authorizer="local" --cgroups_cpu_enable_pids_and_tids_count="false"
--cgroups_enable_cfs="false" --cgroups_hierarchy="/sys/fs/cgroup" --cgroups_limit_swap="false"
--cgroups_root="mesos" --container_disk_watch_interval="15secs" --containerizers="mesos" --credential="/tmp/Endpoint_SlaveEndpointTest_AuthorizedRequest_2_QosgE6/credential"
--default_role="*" --disk_watch_interval="1mins" --docker="docker" --docker_kill_orphans="true"
--docker_registry="https://registry-1.docker.io" --docker_remove_delay="6hrs" --docker_socket="/var/run/docker.sock"
--docker_stop_timeout="0ns" --docker_store_dir="/tmp/mesos/store/docker" --docker_volume_checkpoint_dir="/var/run/mesos/isolators/docker/volume"
--enforce_container_disk_quota="false" --executor_registration_timeout="1mins" --executor_shutdown_grace_period="5secs"
--fetcher_cache_dir="/tmp/Endpoint_SlaveEndpointTest_AuthorizedRequest_2_QosgE6/fetch" --fetcher_cache_size="2GB"
--frameworks_home="" --gc_delay="1weeks" --gc_disk_headroom="0.1" --hadoop_home="" --help="false"
--hostname_lookup="true" --http_authenticators="basic" --http_command_executor="false" --http_credentials="/tmp/Endpoint_SlaveEndpointTest_AuthorizedRequest_2_QosgE6/http_credentials"
--image_provisioner_backend="copy" --initialize_driver_logging="true" --isolation="posix/cpu,posix/mem"
--launcher="posix" --launcher_dir="/mesos/mesos-1.2.0/_build/src" --logbufsecs="0" --logging_level="INFO"
--max_completed_executors_per_framework="150" --oversubscribed_resources_interval="15secs"
--perf_duration="10secs" --perf_interval="1mins" --qos_correction_interval_min="0ns" --quiet="false"
--recover="reconnect" --recovery_timeout="15mins" --registration_backoff_factor="10ms" --resources="cpus:2;gpus:0;mem:1024;disk:1024;ports:[31000-32000]"
--revocable_cpu_low_priority="true" --runtime_dir="/tmp/Endpoint_SlaveEndpointTest_AuthorizedRequest_2_QosgE6"
--sandbox_directory="/mnt/mesos/sandbox" --strict="true" --switch_user="true" --systemd_enable_support="true"
--systemd_runtime_directory="/run/systemd/system" --version="false" --work_dir="/tmp/Endpoint_SlaveEndpointTest_AuthorizedRequest_2_CYAckS"
I1114 15:14:25.391854 28175 credentials.hpp:86] Loading credential for authentication from
'/tmp/Endpoint_SlaveEndpointTest_AuthorizedRequest_2_QosgE6/credential'
I1114 15:14:25.392024 28175 slave.cpp:346] Agent using credential for: test-principal
I1114 15:14:25.392050 28175 credentials.hpp:37] Loading credentials for authentication from
'/tmp/Endpoint_SlaveEndpointTest_AuthorizedRequest_2_QosgE6/http_credentials'
I1114 15:14:25.392309 28175 http.cpp:895] Using default 'basic' HTTP authenticator for realm
'mesos-agent-readonly'
I1114 15:14:25.392451 28175 http.cpp:895] Using default 'basic' HTTP authenticator for realm
'mesos-agent-readwrite'
I1114 15:14:25.394001 28175 slave.cpp:533] Agent resources: cpus(*):2; mem(*):1024; disk(*):1024;
ports(*):[31000-32000]
I1114 15:14:25.394104 28175 slave.cpp:541] Agent attributes: [  ]
I1114 15:14:25.394130 28175 slave.cpp:546] Agent hostname: 82bbc75e9372
I1114 15:14:25.395727 28177 state.cpp:57] Recovering state from '/tmp/Endpoint_SlaveEndpointTest_AuthorizedRequest_2_CYAckS/meta'
I1114 15:14:25.396080 28165 status_update_manager.cpp:203] Recovering status update manager
I1114 15:14:25.396601 28171 containerizer.cpp:561] Recovering containerizer
I1114 15:14:25.398277 28172 provisioner.cpp:253] Provisioner recovery complete
I1114 15:14:25.398831 28166 slave.cpp:5411] Finished recovery
I1114 15:14:25.399456 28166 slave.cpp:5585] Querying resource estimator for oversubscribable
resources
I1114 15:14:25.399822 28167 slave.cpp:5599] Received oversubscribable resources {} from the
resource estimator
I1114 15:14:25.401849 28174 process.cpp:3570] Handling HTTP event for process 'slave(645)'
with path: '/slave(645)/containers'
I1114 15:14:25.402746 28176 http.cpp:847] Authorizing principal 'test-principal' to GET the
'/containers' endpoint
I1114 15:14:25.406589 28167 slave.cpp:787] Agent terminating
[       OK ] Endpoint/SlaveEndpointTest.AuthorizedRequest/2 (30 ms)
[ RUN      ] Endpoint/SlaveEndpointTest.UnauthorizedRequest/0
I1114 15:14:25.418344 28144 containerizer.cpp:202] Using isolation: posix/cpu,posix/mem,filesystem/posix,network/cni
W1114 15:14:25.419051 28144 backend.cpp:76] Failed to create 'aufs' backend: AufsBackend requires
root privileges, but is running as user mesos
W1114 15:14:25.419234 28144 backend.cpp:76] Failed to create 'bind' backend: BindBackend requires
root privileges
I1114 15:14:25.422922 28163 slave.cpp:208] Mesos agent started on (646)@172.17.0.3:49951
I1114 15:14:25.422968 28163 slave.cpp:209] Flags at startup: --acls="" --appc_simple_discovery_uri_prefix="http://"
--appc_store_dir="/tmp/mesos/store/appc" --authenticate_http_readonly="true" --authenticate_http_readwrite="true"
--authenticatee="crammd5" --authentication_backoff_factor="1secs" --authorizer="local" --cgroups_cpu_enable_pids_and_tids_count="false"
--cgroups_enable_cfs="false" --cgroups_hierarchy="/sys/fs/cgroup" --cgroups_limit_swap="false"
--cgroups_root="mesos" --container_disk_watch_interval="15secs" --containerizers="mesos" --credential="/tmp/Endpoint_SlaveEndpointTest_UnauthorizedRequest_0_umvtd2/credential"
--default_role="*" --disk_watch_interval="1mins" --docker="docker" --docker_kill_orphans="true"
--docker_registry="https://registry-1.docker.io" --docker_remove_delay="6hrs" --docker_socket="/var/run/docker.sock"
--docker_stop_timeout="0ns" --docker_store_dir="/tmp/mesos/store/docker" --docker_volume_checkpoint_dir="/var/run/mesos/isolators/docker/volume"
--enforce_container_disk_quota="false" --executor_registration_timeout="1mins" --executor_shutdown_grace_period="5secs"
--fetcher_cache_dir="/tmp/Endpoint_SlaveEndpointTest_UnauthorizedRequest_0_umvtd2/fetch" --fetcher_cache_size="2GB"
--frameworks_home="" --gc_delay="1weeks" --gc_disk_headroom="0.1" --hadoop_home="" --help="false"
--hostname_lookup="true" --http_authenticators="basic" --http_command_executor="false" --http_credentials="/tmp/Endpoint_SlaveEndpointTest_UnauthorizedRequest_0_umvtd2/http_credentials"
--image_provisioner_backend="copy" --initialize_driver_logging="true" --isolation="posix/cpu,posix/mem"
--launcher="posix" --launcher_dir="/mesos/mesos-1.2.0/_build/src" --logbufsecs="0" --logging_level="INFO"
--max_completed_executors_per_framework="150" --oversubscribed_resources_interval="15secs"
--perf_duration="10secs" --perf_interval="1mins" --qos_correction_interval_min="0ns" --quiet="false"
--recover="reconnect" --recovery_timeout="15mins" --registration_backoff_factor="10ms" --resources="cpus:2;gpus:0;mem:1024;disk:1024;ports:[31000-32000]"
--revocable_cpu_low_priority="true" --runtime_dir="/tmp/Endpoint_SlaveEndpointTest_UnauthorizedRequest_0_umvtd2"
--sandbox_directory="/mnt/mesos/sandbox" --strict="true" --switch_user="true" --systemd_enable_support="true"
--systemd_runtime_directory="/run/systemd/system" --version="false" --work_dir="/tmp/Endpoint_SlaveEndpointTest_UnauthorizedRequest_0_ajApON"
I1114 15:14:25.423620 28163 credentials.hpp:86] Loading credential for authentication from
'/tmp/Endpoint_SlaveEndpointTest_UnauthorizedRequest_0_umvtd2/credential'
I1114 15:14:25.423818 28163 slave.cpp:346] Agent using credential for: test-principal
I1114 15:14:25.423851 28163 credentials.hpp:37] Loading credentials for authentication from
'/tmp/Endpoint_SlaveEndpointTest_UnauthorizedRequest_0_umvtd2/http_credentials'
I1114 15:14:25.424119 28163 http.cpp:895] Using default 'basic' HTTP authenticator for realm
'mesos-agent-readonly'
I1114 15:14:25.424417 28163 http.cpp:895] Using default 'basic' HTTP authenticator for realm
'mesos-agent-readwrite'
I1114 15:14:25.425709 28163 slave.cpp:533] Agent resources: cpus(*):2; mem(*):1024; disk(*):1024;
ports(*):[31000-32000]
I1114 15:14:25.425812 28163 slave.cpp:541] Agent attributes: [  ]
I1114 15:14:25.425842 28163 slave.cpp:546] Agent hostname: 82bbc75e9372
I1114 15:14:25.427734 28172 state.cpp:57] Recovering state from '/tmp/Endpoint_SlaveEndpointTest_UnauthorizedRequest_0_ajApON/meta'
I1114 15:14:25.428046 28173 status_update_manager.cpp:203] Recovering status update manager
I1114 15:14:25.428581 28175 containerizer.cpp:561] Recovering containerizer
I1114 15:14:25.430189 28171 provisioner.cpp:253] Provisioner recovery complete
I1114 15:14:25.430709 28162 slave.cpp:5411] Finished recovery
I1114 15:14:25.431262 28162 slave.cpp:5585] Querying resource estimator for oversubscribable
resources
I1114 15:14:25.431494 28165 slave.cpp:5599] Received oversubscribable resources {} from the
resource estimator
I1114 15:14:25.433181 28163 process.cpp:3570] Handling HTTP event for process 'slave(646)'
with path: '/slave(646)/monitor/statistics'
I1114 15:14:25.434242 28170 http.cpp:847] Authorizing principal 'test-principal' to GET the
'/monitor/statistics' endpoint
I1114 15:14:25.436563 28170 slave.cpp:787] Agent terminating
[       OK ] Endpoint/SlaveEndpointTest.UnauthorizedRequest/0 (28 ms)
[ RUN      ] Endpoint/SlaveEndpointTest.UnauthorizedRequest/1
I1114 15:14:25.447338 28144 containerizer.cpp:202] Using isolation: posix/cpu,posix/mem,filesystem/posix,network/cni
W1114 15:14:25.447986 28144 backend.cpp:76] Failed to create 'aufs' backend: AufsBackend requires
root privileges, but is running as user mesos
W1114 15:14:25.448184 28144 backend.cpp:76] Failed to create 'bind' backend: BindBackend requires
root privileges
I1114 15:14:25.451177 28162 slave.cpp:208] Mesos agent started on (647)@172.17.0.3:49951
I1114 15:14:25.451303 28162 slave.cpp:209] Flags at startup: --acls="" --appc_simple_discovery_uri_prefix="http://"
--appc_store_dir="/tmp/mesos/store/appc" --authenticate_http_readonly="true" --authenticate_http_readwrite="true"
--authenticatee="crammd5" --authentication_backoff_factor="1secs" --authorizer="local" --cgroups_cpu_enable_pids_and_tids_count="false"
--cgroups_enable_cfs="false" --cgroups_hierarchy="/sys/fs/cgroup" --cgroups_limit_swap="false"
--cgroups_root="mesos" --container_disk_watch_interval="15secs" --containerizers="mesos" --credential="/tmp/Endpoint_SlaveEndpointTest_UnauthorizedRequest_1_gez65X/credential"
--default_role="*" --disk_watch_interval="1mins" --docker="docker" --docker_kill_orphans="true"
--docker_registry="https://registry-1.docker.io" --docker_remove_delay="6hrs" --docker_socket="/var/run/docker.sock"
--docker_stop_timeout="0ns" --docker_store_dir="/tmp/mesos/store/docker" --docker_volume_checkpoint_dir="/var/run/mesos/isolators/docker/volume"
--enforce_container_disk_quota="false" --executor_registration_timeout="1mins" --executor_shutdown_grace_period="5secs"
--fetcher_cache_dir="/tmp/Endpoint_SlaveEndpointTest_UnauthorizedRequest_1_gez65X/fetch" --fetcher_cache_size="2GB"
--frameworks_home="" --gc_delay="1weeks" --gc_disk_headroom="0.1" --hadoop_home="" --help="false"
--hostname_lookup="true" --http_authenticators="basic" --http_command_executor="false" --http_credentials="/tmp/Endpoint_SlaveEndpointTest_UnauthorizedRequest_1_gez65X/http_credentials"
--image_provisioner_backend="copy" --initialize_driver_logging="true" --isolation="posix/cpu,posix/mem"
--launcher="posix" --launcher_dir="/mesos/mesos-1.2.0/_build/src" --logbufsecs="0" --logging_level="INFO"
--max_completed_executors_per_framework="150" --oversubscribed_resources_interval="15secs"
--perf_duration="10secs" --perf_interval="1mins" --qos_correction_interval_min="0ns" --quiet="false"
--recover="reconnect" --recovery_timeout="15mins" --registration_backoff_factor="10ms" --resources="cpus:2;gpus:0;mem:1024;disk:1024;ports:[31000-32000]"
--revocable_cpu_low_priority="true" --runtime_dir="/tmp/Endpoint_SlaveEndpointTest_UnauthorizedRequest_1_gez65X"
--sandbox_directory="/mnt/mesos/sandbox" --strict="true" --switch_user="true" --systemd_enable_support="true"
--systemd_runtime_directory="/run/systemd/system" --version="false" --work_dir="/tmp/Endpoint_SlaveEndpointTest_UnauthorizedRequest_1_UhCiCJ"
I1114 15:14:25.451758 28162 credentials.hpp:86] Loading credential for authentication from
'/tmp/Endpoint_SlaveEndpointTest_UnauthorizedRequest_1_gez65X/credential'
I1114 15:14:25.451959 28162 slave.cpp:346] Agent using credential for: test-principal
I1114 15:14:25.451982 28162 credentials.hpp:37] Loading credentials for authentication from
'/tmp/Endpoint_SlaveEndpointTest_UnauthorizedRequest_1_gez65X/http_credentials'
I1114 15:14:25.452203 28162 http.cpp:895] Using default 'basic' HTTP authenticator for realm
'mesos-agent-readonly'
I1114 15:14:25.452333 28162 http.cpp:895] Using default 'basic' HTTP authenticator for realm
'mesos-agent-readwrite'
I1114 15:14:25.453848 28162 slave.cpp:533] Agent resources: cpus(*):2; mem(*):1024; disk(*):1024;
ports(*):[31000-32000]
I1114 15:14:25.453948 28162 slave.cpp:541] Agent attributes: [  ]
I1114 15:14:25.453963 28162 slave.cpp:546] Agent hostname: 82bbc75e9372
I1114 15:14:25.455982 28167 state.cpp:57] Recovering state from '/tmp/Endpoint_SlaveEndpointTest_UnauthorizedRequest_1_UhCiCJ/meta'
I1114 15:14:25.456305 28164 status_update_manager.cpp:203] Recovering status update manager
I1114 15:14:25.456547 28162 containerizer.cpp:561] Recovering containerizer
I1114 15:14:25.458149 28175 provisioner.cpp:253] Provisioner recovery complete
I1114 15:14:25.458618 28163 slave.cpp:5411] Finished recovery
I1114 15:14:25.459183 28163 slave.cpp:5585] Querying resource estimator for oversubscribable
resources
I1114 15:14:25.459426 28169 slave.cpp:5599] Received oversubscribable resources {} from the
resource estimator
I1114 15:14:25.460975 28175 process.cpp:3570] Handling HTTP event for process 'slave(647)'
with path: '/slave(647)/monitor/statistics.json'
I1114 15:14:25.461879 28165 http.cpp:847] Authorizing principal 'test-principal' to GET the
'/monitor/statistics.json' endpoint
I1114 15:14:25.464371 28170 slave.cpp:787] Agent terminating
[       OK ] Endpoint/SlaveEndpointTest.UnauthorizedRequest/1 (27 ms)
[ RUN      ] Endpoint/SlaveEndpointTest.UnauthorizedRequest/2
I1114 15:14:25.475010 28144 containerizer.cpp:202] Using isolation: posix/cpu,posix/mem,filesystem/posix,network/cni
W1114 15:14:25.475669 28144 backend.cpp:76] Failed to create 'aufs' backend: AufsBackend requires
root privileges, but is running as user mesos
W1114 15:14:25.475843 28144 backend.cpp:76] Failed to create 'bind' backend: BindBackend requires
root privileges
I1114 15:14:25.478735 28165 slave.cpp:208] Mesos agent started on (648)@172.17.0.3:49951
I1114 15:14:25.478777 28165 slave.cpp:209] Flags at startup: --acls="" --appc_simple_discovery_uri_prefix="http://"
--appc_store_dir="/tmp/mesos/store/appc" --authenticate_http_readonly="true" --authenticate_http_readwrite="true"
--authenticatee="crammd5" --authentication_backoff_factor="1secs" --authorizer="local" --cgroups_cpu_enable_pids_and_tids_count="false"
--cgroups_enable_cfs="false" --cgroups_hierarchy="/sys/fs/cgroup" --cgroups_limit_swap="false"
--cgroups_root="mesos" --container_disk_watch_interval="15secs" --containerizers="mesos" --credential="/tmp/Endpoint_SlaveEndpointTest_UnauthorizedRequest_2_QeVHgU/credential"
--default_role="*" --disk_watch_interval="1mins" --docker="docker" --docker_kill_orphans="true"
--docker_registry="https://registry-1.docker.io" --docker_remove_delay="6hrs" --docker_socket="/var/run/docker.sock"
--docker_stop_timeout="0ns" --docker_store_dir="/tmp/mesos/store/docker" --docker_volume_checkpoint_dir="/var/run/mesos/isolators/docker/volume"
--enforce_container_disk_quota="false" --executor_registration_timeout="1mins" --executor_shutdown_grace_period="5secs"
--fetcher_cache_dir="/tmp/Endpoint_SlaveEndpointTest_UnauthorizedRequest_2_QeVHgU/fetch" --fetcher_cache_size="2GB"
--frameworks_home="" --gc_delay="1weeks" --gc_disk_headroom="0.1" --hadoop_home="" --help="false"
--hostname_lookup="true" --http_authenticators="basic" --http_command_executor="false" --http_credentials="/tmp/Endpoint_SlaveEndpointTest_UnauthorizedRequest_2_QeVHgU/http_credentials"
--image_provisioner_backend="copy" --initialize_driver_logging="true" --isolation="posix/cpu,posix/mem"
--launcher="posix" --launcher_dir="/mesos/mesos-1.2.0/_build/src" --logbufsecs="0" --logging_level="INFO"
--max_completed_executors_per_framework="150" --oversubscribed_resources_interval="15secs"
--perf_duration="10secs" --perf_interval="1mins" --qos_correction_interval_min="0ns" --quiet="false"
--recover="reconnect" --recovery_timeout="15mins" --registration_backoff_factor="10ms" --resources="cpus:2;gpus:0;mem:1024;disk:1024;ports:[31000-32000]"
--revocable_cpu_low_priority="true" --runtime_dir="/tmp/Endpoint_SlaveEndpointTest_UnauthorizedRequest_2_QeVHgU"
--sandbox_directory="/mnt/mesos/sandbox" --strict="true" --switch_user="true" --systemd_enable_support="true"
--systemd_runtime_directory="/run/systemd/system" --version="false" --work_dir="/tmp/Endpoint_SlaveEndpointTest_UnauthorizedRequest_2_uwqqIF"
I1114 15:14:25.479243 28165 credentials.hpp:86] Loading credential for authentication from
'/tmp/Endpoint_SlaveEndpointTest_UnauthorizedRequest_2_QeVHgU/credential'
I1114 15:14:25.479377 28165 slave.cpp:346] Agent using credential for: test-principal
I1114 15:14:25.479398 28165 credentials.hpp:37] Loading credentials for authentication from
'/tmp/Endpoint_SlaveEndpointTest_UnauthorizedRequest_2_QeVHgU/http_credentials'
I1114 15:14:25.479590 28165 http.cpp:895] Using default 'basic' HTTP authenticator for realm
'mesos-agent-readonly'
I1114 15:14:25.479701 28165 http.cpp:895] Using default 'basic' HTTP authenticator for realm
'mesos-agent-readwrite'
I1114 15:14:25.480586 28165 slave.cpp:533] Agent resources: cpus(*):2; mem(*):1024; disk(*):1024;
ports(*):[31000-32000]
I1114 15:14:25.480659 28165 slave.cpp:541] Agent attributes: [  ]
I1114 15:14:25.480669 28165 slave.cpp:546] Agent hostname: 82bbc75e9372
I1114 15:14:25.482098 28171 state.cpp:57] Recovering state from '/tmp/Endpoint_SlaveEndpointTest_UnauthorizedRequest_2_uwqqIF/meta'
I1114 15:14:25.482975 28162 status_update_manager.cpp:203] Recovering status update manager
I1114 15:14:25.483353 28168 containerizer.cpp:561] Recovering containerizer
I1114 15:14:25.485126 28176 provisioner.cpp:253] Provisioner recovery complete
I1114 15:14:25.485524 28162 slave.cpp:5411] Finished recovery
I1114 15:14:25.486018 28162 slave.cpp:5585] Querying resource estimator for oversubscribable
resources
I1114 15:14:25.486277 28169 slave.cpp:5599] Received oversubscribable resources {} from the
resource estimator
I1114 15:14:25.488248 28170 process.cpp:3570] Handling HTTP event for process 'slave(648)'
with path: '/slave(648)/containers'
I1114 15:14:25.489512 28167 http.cpp:847] Authorizing principal 'test-principal' to GET the
'/containers' endpoint
I1114 15:14:25.492651 28173 slave.cpp:787] Agent terminating
[       OK ] Endpoint/SlaveEndpointTest.UnauthorizedRequest/2 (28 ms)
[ RUN      ] Endpoint/SlaveEndpointTest.NoAuthorizer/0
I1114 15:14:25.503887 28144 containerizer.cpp:202] Using isolation: posix/cpu,posix/mem,filesystem/posix,network/cni
W1114 15:14:25.504597 28144 backend.cpp:76] Failed to create 'aufs' backend: AufsBackend requires
root privileges, but is running as user mesos
W1114 15:14:25.504791 28144 backend.cpp:76] Failed to create 'bind' backend: BindBackend requires
root privileges
I1114 15:14:25.506361 28144 cluster.cpp:435] Creating default 'local' authorizer
I1114 15:14:25.508441 28176 slave.cpp:208] Mesos agent started on (649)@172.17.0.3:49951
I1114 15:14:25.508487 28176 slave.cpp:209] Flags at startup: --acls="" --appc_simple_discovery_uri_prefix="http://"
--appc_store_dir="/tmp/mesos/store/appc" --authenticate_http_readonly="true" --authenticate_http_readwrite="true"
--authenticatee="crammd5" --authentication_backoff_factor="1secs" --authorizer="local" --cgroups_cpu_enable_pids_and_tids_count="false"
--cgroups_enable_cfs="false" --cgroups_hierarchy="/sys/fs/cgroup" --cgroups_limit_swap="false"
--cgroups_root="mesos" --container_disk_watch_interval="15secs" --containerizers="mesos" --credential="/tmp/Endpoint_SlaveEndpointTest_NoAuthorizer_0_86oFJQ/credential"
--default_role="*" --disk_watch_interval="1mins" --docker="docker" --docker_kill_orphans="true"
--docker_registry="https://registry-1.docker.io" --docker_remove_delay="6hrs" --docker_socket="/var/run/docker.sock"
--docker_stop_timeout="0ns" --docker_store_dir="/tmp/mesos/store/docker" --docker_volume_checkpoint_dir="/var/run/mesos/isolators/docker/volume"
--enforce_container_disk_quota="false" --executor_registration_timeout="1mins" --executor_shutdown_grace_period="5secs"
--fetcher_cache_dir="/tmp/Endpoint_SlaveEndpointTest_NoAuthorizer_0_86oFJQ/fetch" --fetcher_cache_size="2GB"
--frameworks_home="" --gc_delay="1weeks" --gc_disk_headroom="0.1" --hadoop_home="" --help="false"
--hostname_lookup="true" --http_authenticators="basic" --http_command_executor="false" --http_credentials="/tmp/Endpoint_SlaveEndpointTest_NoAuthorizer_0_86oFJQ/http_credentials"
--image_provisioner_backend="copy" --initialize_driver_logging="true" --isolation="posix/cpu,posix/mem"
--launcher="posix" --launcher_dir="/mesos/mesos-1.2.0/_build/src" --logbufsecs="0" --logging_level="INFO"
--max_completed_executors_per_framework="150" --oversubscribed_resources_interval="15secs"
--perf_duration="10secs" --perf_interval="1mins" --qos_correction_interval_min="0ns" --quiet="false"
--recover="reconnect" --recovery_timeout="15mins" --registration_backoff_factor="10ms" --resources="cpus:2;gpus:0;mem:1024;disk:1024;ports:[31000-32000]"
--revocable_cpu_low_priority="true" --runtime_dir="/tmp/Endpoint_SlaveEndpointTest_NoAuthorizer_0_86oFJQ"
--sandbox_directory="/mnt/mesos/sandbox" --strict="true" --switch_user="true" --systemd_enable_support="true"
--systemd_runtime_directory="/run/systemd/system" --version="false" --work_dir="/tmp/Endpoint_SlaveEndpointTest_NoAuthorizer_0_Wv5I6B"
I1114 15:14:25.509109 28176 credentials.hpp:86] Loading credential for authentication from
'/tmp/Endpoint_SlaveEndpointTest_NoAuthorizer_0_86oFJQ/credential'
I1114 15:14:25.509338 28176 slave.cpp:346] Agent using credential for: test-principal
I1114 15:14:25.509366 28176 credentials.hpp:37] Loading credentials for authentication from
'/tmp/Endpoint_SlaveEndpointTest_NoAuthorizer_0_86oFJQ/http_credentials'
I1114 15:14:25.509663 28176 http.cpp:895] Using default 'basic' HTTP authenticator for realm
'mesos-agent-readonly'
I1114 15:14:25.509817 28176 http.cpp:895] Using default 'basic' HTTP authenticator for realm
'mesos-agent-readwrite'
I1114 15:14:25.511131 28176 slave.cpp:533] Agent resources: cpus(*):2; mem(*):1024; disk(*):1024;
ports(*):[31000-32000]
I1114 15:14:25.511229 28176 slave.cpp:541] Agent attributes: [  ]
I1114 15:14:25.511247 28176 slave.cpp:546] Agent hostname: 82bbc75e9372
I1114 15:14:25.512812 28177 state.cpp:57] Recovering state from '/tmp/Endpoint_SlaveEndpointTest_NoAuthorizer_0_Wv5I6B/meta'
I1114 15:14:25.513115 28164 status_update_manager.cpp:203] Recovering status update manager
I1114 15:14:25.513381 28172 containerizer.cpp:561] Recovering containerizer
I1114 15:14:25.515426 28174 provisioner.cpp:253] Provisioner recovery complete
I1114 15:14:25.516050 28165 slave.cpp:5411] Finished recovery
I1114 15:14:25.516597 28165 slave.cpp:5585] Querying resource estimator for oversubscribable
resources
I1114 15:14:25.516916 28170 slave.cpp:5599] Received oversubscribable resources {} from the
resource estimator
I1114 15:14:25.518854 28171 process.cpp:3570] Handling HTTP event for process 'slave(649)'
with path: '/slave(649)/monitor/statistics'
I1114 15:14:25.520027 28163 http.cpp:847] Authorizing principal 'test-principal' to GET the
'/monitor/statistics' endpoint
I1114 15:14:25.523991 28162 slave.cpp:787] Agent terminating
[       OK ] Endpoint/SlaveEndpointTest.NoAuthorizer/0 (31 ms)
[ RUN      ] Endpoint/SlaveEndpointTest.NoAuthorizer/1
I1114 15:14:25.534919 28144 containerizer.cpp:202] Using isolation: posix/cpu,posix/mem,filesystem/posix,network/cni
W1114 15:14:25.535477 28144 backend.cpp:76] Failed to create 'aufs' backend: AufsBackend requires
root privileges, but is running as user mesos
W1114 15:14:25.535642 28144 backend.cpp:76] Failed to create 'bind' backend: BindBackend requires
root privileges
I1114 15:14:25.537636 28144 cluster.cpp:435] Creating default 'local' authorizer
I1114 15:14:25.539300 28176 slave.cpp:208] Mesos agent started on (650)@172.17.0.3:49951
I1114 15:14:25.539343 28176 slave.cpp:209] Flags at startup: --acls="" --appc_simple_discovery_uri_prefix="http://"
--appc_store_dir="/tmp/mesos/store/appc" --authenticate_http_readonly="true" --authenticate_http_readwrite="true"
--authenticatee="crammd5" --authentication_backoff_factor="1secs" --authorizer="local" --cgroups_cpu_enable_pids_and_tids_count="false"
--cgroups_enable_cfs="false" --cgroups_hierarchy="/sys/fs/cgroup" --cgroups_limit_swap="false"
--cgroups_root="mesos" --container_disk_watch_interval="15secs" --containerizers="mesos" --credential="/tmp/Endpoint_SlaveEndpointTest_NoAuthorizer_1_PKENwN/credential"
--default_role="*" --disk_watch_interval="1mins" --docker="docker" --docker_kill_orphans="true"
--docker_registry="https://registry-1.docker.io" --docker_remove_delay="6hrs" --docker_socket="/var/run/docker.sock"
--docker_stop_timeout="0ns" --docker_store_dir="/tmp/mesos/store/docker" --docker_volume_checkpoint_dir="/var/run/mesos/isolators/docker/volume"
--enforce_container_disk_quota="false" --executor_registration_timeout="1mins" --executor_shutdown_grace_period="5secs"
--fetcher_cache_dir="/tmp/Endpoint_SlaveEndpointTest_NoAuthorizer_1_PKENwN/fetch" --fetcher_cache_size="2GB"
--frameworks_home="" --gc_delay="1weeks" --gc_disk_headroom="0.1" --hadoop_home="" --help="false"
--hostname_lookup="true" --http_authenticators="basic" --http_command_executor="false" --http_credentials="/tmp/Endpoint_SlaveEndpointTest_NoAuthorizer_1_PKENwN/http_credentials"
--image_provisioner_backend="copy" --initialize_driver_logging="true" --isolation="posix/cpu,posix/mem"
--launcher="posix" --launcher_dir="/mesos/mesos-1.2.0/_build/src" --logbufsecs="0" --logging_level="INFO"
--max_completed_executors_per_framework="150" --oversubscribed_resources_interval="15secs"
--perf_duration="10secs" --perf_interval="1mins" --qos_correction_interval_min="0ns" --quiet="false"
--recover="reconnect" --recovery_timeout="15mins" --registration_backoff_factor="10ms" --resources="cpus:2;gpus:0;mem:1024;disk:1024;ports:[31000-32000]"
--revocable_cpu_low_priority="true" --runtime_dir="/tmp/Endpoint_SlaveEndpointTest_NoAuthorizer_1_PKENwN"
--sandbox_directory="/mnt/mesos/sandbox" --strict="true" --switch_user="true" --systemd_enable_support="true"
--systemd_runtime_directory="/run/systemd/system" --version="false" --work_dir="/tmp/Endpoint_SlaveEndpointTest_NoAuthorizer_1_L4VMOy"
I1114 15:14:25.539961 28176 credentials.hpp:86] Loading credential for authentication from
'/tmp/Endpoint_SlaveEndpointTest_NoAuthorizer_1_PKENwN/credential'
I1114 15:14:25.540177 28176 slave.cpp:346] Agent using credential for: test-principal
I1114 15:14:25.540206 28176 credentials.hpp:37] Loading credentials for authentication from
'/tmp/Endpoint_SlaveEndpointTest_NoAuthorizer_1_PKENwN/http_credentials'
I1114 15:14:25.540474 28176 http.cpp:895] Using default 'basic' HTTP authenticator for realm
'mesos-agent-readonly'
I1114 15:14:25.540630 28176 http.cpp:895] Using default 'basic' HTTP authenticator for realm
'mesos-agent-readwrite'
I1114 15:14:25.542001 28176 slave.cpp:533] Agent resources: cpus(*):2; mem(*):1024; disk(*):1024;
ports(*):[31000-32000]
I1114 15:14:25.542104 28176 slave.cpp:541] Agent attributes: [  ]
I1114 15:14:25.542130 28176 slave.cpp:546] Agent hostname: 82bbc75e9372
I1114 15:14:25.543472 28175 state.cpp:57] Recovering state from '/tmp/Endpoint_SlaveEndpointTest_NoAuthorizer_1_L4VMOy/meta'
I1114 15:14:25.544016 28173 status_update_manager.cpp:203] Recovering status update manager
I1114 15:14:25.544450 28174 containerizer.cpp:561] Recovering containerizer
I1114 15:14:25.545927 28170 provisioner.cpp:253] Provisioner recovery complete
I1114 15:14:25.546488 28174 slave.cpp:5411] Finished recovery
I1114 15:14:25.547125 28174 slave.cpp:5585] Querying resource estimator for oversubscribable
resources
I1114 15:14:25.547464 28164 slave.cpp:5599] Received oversubscribable resources {} from the
resource estimator
I1114 15:14:25.549341 28168 process.cpp:3570] Handling HTTP event for process 'slave(650)'
with path: '/slave(650)/monitor/statistics.json'
I1114 15:14:25.550285 28163 http.cpp:847] Authorizing principal 'test-principal' to GET the
'/monitor/statistics.json' endpoint
I1114 15:14:25.554949 28169 slave.cpp:787] Agent terminating
[       OK ] Endpoint/SlaveEndpointTest.NoAuthorizer/1 (30 ms)
[ RUN      ] Endpoint/SlaveEndpointTest.NoAuthorizer/2
I1114 15:14:25.566567 28144 containerizer.cpp:202] Using isolation: posix/cpu,posix/mem,filesystem/posix,network/cni
W1114 15:14:25.567266 28144 backend.cpp:76] Failed to create 'aufs' backend: AufsBackend requires
root privileges, but is running as user mesos
W1114 15:14:25.567445 28144 backend.cpp:76] Failed to create 'bind' backend: BindBackend requires
root privileges
I1114 15:14:25.569000 28144 cluster.cpp:435] Creating default 'local' authorizer
I1114 15:14:25.570854 28174 slave.cpp:208] Mesos agent started on (651)@172.17.0.3:49951
I1114 15:14:25.570907 28174 slave.cpp:209] Flags at startup: --acls="" --appc_simple_discovery_uri_prefix="http://"
--appc_store_dir="/tmp/mesos/store/appc" --authenticate_http_readonly="true" --authenticate_http_readwrite="true"
--authenticatee="crammd5" --authentication_backoff_factor="1secs" --authorizer="local" --cgroups_cpu_enable_pids_and_tids_count="false"
--cgroups_enable_cfs="false" --cgroups_hierarchy="/sys/fs/cgroup" --cgroups_limit_swap="false"
--cgroups_root="mesos" --container_disk_watch_interval="15secs" --containerizers="mesos" --credential="/tmp/Endpoint_SlaveEndpointTest_NoAuthorizer_2_FLSaEK/credential"
--default_role="*" --disk_watch_interval="1mins" --docker="docker" --docker_kill_orphans="true"
--docker_registry="https://registry-1.docker.io" --docker_remove_delay="6hrs" --docker_socket="/var/run/docker.sock"
--docker_stop_timeout="0ns" --docker_store_dir="/tmp/mesos/store/docker" --docker_volume_checkpoint_dir="/var/run/mesos/isolators/docker/volume"
--enforce_container_disk_quota="false" --executor_registration_timeout="1mins" --executor_shutdown_grace_period="5secs"
--fetcher_cache_dir="/tmp/Endpoint_SlaveEndpointTest_NoAuthorizer_2_FLSaEK/fetch" --fetcher_cache_size="2GB"
--frameworks_home="" --gc_delay="1weeks" --gc_disk_headroom="0.1" --hadoop_home="" --help="false"
--hostname_lookup="true" --http_authenticators="basic" --http_command_executor="false" --http_credentials="/tmp/Endpoint_SlaveEndpointTest_NoAuthorizer_2_FLSaEK/http_credentials"
--image_provisioner_backend="copy" --initialize_driver_logging="true" --isolation="posix/cpu,posix/mem"
--launcher="posix" --launcher_dir="/mesos/mesos-1.2.0/_build/src" --logbufsecs="0" --logging_level="INFO"
--max_completed_executors_per_framework="150" --oversubscribed_resources_interval="15secs"
--perf_duration="10secs" --perf_interval="1mins" --qos_correction_interval_min="0ns" --quiet="false"
--recover="reconnect" --recovery_timeout="15mins" --registration_backoff_factor="10ms" --resources="cpus:2;gpus:0;mem:1024;disk:1024;ports:[31000-32000]"
--revocable_cpu_low_priority="true" --runtime_dir="/tmp/Endpoint_SlaveEndpointTest_NoAuthorizer_2_FLSaEK"
--sandbox_directory="/mnt/mesos/sandbox" --strict="true" --switch_user="true" --systemd_enable_support="true"
--systemd_runtime_directory="/run/systemd/system" --version="false" --work_dir="/tmp/Endpoint_SlaveEndpointTest_NoAuthorizer_2_96K3Qv"
I1114 15:14:25.571497 28174 credentials.hpp:86] Loading credential for authentication from
'/tmp/Endpoint_SlaveEndpointTest_NoAuthorizer_2_FLSaEK/credential'
I1114 15:14:25.571645 28174 slave.cpp:346] Agent using credential for: test-principal
I1114 15:14:25.571672 28174 credentials.hpp:37] Loading credentials for authentication from
'/tmp/Endpoint_SlaveEndpointTest_NoAuthorizer_2_FLSaEK/http_credentials'
I1114 15:14:25.571944 28174 http.cpp:895] Using default 'basic' HTTP authenticator for realm
'mesos-agent-readonly'
I1114 15:14:25.572082 28174 http.cpp:895] Using default 'basic' HTTP authenticator for realm
'mesos-agent-readwrite'
I1114 15:14:25.573302 28174 slave.cpp:533] Agent resources: cpus(*):2; mem(*):1024; disk(*):1024;
ports(*):[31000-32000]
I1114 15:14:25.573387 28174 slave.cpp:541] Agent attributes: [  ]
I1114 15:14:25.573400 28174 slave.cpp:546] Agent hostname: 82bbc75e9372
I1114 15:14:25.574972 28165 state.cpp:57] Recovering state from '/tmp/Endpoint_SlaveEndpointTest_NoAuthorizer_2_96K3Qv/meta'
I1114 15:14:25.575264 28164 status_update_manager.cpp:203] Recovering status update manager
I1114 15:14:25.575491 28164 containerizer.cpp:561] Recovering containerizer
I1114 15:14:25.577261 28173 provisioner.cpp:253] Provisioner recovery complete
I1114 15:14:25.577745 28174 slave.cpp:5411] Finished recovery
I1114 15:14:25.578249 28174 slave.cpp:5585] Querying resource estimator for oversubscribable
resources
I1114 15:14:25.578590 28171 slave.cpp:5599] Received oversubscribable resources {} from the
resource estimator
I1114 15:14:25.580258 28163 process.cpp:3570] Handling HTTP event for process 'slave(651)'
with path: '/slave(651)/containers'
I1114 15:14:25.581219 28163 http.cpp:847] Authorizing principal 'test-principal' to GET the
'/containers' endpoint
I1114 15:14:25.585788 28162 slave.cpp:787] Agent terminating
[       OK ] Endpoint/SlaveEndpointTest.NoAuthorizer/2 (30 ms)
[----------] 9 tests from Endpoint/SlaveEndpointTest (271 ms total)

[----------] Global test environment tear-down
[==========] 1378 tests from 156 test cases ran. (562181 ms total)
[  PASSED  ] 1376 tests.
[  FAILED  ] 2 tests, listed below:
[  FAILED  ] MasterTest.KillTask
[  FAILED  ] MesosContainerizer/DefaultExecutorTest.TaskUsesExecutor/0, where GetParam() =
"mesos"

 2 FAILED TESTS
  YOU HAVE 4 DISABLED TESTS

make[4]: *** [check-local] Error 1
make[4]: Leaving directory `/mesos/mesos-1.2.0/_build/src'
make[3]: *** [check-am] Error 2
make[3]: Leaving directory `/mesos/mesos-1.2.0/_build/src'
make[2]: *** [check] Error 2
make[2]: Leaving directory `/mesos/mesos-1.2.0/_build/src'
make[1]: *** [check-recursive] Error 1
make[1]: Leaving directory `/mesos/mesos-1.2.0/_build'
make: *** [distcheck] Error 1
+ docker rmi mesos-1479133924-29757
Untagged: mesos-1479133924-29757:latest
Deleted: sha256:ce6ca02dc26c2e1d6cf1727a254e56fee9a347e2d5913e4081ecde346fb97d49
Deleted: sha256:e1c76aa8c673abf2caae725cd6901ccd1793abe0e376462e19bfd48d0dfc88af
Deleted: sha256:8ca6d0380128ae26f4aa245a0268252a4404f9b95e29a404746f14ab3de52663
Deleted: sha256:9eca53c55c4c3a27c4d039ae590d997da506566afd2650b9f71c9aa4f2fce2e5
Deleted: sha256:ab687f26a114ba180055f8a510420cf048934bbd18a10968a32aabe5bfc905f5
Deleted: sha256:4ecd5d1456fec6dcde80fc7269144d854feb36b73166abc5049a3538ebfed6f9
Deleted: sha256:e369b2e0c491180c39d59686f875975be281d58c19a6481e5deb8edfddcf3646
Deleted: sha256:a30fddd1e9fe17c6752820eda880e3a6c30f6f288882813e9fab4dbf0e005e76
Deleted: sha256:d72a4ac382edb30284492d04c93ae715a18e78d7c951ba0733885add12d67f08
Deleted: sha256:ba3b0e00acd899250a4bbc65572ccf08106867963af22faf4eb045f90da028b4
Deleted: sha256:1e7fd7f9e466620517e7274da6525cb507ca63ba070eb6be8ff7dc7150e69481
Deleted: sha256:ea2a00956486269eb889a7fc2c217cb53fd5b1412ca6432ab01d60f50b5fdd2a
Deleted: sha256:3283b4828d7d503d2e936e7734ef6676be9ba8588fe29c3a279e42685376e469
Deleted: sha256:fb384ab7241e64bdf0e59375a26e3a1eb872c80cab19cdc27dc827e89df9f822
Deleted: sha256:eeb5b7670c635e2a383f402c914c1fdb4eb29fc8b4a86c6c5221d74e2a15f7e8
Deleted: sha256:6e88b5927d3163440e7d9164ee067754fb9d5df9369822608b6e8061b8a0b5d2
Deleted: sha256:70a46d58896a5bab85aa70c8d56274bcd389ec8d67598cbd383fc7963eb4d71e
Deleted: sha256:110b8a45eb742109d5ede4ca3086088e3377aa524d1396f20167b882ad462b22
Deleted: sha256:91d92e730e97562060e55de4c46bf57c300d0434c5edb0fa300c9a796c48a7c9
Deleted: sha256:bfc23e3b49b510d28f521055b5fed66e88c486e6ab8d980febe6d9abb311db78
Deleted: sha256:91d023bd8abb3078d71e50baaf901c47ac02cdfb3b7189f8e32c964bbf7bbcb4
Deleted: sha256:bc701ab033add9493f3fa2f809abc8002fab9d841802d7d65531b71b3b7183f4
Deleted: sha256:0af6e08010500e1307b98084e80f793ad212358bbf9a10e7c6b76308d069b2f0
Deleted: sha256:3ad15c3fc0fdbe742d260edf2f1eda1dd399b94bb5f5986590afcbbe9859dc5b
Build step 'Execute shell' marked build as failure

Mime
View raw message