mesos-builds mailing list archives

Site index · List index
Message view « Date » · « Thread »
Top « Date » · « Thread »
From Apache Jenkins Server <jenk...@builds.apache.org>
Subject Build failed in Jenkins: mesos-reviewbot #16000
Date Tue, 08 Nov 2016 04:54:48 GMT
See <https://builds.apache.org/job/mesos-reviewbot/16000/>

------------------------------------------
[...truncated 224612 lines...]
I1108 04:54:15.932001 29704 containerizer.cpp:201] Using isolation: posix/cpu,posix/mem,filesystem/posix,network/cni
W1108 04:54:15.932870 29704 backend.cpp:76] Failed to create 'aufs' backend: AufsBackend requires
root privileges, but is running as user mesos
W1108 04:54:15.933017 29704 backend.cpp:76] Failed to create 'bind' backend: BindBackend requires
root privileges
I1108 04:54:15.936004 29725 slave.cpp:208] Mesos agent started on (644)@172.17.0.3:58726
I1108 04:54:15.936030 29725 slave.cpp:209] Flags at startup: --acls="" --appc_simple_discovery_uri_prefix="http://"
--appc_store_dir="/tmp/mesos/store/appc" --authenticate_http_readonly="true" --authenticate_http_readwrite="true"
--authenticatee="crammd5" --authentication_backoff_factor="1secs" --authorizer="local" --cgroups_cpu_enable_pids_and_tids_count="false"
--cgroups_enable_cfs="false" --cgroups_hierarchy="/sys/fs/cgroup" --cgroups_limit_swap="false"
--cgroups_root="mesos" --container_disk_watch_interval="15secs" --containerizers="mesos" --credential="/tmp/Endpoint_SlaveEndpointTest_AuthorizedRequest_1_pPYjnG/credential"
--default_role="*" --disk_watch_interval="1mins" --docker="docker" --docker_kill_orphans="true"
--docker_registry="https://registry-1.docker.io" --docker_remove_delay="6hrs" --docker_socket="/var/run/docker.sock"
--docker_stop_timeout="0ns" --docker_store_dir="/tmp/mesos/store/docker" --docker_volume_checkpoint_dir="/var/run/mesos/isolators/docker/volume"
--enforce_container_disk_quota="false" --executor_registration_timeout="1mins" --executor_shutdown_grace_period="5secs"
--fetcher_cache_dir="/tmp/Endpoint_SlaveEndpointTest_AuthorizedRequest_1_pPYjnG/fetch" --fetcher_cache_size="2GB"
--frameworks_home="" --gc_delay="1weeks" --gc_disk_headroom="0.1" --hadoop_home="" --help="false"
--hostname_lookup="true" --http_authenticators="basic" --http_command_executor="false" --http_credentials="/tmp/Endpoint_SlaveEndpointTest_AuthorizedRequest_1_pPYjnG/http_credentials"
--image_provisioner_backend="copy" --initialize_driver_logging="true" --isolation="posix/cpu,posix/mem"
--launcher="posix" --launcher_dir="/mesos/mesos-1.2.0/_build/src" --logbufsecs="0" --logging_level="INFO"
--max_completed_executors_per_framework="150" --oversubscribed_resources_interval="15secs"
--perf_duration="10secs" --perf_interval="1mins" --qos_correction_interval_min="0ns" --quiet="false"
--recover="reconnect" --recovery_timeout="15mins" --registration_backoff_factor="10ms" --resources="cpus:2;gpus:0;mem:1024;disk:1024;ports:[31000-32000]"
--revocable_cpu_low_priority="true" --runtime_dir="/tmp/Endpoint_SlaveEndpointTest_AuthorizedRequest_1_pPYjnG"
--sandbox_directory="/mnt/mesos/sandbox" --strict="true" --switch_user="true" --systemd_enable_support="true"
--systemd_runtime_directory="/run/systemd/system" --version="false" --work_dir="/tmp/Endpoint_SlaveEndpointTest_AuthorizedRequest_1_N4wdLe"
I1108 04:54:15.936545 29725 credentials.hpp:86] Loading credential for authentication from
'/tmp/Endpoint_SlaveEndpointTest_AuthorizedRequest_1_pPYjnG/credential'
I1108 04:54:15.936700 29725 slave.cpp:346] Agent using credential for: test-principal
I1108 04:54:15.936722 29725 credentials.hpp:37] Loading credentials for authentication from
'/tmp/Endpoint_SlaveEndpointTest_AuthorizedRequest_1_pPYjnG/http_credentials'
I1108 04:54:15.936931 29725 http.cpp:895] Using default 'basic' HTTP authenticator for realm
'mesos-agent-readonly'
I1108 04:54:15.937062 29725 http.cpp:895] Using default 'basic' HTTP authenticator for realm
'mesos-agent-readwrite'
I1108 04:54:15.938079 29725 slave.cpp:533] Agent resources: cpus(*):2; mem(*):1024; disk(*):1024;
ports(*):[31000-32000]
I1108 04:54:15.938154 29725 slave.cpp:541] Agent attributes: [  ]
I1108 04:54:15.938168 29725 slave.cpp:546] Agent hostname: 001e3f1e27a4
I1108 04:54:15.939401 29731 state.cpp:57] Recovering state from '/tmp/Endpoint_SlaveEndpointTest_AuthorizedRequest_1_N4wdLe/meta'
I1108 04:54:15.939694 29734 status_update_manager.cpp:203] Recovering status update manager
I1108 04:54:15.940052 29733 containerizer.cpp:557] Recovering containerizer
I1108 04:54:15.941267 29728 provisioner.cpp:253] Provisioner recovery complete
I1108 04:54:15.941628 29723 slave.cpp:5411] Finished recovery
I1108 04:54:15.942183 29723 slave.cpp:5585] Querying resource estimator for oversubscribable
resources
I1108 04:54:15.942456 29734 slave.cpp:5599] Received oversubscribable resources {} from the
resource estimator
I1108 04:54:15.944383 29735 process.cpp:3570] Handling HTTP event for process 'slave(644)'
with path: '/slave(644)/monitor/statistics.json'
I1108 04:54:15.945221 29733 http.cpp:847] Authorizing principal 'test-principal' to GET the
'/monitor/statistics.json' endpoint
I1108 04:54:15.948696 29735 slave.cpp:787] Agent terminating
[       OK ] Endpoint/SlaveEndpointTest.AuthorizedRequest/1 (25 ms)
[ RUN      ] Endpoint/SlaveEndpointTest.AuthorizedRequest/2
I1108 04:54:15.966716 29704 containerizer.cpp:201] Using isolation: posix/cpu,posix/mem,filesystem/posix,network/cni
W1108 04:54:15.967470 29704 backend.cpp:76] Failed to create 'aufs' backend: AufsBackend requires
root privileges, but is running as user mesos
W1108 04:54:15.967628 29704 backend.cpp:76] Failed to create 'bind' backend: BindBackend requires
root privileges
I1108 04:54:15.970944 29736 slave.cpp:208] Mesos agent started on (645)@172.17.0.3:58726
I1108 04:54:15.970973 29736 slave.cpp:209] Flags at startup: --acls="" --appc_simple_discovery_uri_prefix="http://"
--appc_store_dir="/tmp/mesos/store/appc" --authenticate_http_readonly="true" --authenticate_http_readwrite="true"
--authenticatee="crammd5" --authentication_backoff_factor="1secs" --authorizer="local" --cgroups_cpu_enable_pids_and_tids_count="false"
--cgroups_enable_cfs="false" --cgroups_hierarchy="/sys/fs/cgroup" --cgroups_limit_swap="false"
--cgroups_root="mesos" --container_disk_watch_interval="15secs" --containerizers="mesos" --credential="/tmp/Endpoint_SlaveEndpointTest_AuthorizedRequest_2_dfeY7s/credential"
--default_role="*" --disk_watch_interval="1mins" --docker="docker" --docker_kill_orphans="true"
--docker_registry="https://registry-1.docker.io" --docker_remove_delay="6hrs" --docker_socket="/var/run/docker.sock"
--docker_stop_timeout="0ns" --docker_store_dir="/tmp/mesos/store/docker" --docker_volume_checkpoint_dir="/var/run/mesos/isolators/docker/volume"
--enforce_container_disk_quota="false" --executor_registration_timeout="1mins" --executor_shutdown_grace_period="5secs"
--fetcher_cache_dir="/tmp/Endpoint_SlaveEndpointTest_AuthorizedRequest_2_dfeY7s/fetch" --fetcher_cache_size="2GB"
--frameworks_home="" --gc_delay="1weeks" --gc_disk_headroom="0.1" --hadoop_home="" --help="false"
--hostname_lookup="true" --http_authenticators="basic" --http_command_executor="false" --http_credentials="/tmp/Endpoint_SlaveEndpointTest_AuthorizedRequest_2_dfeY7s/http_credentials"
--image_provisioner_backend="copy" --initialize_driver_logging="true" --isolation="posix/cpu,posix/mem"
--launcher="posix" --launcher_dir="/mesos/mesos-1.2.0/_build/src" --logbufsecs="0" --logging_level="INFO"
--max_completed_executors_per_framework="150" --oversubscribed_resources_interval="15secs"
--perf_duration="10secs" --perf_interval="1mins" --qos_correction_interval_min="0ns" --quiet="false"
--recover="reconnect" --recovery_timeout="15mins" --registration_backoff_factor="10ms" --resources="cpus:2;gpus:0;mem:1024;disk:1024;ports:[31000-32000]"
--revocable_cpu_low_priority="true" --runtime_dir="/tmp/Endpoint_SlaveEndpointTest_AuthorizedRequest_2_dfeY7s"
--sandbox_directory="/mnt/mesos/sandbox" --strict="true" --switch_user="true" --systemd_enable_support="true"
--systemd_runtime_directory="/run/systemd/system" --version="false" --work_dir="/tmp/Endpoint_SlaveEndpointTest_AuthorizedRequest_2_JZbjq1"
I1108 04:54:15.971457 29736 credentials.hpp:86] Loading credential for authentication from
'/tmp/Endpoint_SlaveEndpointTest_AuthorizedRequest_2_dfeY7s/credential'
I1108 04:54:15.971680 29736 slave.cpp:346] Agent using credential for: test-principal
I1108 04:54:15.971705 29736 credentials.hpp:37] Loading credentials for authentication from
'/tmp/Endpoint_SlaveEndpointTest_AuthorizedRequest_2_dfeY7s/http_credentials'
I1108 04:54:15.971994 29736 http.cpp:895] Using default 'basic' HTTP authenticator for realm
'mesos-agent-readonly'
I1108 04:54:15.972160 29736 http.cpp:895] Using default 'basic' HTTP authenticator for realm
'mesos-agent-readwrite'
I1108 04:54:15.973250 29736 slave.cpp:533] Agent resources: cpus(*):2; mem(*):1024; disk(*):1024;
ports(*):[31000-32000]
I1108 04:54:15.973327 29736 slave.cpp:541] Agent attributes: [  ]
I1108 04:54:15.973348 29736 slave.cpp:546] Agent hostname: 001e3f1e27a4
I1108 04:54:15.974723 29733 state.cpp:57] Recovering state from '/tmp/Endpoint_SlaveEndpointTest_AuthorizedRequest_2_JZbjq1/meta'
I1108 04:54:15.975106 29728 status_update_manager.cpp:203] Recovering status update manager
I1108 04:54:15.975299 29737 containerizer.cpp:557] Recovering containerizer
I1108 04:54:15.976732 29731 provisioner.cpp:253] Provisioner recovery complete
I1108 04:54:15.977186 29738 slave.cpp:5411] Finished recovery
I1108 04:54:15.977721 29738 slave.cpp:5585] Querying resource estimator for oversubscribable
resources
I1108 04:54:15.977955 29733 slave.cpp:5599] Received oversubscribable resources {} from the
resource estimator
I1108 04:54:15.979882 29725 process.cpp:3570] Handling HTTP event for process 'slave(645)'
with path: '/slave(645)/containers'
I1108 04:54:15.980809 29726 http.cpp:847] Authorizing principal 'test-principal' to GET the
'/containers' endpoint
I1108 04:54:15.984002 29732 slave.cpp:787] Agent terminating
[       OK ] Endpoint/SlaveEndpointTest.AuthorizedRequest/2 (27 ms)
[ RUN      ] Endpoint/SlaveEndpointTest.UnauthorizedRequest/0
I1108 04:54:15.993921 29704 containerizer.cpp:201] Using isolation: posix/cpu,posix/mem,filesystem/posix,network/cni
W1108 04:54:15.994663 29704 backend.cpp:76] Failed to create 'aufs' backend: AufsBackend requires
root privileges, but is running as user mesos
W1108 04:54:15.994814 29704 backend.cpp:76] Failed to create 'bind' backend: BindBackend requires
root privileges
I1108 04:54:15.997766 29733 slave.cpp:208] Mesos agent started on (646)@172.17.0.3:58726
I1108 04:54:15.997791 29733 slave.cpp:209] Flags at startup: --acls="" --appc_simple_discovery_uri_prefix="http://"
--appc_store_dir="/tmp/mesos/store/appc" --authenticate_http_readonly="true" --authenticate_http_readwrite="true"
--authenticatee="crammd5" --authentication_backoff_factor="1secs" --authorizer="local" --cgroups_cpu_enable_pids_and_tids_count="false"
--cgroups_enable_cfs="false" --cgroups_hierarchy="/sys/fs/cgroup" --cgroups_limit_swap="false"
--cgroups_root="mesos" --container_disk_watch_interval="15secs" --containerizers="mesos" --credential="/tmp/Endpoint_SlaveEndpointTest_UnauthorizedRequest_0_xCSGbg/credential"
--default_role="*" --disk_watch_interval="1mins" --docker="docker" --docker_kill_orphans="true"
--docker_registry="https://registry-1.docker.io" --docker_remove_delay="6hrs" --docker_socket="/var/run/docker.sock"
--docker_stop_timeout="0ns" --docker_store_dir="/tmp/mesos/store/docker" --docker_volume_checkpoint_dir="/var/run/mesos/isolators/docker/volume"
--enforce_container_disk_quota="false" --executor_registration_timeout="1mins" --executor_shutdown_grace_period="5secs"
--fetcher_cache_dir="/tmp/Endpoint_SlaveEndpointTest_UnauthorizedRequest_0_xCSGbg/fetch" --fetcher_cache_size="2GB"
--frameworks_home="" --gc_delay="1weeks" --gc_disk_headroom="0.1" --hadoop_home="" --help="false"
--hostname_lookup="true" --http_authenticators="basic" --http_command_executor="false" --http_credentials="/tmp/Endpoint_SlaveEndpointTest_UnauthorizedRequest_0_xCSGbg/http_credentials"
--image_provisioner_backend="copy" --initialize_driver_logging="true" --isolation="posix/cpu,posix/mem"
--launcher="posix" --launcher_dir="/mesos/mesos-1.2.0/_build/src" --logbufsecs="0" --logging_level="INFO"
--max_completed_executors_per_framework="150" --oversubscribed_resources_interval="15secs"
--perf_duration="10secs" --perf_interval="1mins" --qos_correction_interval_min="0ns" --quiet="false"
--recover="reconnect" --recovery_timeout="15mins" --registration_backoff_factor="10ms" --resources="cpus:2;gpus:0;mem:1024;disk:1024;ports:[31000-32000]"
--revocable_cpu_low_priority="true" --runtime_dir="/tmp/Endpoint_SlaveEndpointTest_UnauthorizedRequest_0_xCSGbg"
--sandbox_directory="/mnt/mesos/sandbox" --strict="true" --switch_user="true" --systemd_enable_support="true"
--systemd_runtime_directory="/run/systemd/system" --version="false" --work_dir="/tmp/Endpoint_SlaveEndpointTest_UnauthorizedRequest_0_vrABpO"
I1108 04:54:15.998276 29733 credentials.hpp:86] Loading credential for authentication from
'/tmp/Endpoint_SlaveEndpointTest_UnauthorizedRequest_0_xCSGbg/credential'
I1108 04:54:15.998422 29733 slave.cpp:346] Agent using credential for: test-principal
I1108 04:54:15.998450 29733 credentials.hpp:37] Loading credentials for authentication from
'/tmp/Endpoint_SlaveEndpointTest_UnauthorizedRequest_0_xCSGbg/http_credentials'
I1108 04:54:15.998729 29733 http.cpp:895] Using default 'basic' HTTP authenticator for realm
'mesos-agent-readonly'
I1108 04:54:15.998862 29733 http.cpp:895] Using default 'basic' HTTP authenticator for realm
'mesos-agent-readwrite'
I1108 04:54:15.999883 29733 slave.cpp:533] Agent resources: cpus(*):2; mem(*):1024; disk(*):1024;
ports(*):[31000-32000]
I1108 04:54:15.999979 29733 slave.cpp:541] Agent attributes: [  ]
I1108 04:54:16.000000 29733 slave.cpp:546] Agent hostname: 001e3f1e27a4
I1108 04:54:16.001381 29736 state.cpp:57] Recovering state from '/tmp/Endpoint_SlaveEndpointTest_UnauthorizedRequest_0_vrABpO/meta'
I1108 04:54:16.001767 29731 status_update_manager.cpp:203] Recovering status update manager
I1108 04:54:16.001936 29732 containerizer.cpp:557] Recovering containerizer
I1108 04:54:16.003253 29726 provisioner.cpp:253] Provisioner recovery complete
I1108 04:54:16.003681 29723 slave.cpp:5411] Finished recovery
I1108 04:54:16.004331 29723 slave.cpp:5585] Querying resource estimator for oversubscribable
resources
I1108 04:54:16.004592 29726 slave.cpp:5599] Received oversubscribable resources {} from the
resource estimator
I1108 04:54:16.006307 29727 process.cpp:3570] Handling HTTP event for process 'slave(646)'
with path: '/slave(646)/monitor/statistics'
I1108 04:54:16.007081 29737 http.cpp:847] Authorizing principal 'test-principal' to GET the
'/monitor/statistics' endpoint
I1108 04:54:16.009593 29732 slave.cpp:787] Agent terminating
[       OK ] Endpoint/SlaveEndpointTest.UnauthorizedRequest/0 (25 ms)
[ RUN      ] Endpoint/SlaveEndpointTest.UnauthorizedRequest/1
I1108 04:54:16.018115 29704 containerizer.cpp:201] Using isolation: posix/cpu,posix/mem,filesystem/posix,network/cni
W1108 04:54:16.018688 29704 backend.cpp:76] Failed to create 'aufs' backend: AufsBackend requires
root privileges, but is running as user mesos
W1108 04:54:16.018833 29704 backend.cpp:76] Failed to create 'bind' backend: BindBackend requires
root privileges
I1108 04:54:16.021364 29736 slave.cpp:208] Mesos agent started on (647)@172.17.0.3:58726
I1108 04:54:16.021387 29736 slave.cpp:209] Flags at startup: --acls="" --appc_simple_discovery_uri_prefix="http://"
--appc_store_dir="/tmp/mesos/store/appc" --authenticate_http_readonly="true" --authenticate_http_readwrite="true"
--authenticatee="crammd5" --authentication_backoff_factor="1secs" --authorizer="local" --cgroups_cpu_enable_pids_and_tids_count="false"
--cgroups_enable_cfs="false" --cgroups_hierarchy="/sys/fs/cgroup" --cgroups_limit_swap="false"
--cgroups_root="mesos" --container_disk_watch_interval="15secs" --containerizers="mesos" --credential="/tmp/Endpoint_SlaveEndpointTest_UnauthorizedRequest_1_VsXTv3/credential"
--default_role="*" --disk_watch_interval="1mins" --docker="docker" --docker_kill_orphans="true"
--docker_registry="https://registry-1.docker.io" --docker_remove_delay="6hrs" --docker_socket="/var/run/docker.sock"
--docker_stop_timeout="0ns" --docker_store_dir="/tmp/mesos/store/docker" --docker_volume_checkpoint_dir="/var/run/mesos/isolators/docker/volume"
--enforce_container_disk_quota="false" --executor_registration_timeout="1mins" --executor_shutdown_grace_period="5secs"
--fetcher_cache_dir="/tmp/Endpoint_SlaveEndpointTest_UnauthorizedRequest_1_VsXTv3/fetch" --fetcher_cache_size="2GB"
--frameworks_home="" --gc_delay="1weeks" --gc_disk_headroom="0.1" --hadoop_home="" --help="false"
--hostname_lookup="true" --http_authenticators="basic" --http_command_executor="false" --http_credentials="/tmp/Endpoint_SlaveEndpointTest_UnauthorizedRequest_1_VsXTv3/http_credentials"
--image_provisioner_backend="copy" --initialize_driver_logging="true" --isolation="posix/cpu,posix/mem"
--launcher="posix" --launcher_dir="/mesos/mesos-1.2.0/_build/src" --logbufsecs="0" --logging_level="INFO"
--max_completed_executors_per_framework="150" --oversubscribed_resources_interval="15secs"
--perf_duration="10secs" --perf_interval="1mins" --qos_correction_interval_min="0ns" --quiet="false"
--recover="reconnect" --recovery_timeout="15mins" --registration_backoff_factor="10ms" --resources="cpus:2;gpus:0;mem:1024;disk:1024;ports:[31000-32000]"
--revocable_cpu_low_priority="true" --runtime_dir="/tmp/Endpoint_SlaveEndpointTest_UnauthorizedRequest_1_VsXTv3"
--sandbox_directory="/mnt/mesos/sandbox" --strict="true" --switch_user="true" --systemd_enable_support="true"
--systemd_runtime_directory="/run/systemd/system" --version="false" --work_dir="/tmp/Endpoint_SlaveEndpointTest_UnauthorizedRequest_1_TSGMFB"
I1108 04:54:16.022001 29736 credentials.hpp:86] Loading credential for authentication from
'/tmp/Endpoint_SlaveEndpointTest_UnauthorizedRequest_1_VsXTv3/credential'
I1108 04:54:16.022176 29736 slave.cpp:346] Agent using credential for: test-principal
I1108 04:54:16.022199 29736 credentials.hpp:37] Loading credentials for authentication from
'/tmp/Endpoint_SlaveEndpointTest_UnauthorizedRequest_1_VsXTv3/http_credentials'
I1108 04:54:16.022478 29736 http.cpp:895] Using default 'basic' HTTP authenticator for realm
'mesos-agent-readonly'
I1108 04:54:16.022624 29736 http.cpp:895] Using default 'basic' HTTP authenticator for realm
'mesos-agent-readwrite'
I1108 04:54:16.023926 29736 slave.cpp:533] Agent resources: cpus(*):2; mem(*):1024; disk(*):1024;
ports(*):[31000-32000]
I1108 04:54:16.024029 29736 slave.cpp:541] Agent attributes: [  ]
I1108 04:54:16.024046 29736 slave.cpp:546] Agent hostname: 001e3f1e27a4
I1108 04:54:16.025593 29726 state.cpp:57] Recovering state from '/tmp/Endpoint_SlaveEndpointTest_UnauthorizedRequest_1_TSGMFB/meta'
I1108 04:54:16.025902 29737 status_update_manager.cpp:203] Recovering status update manager
I1108 04:54:16.026227 29732 containerizer.cpp:557] Recovering containerizer
I1108 04:54:16.027531 29731 provisioner.cpp:253] Provisioner recovery complete
I1108 04:54:16.027950 29736 slave.cpp:5411] Finished recovery
I1108 04:54:16.028461 29736 slave.cpp:5585] Querying resource estimator for oversubscribable
resources
I1108 04:54:16.028858 29735 slave.cpp:5599] Received oversubscribable resources {} from the
resource estimator
I1108 04:54:16.031260 29728 process.cpp:3570] Handling HTTP event for process 'slave(647)'
with path: '/slave(647)/monitor/statistics.json'
I1108 04:54:16.032395 29729 http.cpp:847] Authorizing principal 'test-principal' to GET the
'/monitor/statistics.json' endpoint
I1108 04:54:16.035046 29733 slave.cpp:787] Agent terminating
[       OK ] Endpoint/SlaveEndpointTest.UnauthorizedRequest/1 (25 ms)
[ RUN      ] Endpoint/SlaveEndpointTest.UnauthorizedRequest/2
I1108 04:54:16.043962 29704 containerizer.cpp:201] Using isolation: posix/cpu,posix/mem,filesystem/posix,network/cni
W1108 04:54:16.044544 29704 backend.cpp:76] Failed to create 'aufs' backend: AufsBackend requires
root privileges, but is running as user mesos
W1108 04:54:16.044694 29704 backend.cpp:76] Failed to create 'bind' backend: BindBackend requires
root privileges
I1108 04:54:16.047325 29737 slave.cpp:208] Mesos agent started on (648)@172.17.0.3:58726
I1108 04:54:16.047351 29737 slave.cpp:209] Flags at startup: --acls="" --appc_simple_discovery_uri_prefix="http://"
--appc_store_dir="/tmp/mesos/store/appc" --authenticate_http_readonly="true" --authenticate_http_readwrite="true"
--authenticatee="crammd5" --authentication_backoff_factor="1secs" --authorizer="local" --cgroups_cpu_enable_pids_and_tids_count="false"
--cgroups_enable_cfs="false" --cgroups_hierarchy="/sys/fs/cgroup" --cgroups_limit_swap="false"
--cgroups_root="mesos" --container_disk_watch_interval="15secs" --containerizers="mesos" --credential="/tmp/Endpoint_SlaveEndpointTest_UnauthorizedRequest_2_d8DA6Q/credential"
--default_role="*" --disk_watch_interval="1mins" --docker="docker" --docker_kill_orphans="true"
--docker_registry="https://registry-1.docker.io" --docker_remove_delay="6hrs" --docker_socket="/var/run/docker.sock"
--docker_stop_timeout="0ns" --docker_store_dir="/tmp/mesos/store/docker" --docker_volume_checkpoint_dir="/var/run/mesos/isolators/docker/volume"
--enforce_container_disk_quota="false" --executor_registration_timeout="1mins" --executor_shutdown_grace_period="5secs"
--fetcher_cache_dir="/tmp/Endpoint_SlaveEndpointTest_UnauthorizedRequest_2_d8DA6Q/fetch" --fetcher_cache_size="2GB"
--frameworks_home="" --gc_delay="1weeks" --gc_disk_headroom="0.1" --hadoop_home="" --help="false"
--hostname_lookup="true" --http_authenticators="basic" --http_command_executor="false" --http_credentials="/tmp/Endpoint_SlaveEndpointTest_UnauthorizedRequest_2_d8DA6Q/http_credentials"
--image_provisioner_backend="copy" --initialize_driver_logging="true" --isolation="posix/cpu,posix/mem"
--launcher="posix" --launcher_dir="/mesos/mesos-1.2.0/_build/src" --logbufsecs="0" --logging_level="INFO"
--max_completed_executors_per_framework="150" --oversubscribed_resources_interval="15secs"
--perf_duration="10secs" --perf_interval="1mins" --qos_correction_interval_min="0ns" --quiet="false"
--recover="reconnect" --recovery_timeout="15mins" --registration_backoff_factor="10ms" --resources="cpus:2;gpus:0;mem:1024;disk:1024;ports:[31000-32000]"
--revocable_cpu_low_priority="true" --runtime_dir="/tmp/Endpoint_SlaveEndpointTest_UnauthorizedRequest_2_d8DA6Q"
--sandbox_directory="/mnt/mesos/sandbox" --strict="true" --switch_user="true" --systemd_enable_support="true"
--systemd_runtime_directory="/run/systemd/system" --version="false" --work_dir="/tmp/Endpoint_SlaveEndpointTest_UnauthorizedRequest_2_7z6hcp"
I1108 04:54:16.048091 29737 credentials.hpp:86] Loading credential for authentication from
'/tmp/Endpoint_SlaveEndpointTest_UnauthorizedRequest_2_d8DA6Q/credential'
I1108 04:54:16.048269 29737 slave.cpp:346] Agent using credential for: test-principal
I1108 04:54:16.048298 29737 credentials.hpp:37] Loading credentials for authentication from
'/tmp/Endpoint_SlaveEndpointTest_UnauthorizedRequest_2_d8DA6Q/http_credentials'
I1108 04:54:16.048594 29737 http.cpp:895] Using default 'basic' HTTP authenticator for realm
'mesos-agent-readonly'
I1108 04:54:16.048792 29737 http.cpp:895] Using default 'basic' HTTP authenticator for realm
'mesos-agent-readwrite'
I1108 04:54:16.049893 29737 slave.cpp:533] Agent resources: cpus(*):2; mem(*):1024; disk(*):1024;
ports(*):[31000-32000]
I1108 04:54:16.049969 29737 slave.cpp:541] Agent attributes: [  ]
I1108 04:54:16.049985 29737 slave.cpp:546] Agent hostname: 001e3f1e27a4
I1108 04:54:16.051393 29724 state.cpp:57] Recovering state from '/tmp/Endpoint_SlaveEndpointTest_UnauthorizedRequest_2_7z6hcp/meta'
I1108 04:54:16.051657 29725 status_update_manager.cpp:203] Recovering status update manager
I1108 04:54:16.051911 29738 containerizer.cpp:557] Recovering containerizer
I1108 04:54:16.053153 29732 provisioner.cpp:253] Provisioner recovery complete
I1108 04:54:16.053573 29729 slave.cpp:5411] Finished recovery
I1108 04:54:16.054150 29729 slave.cpp:5585] Querying resource estimator for oversubscribable
resources
I1108 04:54:16.054457 29737 slave.cpp:5599] Received oversubscribable resources {} from the
resource estimator
I1108 04:54:16.056304 29729 process.cpp:3570] Handling HTTP event for process 'slave(648)'
with path: '/slave(648)/containers'
I1108 04:54:16.057090 29735 http.cpp:847] Authorizing principal 'test-principal' to GET the
'/containers' endpoint
I1108 04:54:16.058919 29704 slave.cpp:787] Agent terminating
[       OK ] Endpoint/SlaveEndpointTest.UnauthorizedRequest/2 (22 ms)
[ RUN      ] Endpoint/SlaveEndpointTest.NoAuthorizer/0
I1108 04:54:16.069869 29704 containerizer.cpp:201] Using isolation: posix/cpu,posix/mem,filesystem/posix,network/cni
W1108 04:54:16.070446 29704 backend.cpp:76] Failed to create 'aufs' backend: AufsBackend requires
root privileges, but is running as user mesos
W1108 04:54:16.070596 29704 backend.cpp:76] Failed to create 'bind' backend: BindBackend requires
root privileges
I1108 04:54:16.071904 29704 cluster.cpp:435] Creating default 'local' authorizer
I1108 04:54:16.073385 29727 slave.cpp:208] Mesos agent started on (649)@172.17.0.3:58726
I1108 04:54:16.073539 29727 slave.cpp:209] Flags at startup: --acls="" --appc_simple_discovery_uri_prefix="http://"
--appc_store_dir="/tmp/mesos/store/appc" --authenticate_http_readonly="true" --authenticate_http_readwrite="true"
--authenticatee="crammd5" --authentication_backoff_factor="1secs" --authorizer="local" --cgroups_cpu_enable_pids_and_tids_count="false"
--cgroups_enable_cfs="false" --cgroups_hierarchy="/sys/fs/cgroup" --cgroups_limit_swap="false"
--cgroups_root="mesos" --container_disk_watch_interval="15secs" --containerizers="mesos" --credential="/tmp/Endpoint_SlaveEndpointTest_NoAuthorizer_0_LVy2XE/credential"
--default_role="*" --disk_watch_interval="1mins" --docker="docker" --docker_kill_orphans="true"
--docker_registry="https://registry-1.docker.io" --docker_remove_delay="6hrs" --docker_socket="/var/run/docker.sock"
--docker_stop_timeout="0ns" --docker_store_dir="/tmp/mesos/store/docker" --docker_volume_checkpoint_dir="/var/run/mesos/isolators/docker/volume"
--enforce_container_disk_quota="false" --executor_registration_timeout="1mins" --executor_shutdown_grace_period="5secs"
--fetcher_cache_dir="/tmp/Endpoint_SlaveEndpointTest_NoAuthorizer_0_LVy2XE/fetch" --fetcher_cache_size="2GB"
--frameworks_home="" --gc_delay="1weeks" --gc_disk_headroom="0.1" --hadoop_home="" --help="false"
--hostname_lookup="true" --http_authenticators="basic" --http_command_executor="false" --http_credentials="/tmp/Endpoint_SlaveEndpointTest_NoAuthorizer_0_LVy2XE/http_credentials"
--image_provisioner_backend="copy" --initialize_driver_logging="true" --isolation="posix/cpu,posix/mem"
--launcher="posix" --launcher_dir="/mesos/mesos-1.2.0/_build/src" --logbufsecs="0" --logging_level="INFO"
--max_completed_executors_per_framework="150" --oversubscribed_resources_interval="15secs"
--perf_duration="10secs" --perf_interval="1mins" --qos_correction_interval_min="0ns" --quiet="false"
--recover="reconnect" --recovery_timeout="15mins" --registration_backoff_factor="10ms" --resources="cpus:2;gpus:0;mem:1024;disk:1024;ports:[31000-32000]"
--revocable_cpu_low_priority="true" --runtime_dir="/tmp/Endpoint_SlaveEndpointTest_NoAuthorizer_0_LVy2XE"
--sandbox_directory="/mnt/mesos/sandbox" --strict="true" --switch_user="true" --systemd_enable_support="true"
--systemd_runtime_directory="/run/systemd/system" --version="false" --work_dir="/tmp/Endpoint_SlaveEndpointTest_NoAuthorizer_0_zkVxZc"
I1108 04:54:16.074098 29727 credentials.hpp:86] Loading credential for authentication from
'/tmp/Endpoint_SlaveEndpointTest_NoAuthorizer_0_LVy2XE/credential'
I1108 04:54:16.074245 29727 slave.cpp:346] Agent using credential for: test-principal
I1108 04:54:16.074270 29727 credentials.hpp:37] Loading credentials for authentication from
'/tmp/Endpoint_SlaveEndpointTest_NoAuthorizer_0_LVy2XE/http_credentials'
I1108 04:54:16.074606 29727 http.cpp:895] Using default 'basic' HTTP authenticator for realm
'mesos-agent-readonly'
I1108 04:54:16.074753 29727 http.cpp:895] Using default 'basic' HTTP authenticator for realm
'mesos-agent-readwrite'
I1108 04:54:16.075791 29727 slave.cpp:533] Agent resources: cpus(*):2; mem(*):1024; disk(*):1024;
ports(*):[31000-32000]
I1108 04:54:16.075872 29727 slave.cpp:541] Agent attributes: [  ]
I1108 04:54:16.075913 29727 slave.cpp:546] Agent hostname: 001e3f1e27a4
I1108 04:54:16.077249 29728 state.cpp:57] Recovering state from '/tmp/Endpoint_SlaveEndpointTest_NoAuthorizer_0_zkVxZc/meta'
I1108 04:54:16.077504 29726 status_update_manager.cpp:203] Recovering status update manager
I1108 04:54:16.077798 29725 containerizer.cpp:557] Recovering containerizer
I1108 04:54:16.079133 29736 provisioner.cpp:253] Provisioner recovery complete
I1108 04:54:16.079584 29727 slave.cpp:5411] Finished recovery
I1108 04:54:16.080195 29727 slave.cpp:5585] Querying resource estimator for oversubscribable
resources
I1108 04:54:16.080477 29725 slave.cpp:5599] Received oversubscribable resources {} from the
resource estimator
I1108 04:54:16.082250 29735 process.cpp:3570] Handling HTTP event for process 'slave(649)'
with path: '/slave(649)/monitor/statistics'
I1108 04:54:16.083220 29725 http.cpp:847] Authorizing principal 'test-principal' to GET the
'/monitor/statistics' endpoint
I1108 04:54:16.086522 29704 slave.cpp:787] Agent terminating
[       OK ] Endpoint/SlaveEndpointTest.NoAuthorizer/0 (25 ms)
[ RUN      ] Endpoint/SlaveEndpointTest.NoAuthorizer/1
I1108 04:54:16.101583 29704 containerizer.cpp:201] Using isolation: posix/cpu,posix/mem,filesystem/posix,network/cni
W1108 04:54:16.102180 29704 backend.cpp:76] Failed to create 'aufs' backend: AufsBackend requires
root privileges, but is running as user mesos
W1108 04:54:16.102324 29704 backend.cpp:76] Failed to create 'bind' backend: BindBackend requires
root privileges
I1108 04:54:16.103647 29704 cluster.cpp:435] Creating default 'local' authorizer
I1108 04:54:16.105137 29735 slave.cpp:208] Mesos agent started on (650)@172.17.0.3:58726
I1108 04:54:16.105161 29735 slave.cpp:209] Flags at startup: --acls="" --appc_simple_discovery_uri_prefix="http://"
--appc_store_dir="/tmp/mesos/store/appc" --authenticate_http_readonly="true" --authenticate_http_readwrite="true"
--authenticatee="crammd5" --authentication_backoff_factor="1secs" --authorizer="local" --cgroups_cpu_enable_pids_and_tids_count="false"
--cgroups_enable_cfs="false" --cgroups_hierarchy="/sys/fs/cgroup" --cgroups_limit_swap="false"
--cgroups_root="mesos" --container_disk_watch_interval="15secs" --containerizers="mesos" --credential="/tmp/Endpoint_SlaveEndpointTest_NoAuthorizer_1_R9pY8s/credential"
--default_role="*" --disk_watch_interval="1mins" --docker="docker" --docker_kill_orphans="true"
--docker_registry="https://registry-1.docker.io" --docker_remove_delay="6hrs" --docker_socket="/var/run/docker.sock"
--docker_stop_timeout="0ns" --docker_store_dir="/tmp/mesos/store/docker" --docker_volume_checkpoint_dir="/var/run/mesos/isolators/docker/volume"
--enforce_container_disk_quota="false" --executor_registration_timeout="1mins" --executor_shutdown_grace_period="5secs"
--fetcher_cache_dir="/tmp/Endpoint_SlaveEndpointTest_NoAuthorizer_1_R9pY8s/fetch" --fetcher_cache_size="2GB"
--frameworks_home="" --gc_delay="1weeks" --gc_disk_headroom="0.1" --hadoop_home="" --help="false"
--hostname_lookup="true" --http_authenticators="basic" --http_command_executor="false" --http_credentials="/tmp/Endpoint_SlaveEndpointTest_NoAuthorizer_1_R9pY8s/http_credentials"
--image_provisioner_backend="copy" --initialize_driver_logging="true" --isolation="posix/cpu,posix/mem"
--launcher="posix" --launcher_dir="/mesos/mesos-1.2.0/_build/src" --logbufsecs="0" --logging_level="INFO"
--max_completed_executors_per_framework="150" --oversubscribed_resources_interval="15secs"
--perf_duration="10secs" --perf_interval="1mins" --qos_correction_interval_min="0ns" --quiet="false"
--recover="reconnect" --recovery_timeout="15mins" --registration_backoff_factor="10ms" --resources="cpus:2;gpus:0;mem:1024;disk:1024;ports:[31000-32000]"
--revocable_cpu_low_priority="true" --runtime_dir="/tmp/Endpoint_SlaveEndpointTest_NoAuthorizer_1_R9pY8s"
--sandbox_directory="/mnt/mesos/sandbox" --strict="true" --switch_user="true" --systemd_enable_support="true"
--systemd_runtime_directory="/run/systemd/system" --version="false" --work_dir="/tmp/Endpoint_SlaveEndpointTest_NoAuthorizer_1_9eDn50"
I1108 04:54:16.105696 29735 credentials.hpp:86] Loading credential for authentication from
'/tmp/Endpoint_SlaveEndpointTest_NoAuthorizer_1_R9pY8s/credential'
I1108 04:54:16.105872 29735 slave.cpp:346] Agent using credential for: test-principal
I1108 04:54:16.105893 29735 credentials.hpp:37] Loading credentials for authentication from
'/tmp/Endpoint_SlaveEndpointTest_NoAuthorizer_1_R9pY8s/http_credentials'
I1108 04:54:16.106135 29735 http.cpp:895] Using default 'basic' HTTP authenticator for realm
'mesos-agent-readonly'
I1108 04:54:16.106289 29735 http.cpp:895] Using default 'basic' HTTP authenticator for realm
'mesos-agent-readwrite'
I1108 04:54:16.107317 29735 slave.cpp:533] Agent resources: cpus(*):2; mem(*):1024; disk(*):1024;
ports(*):[31000-32000]
I1108 04:54:16.107393 29735 slave.cpp:541] Agent attributes: [  ]
I1108 04:54:16.107404 29735 slave.cpp:546] Agent hostname: 001e3f1e27a4
I1108 04:54:16.108897 29726 state.cpp:57] Recovering state from '/tmp/Endpoint_SlaveEndpointTest_NoAuthorizer_1_9eDn50/meta'
I1108 04:54:16.109143 29733 status_update_manager.cpp:203] Recovering status update manager
I1108 04:54:16.109403 29727 containerizer.cpp:557] Recovering containerizer
I1108 04:54:16.110564 29735 provisioner.cpp:253] Provisioner recovery complete
I1108 04:54:16.110958 29723 slave.cpp:5411] Finished recovery
I1108 04:54:16.111476 29723 slave.cpp:5585] Querying resource estimator for oversubscribable
resources
I1108 04:54:16.111791 29727 slave.cpp:5599] Received oversubscribable resources {} from the
resource estimator
I1108 04:54:16.113405 29725 process.cpp:3570] Handling HTTP event for process 'slave(650)'
with path: '/slave(650)/monitor/statistics.json'
I1108 04:54:16.114182 29724 http.cpp:847] Authorizing principal 'test-principal' to GET the
'/monitor/statistics.json' endpoint
I1108 04:54:16.117049 29732 slave.cpp:787] Agent terminating
[       OK ] Endpoint/SlaveEndpointTest.NoAuthorizer/1 (25 ms)
[ RUN      ] Endpoint/SlaveEndpointTest.NoAuthorizer/2
I1108 04:54:16.127194 29704 containerizer.cpp:201] Using isolation: posix/cpu,posix/mem,filesystem/posix,network/cni
W1108 04:54:16.127957 29704 backend.cpp:76] Failed to create 'aufs' backend: AufsBackend requires
root privileges, but is running as user mesos
W1108 04:54:16.128110 29704 backend.cpp:76] Failed to create 'bind' backend: BindBackend requires
root privileges
I1108 04:54:16.129513 29704 cluster.cpp:435] Creating default 'local' authorizer
I1108 04:54:16.131311 29728 slave.cpp:208] Mesos agent started on (651)@172.17.0.3:58726
I1108 04:54:16.131335 29728 slave.cpp:209] Flags at startup: --acls="" --appc_simple_discovery_uri_prefix="http://"
--appc_store_dir="/tmp/mesos/store/appc" --authenticate_http_readonly="true" --authenticate_http_readwrite="true"
--authenticatee="crammd5" --authentication_backoff_factor="1secs" --authorizer="local" --cgroups_cpu_enable_pids_and_tids_count="false"
--cgroups_enable_cfs="false" --cgroups_hierarchy="/sys/fs/cgroup" --cgroups_limit_swap="false"
--cgroups_root="mesos" --container_disk_watch_interval="15secs" --containerizers="mesos" --credential="/tmp/Endpoint_SlaveEndpointTest_NoAuthorizer_2_30NdBh/credential"
--default_role="*" --disk_watch_interval="1mins" --docker="docker" --docker_kill_orphans="true"
--docker_registry="https://registry-1.docker.io" --docker_remove_delay="6hrs" --docker_socket="/var/run/docker.sock"
--docker_stop_timeout="0ns" --docker_store_dir="/tmp/mesos/store/docker" --docker_volume_checkpoint_dir="/var/run/mesos/isolators/docker/volume"
--enforce_container_disk_quota="false" --executor_registration_timeout="1mins" --executor_shutdown_grace_period="5secs"
--fetcher_cache_dir="/tmp/Endpoint_SlaveEndpointTest_NoAuthorizer_2_30NdBh/fetch" --fetcher_cache_size="2GB"
--frameworks_home="" --gc_delay="1weeks" --gc_disk_headroom="0.1" --hadoop_home="" --help="false"
--hostname_lookup="true" --http_authenticators="basic" --http_command_executor="false" --http_credentials="/tmp/Endpoint_SlaveEndpointTest_NoAuthorizer_2_30NdBh/http_credentials"
--image_provisioner_backend="copy" --initialize_driver_logging="true" --isolation="posix/cpu,posix/mem"
--launcher="posix" --launcher_dir="/mesos/mesos-1.2.0/_build/src" --logbufsecs="0" --logging_level="INFO"
--max_completed_executors_per_framework="150" --oversubscribed_resources_interval="15secs"
--perf_duration="10secs" --perf_interval="1mins" --qos_correction_interval_min="0ns" --quiet="false"
--recover="reconnect" --recovery_timeout="15mins" --registration_backoff_factor="10ms" --resources="cpus:2;gpus:0;mem:1024;disk:1024;ports:[31000-32000]"
--revocable_cpu_low_priority="true" --runtime_dir="/tmp/Endpoint_SlaveEndpointTest_NoAuthorizer_2_30NdBh"
--sandbox_directory="/mnt/mesos/sandbox" --strict="true" --switch_user="true" --systemd_enable_support="true"
--systemd_runtime_directory="/run/systemd/system" --version="false" --work_dir="/tmp/Endpoint_SlaveEndpointTest_NoAuthorizer_2_TuixtP"
I1108 04:54:16.131906 29728 credentials.hpp:86] Loading credential for authentication from
'/tmp/Endpoint_SlaveEndpointTest_NoAuthorizer_2_30NdBh/credential'
I1108 04:54:16.132056 29728 slave.cpp:346] Agent using credential for: test-principal
I1108 04:54:16.132083 29728 credentials.hpp:37] Loading credentials for authentication from
'/tmp/Endpoint_SlaveEndpointTest_NoAuthorizer_2_30NdBh/http_credentials'
I1108 04:54:16.132328 29728 http.cpp:895] Using default 'basic' HTTP authenticator for realm
'mesos-agent-readonly'
I1108 04:54:16.132449 29728 http.cpp:895] Using default 'basic' HTTP authenticator for realm
'mesos-agent-readwrite'
I1108 04:54:16.133520 29728 slave.cpp:533] Agent resources: cpus(*):2; mem(*):1024; disk(*):1024;
ports(*):[31000-32000]
I1108 04:54:16.133595 29728 slave.cpp:541] Agent attributes: [  ]
I1108 04:54:16.133607 29728 slave.cpp:546] Agent hostname: 001e3f1e27a4
I1108 04:54:16.134874 29732 state.cpp:57] Recovering state from '/tmp/Endpoint_SlaveEndpointTest_NoAuthorizer_2_TuixtP/meta'
I1108 04:54:16.135157 29727 status_update_manager.cpp:203] Recovering status update manager
I1108 04:54:16.135349 29733 containerizer.cpp:557] Recovering containerizer
I1108 04:54:16.136555 29735 provisioner.cpp:253] Provisioner recovery complete
I1108 04:54:16.136962 29733 slave.cpp:5411] Finished recovery
I1108 04:54:16.137493 29733 slave.cpp:5585] Querying resource estimator for oversubscribable
resources
I1108 04:54:16.137776 29730 slave.cpp:5599] Received oversubscribable resources {} from the
resource estimator
I1108 04:54:16.139392 29729 process.cpp:3570] Handling HTTP event for process 'slave(651)'
with path: '/slave(651)/containers'
I1108 04:54:16.140199 29734 http.cpp:847] Authorizing principal 'test-principal' to GET the
'/containers' endpoint
I1108 04:54:16.142964 29727 slave.cpp:787] Agent terminating
[       OK ] Endpoint/SlaveEndpointTest.NoAuthorizer/2 (26 ms)
[----------] 9 tests from Endpoint/SlaveEndpointTest (255 ms total)

[----------] Global test environment tear-down
[==========] 1378 tests from 156 test cases ran. (1323599 ms total)
[  PASSED  ] 1377 tests.
[  FAILED  ] 1 test, listed below:
[  FAILED  ] DefaultExecutorTest.KillTaskGroupOnTaskFailure

 1 FAILED TEST
  YOU HAVE 4 DISABLED TESTS

make[4]: *** [check-local] Error 1
make[4]: Leaving directory `/mesos/mesos-1.2.0/_build/src'
make[3]: *** [check-am] Error 2
make[3]: Leaving directory `/mesos/mesos-1.2.0/_build/src'
make[2]: *** [check] Error 2
make[2]: Leaving directory `/mesos/mesos-1.2.0/_build/src'
make[1]: *** [check-recursive] Error 1
make[1]: Leaving directory `/mesos/mesos-1.2.0/_build'
make: *** [distcheck] Error 1
+ docker rmi mesos-1478576553-5113
Untagged: mesos-1478576553-5113:latest
Deleted: sha256:c8f7849d5b62dfb1d1b7d5b99af7cf1ef77bfc28f7e4bda9eeb918bbc552fb44
Deleted: sha256:948c9ee15d9e3ac64b1678cc3f3a6f11056cb310752d28a8a18507f220a713b3
Deleted: sha256:83b0d6332007ec72c097e5bbd130ace1c6576def5d39930beb2072500a8cc8a1
Deleted: sha256:070cd9cafe3a6fa327d61f94f817307d9e02592a39e53e0aa870e81ed1f14ac1
Deleted: sha256:4cb6998f068882c868b4c719a5f1cd20c9acd9508edcedb5e549f97c6b6c871f
Deleted: sha256:15417979a47bf052b49ebec00ce504e449c5004bdb04dc2fc1834d5ac4af6a37
Deleted: sha256:fc8f0276b6e1009b6fbb5480a2b614c8481b6b3682c19523b6b66ad9396059df
Deleted: sha256:5bc819339f2436ccd3a0421387359e146ca004fde4717f8acf71e9d4f876f767
Deleted: sha256:d194ed876684c27bae24267e97d6410f180c3393e8e7fcb03664f04a41409647
Deleted: sha256:24d8c41241a3c1da59408a22942a899642be081a9a134a52746da5cfbe7ea7e4
Deleted: sha256:03471ef7a4d1bd9e0b29574b1c70b72250b4239b4e5f87fee41cca62596c0ad4
Deleted: sha256:d8b4d821d11f95965aec96bac3ebc489f1789d845a16311732e45338c54685f4
Deleted: sha256:3617a65eee4899a6021b45baf85ebaee38084b8c0e4d9f409d28051f6d0f97d9
Deleted: sha256:5207ea8b2571e9ea83d7e6d57382c25e757db8bbaafcd569bfcd507f53189a79
Deleted: sha256:482d7cccbef514858dac4a362f917242addf2add80394f7d273de5edd643f1b7
Deleted: sha256:2425f083d0465b40ec7e89b1965f78f95658d3f0ee6623ad4466186bd9ade0cd
Deleted: sha256:e4db2dfee7bf8348a6289a76178179b2406c2d9a48f3caa72205054be2c290fb
Deleted: sha256:e4a35542dfaedf1eea02648f5cb66fc8a2bfda64696d10af9892ad71d57b9a13
Deleted: sha256:785411fe5b27318768b1d01f2ca3ebb7442aa6188b4f3e7253087e147ea07763
Deleted: sha256:5958ceae15df2860dc00e49c50d0753405526c647d04ac1f870222e05ca4ef74
Deleted: sha256:bb0cf077df618bf80544fa8b51fc9cd32d939fabc8b7eb321f8561d6202b6e8b
Deleted: sha256:9ab159955ddcf898f8ac830dd09e2e4b4f153c4a74dc2f74376f93427ae12b69
Deleted: sha256:39f2edbeed5b4d4ebf244afcbe0a3c99d0bb5566d40476929db36ebaa6616afc
Deleted: sha256:e539cbbdace66fbce54e697674b866ab4840c07624e8c57c67fdc4df0ef6b7b4
Build step 'Execute shell' marked build as failure

Mime
View raw message