mesos-builds mailing list archives

Site index · List index
Message view « Date » · « Thread »
Top « Date » · « Thread »
From Apache Jenkins Server <jenk...@builds.apache.org>
Subject Build failed in Jenkins: Mesos » cmake,clang,--verbose --enable-libevent --enable-ssl,GLOG_v=1 MESOS_VERBOSE=1,ubuntu:14.04,(docker||Hadoop)&&(!ubuntu-us1)&&(!ubuntu-6)&&(!ubuntu-eu2) #2908
Date Wed, 09 Nov 2016 00:04:02 GMT
See <https://builds.apache.org/job/Mesos/BUILDTOOL=cmake,COMPILER=clang,CONFIGURATION=--verbose%20--enable-libevent%20--enable-ssl,ENVIRONMENT=GLOG_v=1%20MESOS_VERBOSE=1,OS=ubuntu%3A14.04,label_exp=(docker%7C%7CHadoop)&&(!ubuntu-us1)&&(!ubuntu-6)&&(!ubuntu-eu2)/2908/changes>

Changes:

[alexr] Improved the validation of RESERVE operations.

[alexr] Added MESOS-6142 to CHANGELOG for 0.28.3.

------------------------------------------
[...truncated 19999 lines...]
running bdist_wheel
running build
installing to build/bdist.linux-x86_64/wheel
running install
running install_lib
copying mesos/cli.py -> build/bdist.linux-x86_64/wheel/mesos
copying mesos/futures.py -> build/bdist.linux-x86_64/wheel/mesos
Skipping installation of build/bdist.linux-x86_64/wheel/mesos/__init__.py (namespace package)
copying mesos/http.py -> build/bdist.linux-x86_64/wheel/mesos
running install_egg_info
Copying src/mesos.cli.egg-info to build/bdist.linux-x86_64/wheel/mesos.cli-0.28.3-py2.7.egg-info
Installing build/bdist.linux-x86_64/wheel/mesos.cli-0.28.3-py2.7-nspkg.pth
running install_scripts
byte-compiling build/bdist.linux-x86_64/egg/mesos/interface/containerizer_pb2.py to containerizer_pb2.pyc
creating build/bdist.linux-x86_64/wheel/mesos.cli-0.28.3.dist-info/WHEEL
creating build/bdist.linux-x86_64/egg/EGG-INFO
copying src/mesos.interface.egg-info/PKG-INFO -> build/bdist.linux-x86_64/egg/EGG-INFO
copying src/mesos.interface.egg-info/SOURCES.txt -> build/bdist.linux-x86_64/egg/EGG-INFO
copying src/mesos.interface.egg-info/dependency_links.txt -> build/bdist.linux-x86_64/egg/EGG-INFO
copying src/mesos.interface.egg-info/namespace_packages.txt -> build/bdist.linux-x86_64/egg/EGG-INFO
copying src/mesos.interface.egg-info/requires.txt -> build/bdist.linux-x86_64/egg/EGG-INFO
copying src/mesos.interface.egg-info/top_level.txt -> build/bdist.linux-x86_64/egg/EGG-INFO
zip_safe flag not set; analyzing archive contents...
mesos.__init__: module references __path__
creating '/mesos/mesos-0.28.3/_build/src/python/dist/mesos.interface-0.28.3-py2.7.egg' and adding 'build/bdist.linux-x86_64/egg' to it
removing 'build/bdist.linux-x86_64/egg' (and everything under it)
running bdist_wheel
running build
installing to build/bdist.linux-x86_64/wheel
running install
running install_lib
Skipping installation of build/bdist.linux-x86_64/wheel/mesos/__init__.py (namespace package)
copying mesos/interface/__init__.py -> build/bdist.linux-x86_64/wheel/mesos/interface
copying mesos/interface/mesos_pb2.py -> build/bdist.linux-x86_64/wheel/mesos/interface
copying mesos/interface/containerizer_pb2.py -> build/bdist.linux-x86_64/wheel/mesos/interface
running install_egg_info
Copying src/mesos.interface.egg-info to build/bdist.linux-x86_64/wheel/mesos.interface-0.28.3-py2.7.egg-info
Installing build/bdist.linux-x86_64/wheel/mesos.interface-0.28.3-py2.7-nspkg.pth
running install_scripts
creating build/bdist.linux-x86_64/wheel/mesos.interface-0.28.3.dist-info/WHEEL
copying build/lib.linux-x86_64-2.7/mesos/native/__init__.py -> build/bdist.linux-x86_64/egg/mesos/native
copying build/lib.linux-x86_64-2.7/mesos/__init__.py -> build/bdist.linux-x86_64/egg/mesos
byte-compiling build/bdist.linux-x86_64/egg/mesos/native/__init__.py to __init__.pyc
byte-compiling build/bdist.linux-x86_64/egg/mesos/__init__.py to __init__.pyc
creating stub loader for mesos/native/_mesos.so
byte-compiling build/bdist.linux-x86_64/egg/mesos/native/_mesos.py to _mesos.pyc
creating build/bdist.linux-x86_64/egg/EGG-INFO
copying src/mesos.native.egg-info/PKG-INFO -> build/bdist.linux-x86_64/egg/EGG-INFO
copying src/mesos.native.egg-info/SOURCES.txt -> build/bdist.linux-x86_64/egg/EGG-INFO
copying src/mesos.native.egg-info/dependency_links.txt -> build/bdist.linux-x86_64/egg/EGG-INFO
copying src/mesos.native.egg-info/namespace_packages.txt -> build/bdist.linux-x86_64/egg/EGG-INFO
copying src/mesos.native.egg-info/requires.txt -> build/bdist.linux-x86_64/egg/EGG-INFO
copying src/mesos.native.egg-info/top_level.txt -> build/bdist.linux-x86_64/egg/EGG-INFO
writing build/bdist.linux-x86_64/egg/EGG-INFO/native_libs.txt
zip_safe flag not set; analyzing archive contents...
mesos.__init__: module references __path__
creating '/mesos/mesos-0.28.3/_build/src/python/dist/mesos.native-0.28.3-py2.7-linux-x86_64.egg' and adding 'build/bdist.linux-x86_64/egg' to it
removing 'build/bdist.linux-x86_64/egg' (and everything under it)
running bdist_wheel
running build
installing to build/bdist.linux-x86_64/wheel
running install
running install_lib
Skipping installation of build/bdist.linux-x86_64/wheel/mesos/__init__.py (namespace package)
copying mesos/native/_mesos.so -> build/bdist.linux-x86_64/wheel/mesos/native
copying mesos/native/__init__.py -> build/bdist.linux-x86_64/wheel/mesos/native
running install_egg_info
Copying src/mesos.native.egg-info to build/bdist.linux-x86_64/wheel/mesos.native-0.28.3-py2.7.egg-info
Installing build/bdist.linux-x86_64/wheel/mesos.native-0.28.3-py2.7-nspkg.pth
running install_scripts
creating build/bdist.linux-x86_64/wheel/mesos.native-0.28.3.dist-info/WHEEL
make  test-http-framework test-framework test-executor test-http-executor long-lived-framework long-lived-executor no-executor-framework docker-no-executor-framework balloon-framework balloon-executor load-generator-framework persistent-volume-framework setns-test-helper memory-test-helper active-user-test-helper mesos-tests examples/java/test-executor examples/java/test-exception-framework examples/java/test-framework examples/java/test-log examples/java/test-multiple-executors-framework examples/python/test_containerizer.py examples/python/test-containerizer examples/python/test_executor.py examples/python/test-executor examples/python/test_framework.py examples/python/test-framework \
	  tests/balloon_framework_test.sh tests/test_http_framework_test.sh tests/java_exception_test.sh tests/java_framework_test.sh tests/java_log_test.sh tests/no_executor_framework_test.sh tests/persistent_volume_framework_test.sh tests/python_framework_test.sh tests/test_framework_test.sh
make[4]: Entering directory `/mesos/mesos-0.28.3/_build/src'
clang++ -DPACKAGE_NAME=\"mesos\" -DPACKAGE_TARNAME=\"mesos\" -DPACKAGE_VERSION=\"0.28.3\" -DPACKAGE_STRING=\"mesos\ 0.28.3\" -DPACKAGE_BUGREPORT=\"\" -DPACKAGE_URL=\"\" -DPACKAGE=\"mesos\" -DVERSION=\"0.28.3\" -DSTDC_HEADERS=1 -DHAVE_SYS_TYPES_H=1 -DHAVE_SYS_STAT_H=1 -DHAVE_STDLIB_H=1 -DHAVE_STRING_H=1 -DHAVE_MEMORY_H=1 -DHAVE_STRINGS_H=1 -DHAVE_INTTYPES_H=1 -DHAVE_STDINT_H=1 -DHAVE_UNISTD_H=1 -DHAVE_DLFCN_H=1 -DLT_OBJDIR=\".libs/\" -DHAVE_PTHREAD_PRIO_INHERIT=1 -DHAVE_PTHREAD=1 -DHAVE_LIBZ=1 -DHAVE_LIBCURL=1 -DHAVE_APR_POOLS_H=1 -DHAVE_LIBAPR_1=1 -DHAVE_SVN_VERSION_H=1 -DHAVE_LIBSVN_SUBR_1=1 -DHAVE_SVN_DELTA_H=1 -DHAVE_LIBSVN_DELTA_1=1 -DHAVE_LIBSASL2=1 -DMESOS_HAS_JAVA=1 -DHAVE_PYTHON=\"2.7\" -DMESOS_HAS_PYTHON=1 -DHAVE_EVENT2_EVENT_H=1 -DHAVE_LIBEVENT=1 -DHAVE_EVENT2_THREAD_H=1 -DHAVE_LIBEVENT_PTHREADS=1 -DHAVE_OPENSSL_SSL_H=1 -DHAVE_LIBSSL=1 -DHAVE_LIBCRYPTO=1 -DHAVE_EVENT2_BUFFEREVENT_SSL_H=1 -DHAVE_LIBEVENT_OPENSSL=1 -DUSE_SSL_SOCKET=1 -I. -I../../src   -Wall -Werror -DLIBDIR=\"/mesos/mesos-0.28.3/_inst/lib\" -DPKGLIBEXECDIR=\"/mesos/mesos-0.28.3/_inst/libexec/mesos\" -DPKGDATADIR=\"/mesos/mesos-0.28.3/_inst/share/mesos\" -DPKGMODULEDIR=\"/mesos/mesos-0.28.3/_inst/lib/mesos/modules\" -I../../include -I../../3rdparty/libprocess/include -I../../3rdparty/libprocess/3rdparty/stout/include -I../include -I../include/mesos -isystem ../3rdparty/libprocess/3rdparty/boost-1.53.0 -I../3rdparty/libprocess/3rdparty/picojson-1.3.0 -DPICOJSON_USE_INT64 -D__STDC_FORMAT_MACROS -I../3rdparty/libprocess/3rdparty/protobuf-2.5.0/src -I../3rdparty/libprocess/3rdparty/glog-0.3.3/src -I../3rdparty/libprocess/3rdparty/glog-0.3.3/src -I../3rdparty/leveldb-1.4/include -I../3rdparty/zookeeper-3.4.5/src/c/include -I../3rdparty/zookeeper-3.4.5/src/c/generated -I../3rdparty/libprocess/3rdparty/protobuf-2.5.0/src -I/usr/include/subversion-1 -I/usr/include/apr-1 -I/usr/include/apr-1.0  -pthread -g1 -O0 -std=c++11 -MT examples/test_http_framework-test_http_framework.o -MD -MP -MF examples/.deps/test_http_framework-test_http_framework.Tpo -c -o examples/test_http_framework-test_http_framework.o `test -f 'examples/test_http_framework.cpp' || echo '../../src/'`examples/test_http_framework.cpp
clang++ -DPACKAGE_NAME=\"mesos\" -DPACKAGE_TARNAME=\"mesos\" -DPACKAGE_VERSION=\"0.28.3\" -DPACKAGE_STRING=\"mesos\ 0.28.3\" -DPACKAGE_BUGREPORT=\"\" -DPACKAGE_URL=\"\" -DPACKAGE=\"mesos\" -DVERSION=\"0.28.3\" -DSTDC_HEADERS=1 -DHAVE_SYS_TYPES_H=1 -DHAVE_SYS_STAT_H=1 -DHAVE_STDLIB_H=1 -DHAVE_STRING_H=1 -DHAVE_MEMORY_H=1 -DHAVE_STRINGS_H=1 -DHAVE_INTTYPES_H=1 -DHAVE_STDINT_H=1 -DHAVE_UNISTD_H=1 -DHAVE_DLFCN_H=1 -DLT_OBJDIR=\".libs/\" -DHAVE_PTHREAD_PRIO_INHERIT=1 -DHAVE_PTHREAD=1 -DHAVE_LIBZ=1 -DHAVE_LIBCURL=1 -DHAVE_APR_POOLS_H=1 -DHAVE_LIBAPR_1=1 -DHAVE_SVN_VERSION_H=1 -DHAVE_LIBSVN_SUBR_1=1 -DHAVE_SVN_DELTA_H=1 -DHAVE_LIBSVN_DELTA_1=1 -DHAVE_LIBSASL2=1 -DMESOS_HAS_JAVA=1 -DHAVE_PYTHON=\"2.7\" -DMESOS_HAS_PYTHON=1 -DHAVE_EVENT2_EVENT_H=1 -DHAVE_LIBEVENT=1 -DHAVE_EVENT2_THREAD_H=1 -DHAVE_LIBEVENT_PTHREADS=1 -DHAVE_OPENSSL_SSL_H=1 -DHAVE_LIBSSL=1 -DHAVE_LIBCRYPTO=1 -DHAVE_EVENT2_BUFFEREVENT_SSL_H=1 -DHAVE_LIBEVENT_OPENSSL=1 -DUSE_SSL_SOCKET=1 -I. -I../../src   -Wall -Werror -DLIBDIR=\"/mesos/mesos-0.28.3/_inst/lib\" -DPKGLIBEXECDIR=\"/mesos/mesos-0.28.3/_inst/libexec/mesos\" -DPKGDATADIR=\"/mesos/mesos-0.28.3/_inst/share/mesos\" -DPKGMODULEDIR=\"/mesos/mesos-0.28.3/_inst/lib/mesos/modules\" -I../../include -I../../3rdparty/libprocess/include -I../../3rdparty/libprocess/3rdparty/stout/include -I../include -I../include/mesos -isystem ../3rdparty/libprocess/3rdparty/boost-1.53.0 -I../3rdparty/libprocess/3rdparty/picojson-1.3.0 -DPICOJSON_USE_INT64 -D__STDC_FORMAT_MACROS -I../3rdparty/libprocess/3rdparty/protobuf-2.5.0/src -I../3rdparty/libprocess/3rdparty/glog-0.3.3/src -I../3rdparty/libprocess/3rdparty/glog-0.3.3/src -I../3rdparty/leveldb-1.4/include -I../3rdparty/zookeeper-3.4.5/src/c/include -I../3rdparty/zookeeper-3.4.5/src/c/generated -I../3rdparty/libprocess/3rdparty/protobuf-2.5.0/src -I/usr/include/subversion-1 -I/usr/include/apr-1 -I/usr/include/apr-1.0  -pthread -g1 -O0 -std=c++11 -MT examples/test_framework-test_framework.o -MD -MP -MF examples/.deps/test_framework-test_framework.Tpo -c -o examples/test_framework-test_framework.o `test -f 'examples/test_framework.cpp' || echo '../../src/'`examples/test_framework.cpp
clang++ -DPACKAGE_NAME=\"mesos\" -DPACKAGE_TARNAME=\"mesos\" -DPACKAGE_VERSION=\"0.28.3\" -DPACKAGE_STRING=\"mesos\ 0.28.3\" -DPACKAGE_BUGREPORT=\"\" -DPACKAGE_URL=\"\" -DPACKAGE=\"mesos\" -DVERSION=\"0.28.3\" -DSTDC_HEADERS=1 -DHAVE_SYS_TYPES_H=1 -DHAVE_SYS_STAT_H=1 -DHAVE_STDLIB_H=1 -DHAVE_STRING_H=1 -DHAVE_MEMORY_H=1 -DHAVE_STRINGS_H=1 -DHAVE_INTTYPES_H=1 -DHAVE_STDINT_H=1 -DHAVE_UNISTD_H=1 -DHAVE_DLFCN_H=1 -DLT_OBJDIR=\".libs/\" -DHAVE_PTHREAD_PRIO_INHERIT=1 -DHAVE_PTHREAD=1 -DHAVE_LIBZ=1 -DHAVE_LIBCURL=1 -DHAVE_APR_POOLS_H=1 -DHAVE_LIBAPR_1=1 -DHAVE_SVN_VERSION_H=1 -DHAVE_LIBSVN_SUBR_1=1 -DHAVE_SVN_DELTA_H=1 -DHAVE_LIBSVN_DELTA_1=1 -DHAVE_LIBSASL2=1 -DMESOS_HAS_JAVA=1 -DHAVE_PYTHON=\"2.7\" -DMESOS_HAS_PYTHON=1 -DHAVE_EVENT2_EVENT_H=1 -DHAVE_LIBEVENT=1 -DHAVE_EVENT2_THREAD_H=1 -DHAVE_LIBEVENT_PTHREADS=1 -DHAVE_OPENSSL_SSL_H=1 -DHAVE_LIBSSL=1 -DHAVE_LIBCRYPTO=1 -DHAVE_EVENT2_BUFFEREVENT_SSL_H=1 -DHAVE_LIBEVENT_OPENSSL=1 -DUSE_SSL_SOCKET=1 -I. -I../../src   -Wall -Werror -DLIBDIR=\"/mesos/mesos-0.28.3/_inst/lib\" -DPKGLIBEXECDIR=\"/mesos/mesos-0.28.3/_inst/libexec/mesos\" -DPKGDATADIR=\"/mesos/mesos-0.28.3/_inst/share/mesos\" -DPKGMODULEDIR=\"/mesos/mesos-0.28.3/_inst/lib/mesos/modules\" -I../../include -I../../3rdparty/libprocess/include -I../../3rdparty/libprocess/3rdparty/stout/include -I../include -I../include/mesos -isystem ../3rdparty/libprocess/3rdparty/boost-1.53.0 -I../3rdparty/libprocess/3rdparty/picojson-1.3.0 -DPICOJSON_USE_INT64 -D__STDC_FORMAT_MACROS -I../3rdparty/libprocess/3rdparty/protobuf-2.5.0/src -I../3rdparty/libprocess/3rdparty/glog-0.3.3/src -I../3rdparty/libprocess/3rdparty/glog-0.3.3/src -I../3rdparty/leveldb-1.4/include -I../3rdparty/zookeeper-3.4.5/src/c/include -I../3rdparty/zookeeper-3.4.5/src/c/generated -I../3rdparty/libprocess/3rdparty/protobuf-2.5.0/src -I/usr/include/subversion-1 -I/usr/include/apr-1 -I/usr/include/apr-1.0  -pthread -g1 -O0 -std=c++11 -MT examples/test_executor-test_executor.o -MD -MP -MF examples/.deps/test_executor-test_executor.Tpo -c -o examples/test_executor-test_executor.o `test -f 'examples/test_executor.cpp' || echo '../../src/'`examples/test_executor.cpp
clang++ -DPACKAGE_NAME=\"mesos\" -DPACKAGE_TARNAME=\"mesos\" -DPACKAGE_VERSION=\"0.28.3\" -DPACKAGE_STRING=\"mesos\ 0.28.3\" -DPACKAGE_BUGREPORT=\"\" -DPACKAGE_URL=\"\" -DPACKAGE=\"mesos\" -DVERSION=\"0.28.3\" -DSTDC_HEADERS=1 -DHAVE_SYS_TYPES_H=1 -DHAVE_SYS_STAT_H=1 -DHAVE_STDLIB_H=1 -DHAVE_STRING_H=1 -DHAVE_MEMORY_H=1 -DHAVE_STRINGS_H=1 -DHAVE_INTTYPES_H=1 -DHAVE_STDINT_H=1 -DHAVE_UNISTD_H=1 -DHAVE_DLFCN_H=1 -DLT_OBJDIR=\".libs/\" -DHAVE_PTHREAD_PRIO_INHERIT=1 -DHAVE_PTHREAD=1 -DHAVE_LIBZ=1 -DHAVE_LIBCURL=1 -DHAVE_APR_POOLS_H=1 -DHAVE_LIBAPR_1=1 -DHAVE_SVN_VERSION_H=1 -DHAVE_LIBSVN_SUBR_1=1 -DHAVE_SVN_DELTA_H=1 -DHAVE_LIBSVN_DELTA_1=1 -DHAVE_LIBSASL2=1 -DMESOS_HAS_JAVA=1 -DHAVE_PYTHON=\"2.7\" -DMESOS_HAS_PYTHON=1 -DHAVE_EVENT2_EVENT_H=1 -DHAVE_LIBEVENT=1 -DHAVE_EVENT2_THREAD_H=1 -DHAVE_LIBEVENT_PTHREADS=1 -DHAVE_OPENSSL_SSL_H=1 -DHAVE_LIBSSL=1 -DHAVE_LIBCRYPTO=1 -DHAVE_EVENT2_BUFFEREVENT_SSL_H=1 -DHAVE_LIBEVENT_OPENSSL=1 -DUSE_SSL_SOCKET=1 -I. -I../../src   -Wall -Werror -DLIBDIR=\"/mesos/mesos-0.28.3/_inst/lib\" -DPKGLIBEXECDIR=\"/mesos/mesos-0.28.3/_inst/libexec/mesos\" -DPKGDATADIR=\"/mesos/mesos-0.28.3/_inst/share/mesos\" -DPKGMODULEDIR=\"/mesos/mesos-0.28.3/_inst/lib/mesos/modules\" -I../../include -I../../3rdparty/libprocess/include -I../../3rdparty/libprocess/3rdparty/stout/include -I../include -I../include/mesos -isystem ../3rdparty/libprocess/3rdparty/boost-1.53.0 -I../3rdparty/libprocess/3rdparty/picojson-1.3.0 -DPICOJSON_USE_INT64 -D__STDC_FORMAT_MACROS -I../3rdparty/libprocess/3rdparty/protobuf-2.5.0/src -I../3rdparty/libprocess/3rdparty/glog-0.3.3/src -I../3rdparty/libprocess/3rdparty/glog-0.3.3/src -I../3rdparty/leveldb-1.4/include -I../3rdparty/zookeeper-3.4.5/src/c/include -I../3rdparty/zookeeper-3.4.5/src/c/generated -I../3rdparty/libprocess/3rdparty/protobuf-2.5.0/src -I/usr/include/subversion-1 -I/usr/include/apr-1 -I/usr/include/apr-1.0  -pthread -g1 -O0 -std=c++11 -MT examples/test_http_executor-test_http_executor.o -MD -MP -MF examples/.deps/test_http_executor-test_http_executor.Tpo -c -o examples/test_http_executor-test_http_executor.o `test -f 'examples/test_http_executor.cpp' || echo '../../src/'`examples/test_http_executor.cpp
clang++ -DPACKAGE_NAME=\"mesos\" -DPACKAGE_TARNAME=\"mesos\" -DPACKAGE_VERSION=\"0.28.3\" -DPACKAGE_STRING=\"mesos\ 0.28.3\" -DPACKAGE_BUGREPORT=\"\" -DPACKAGE_URL=\"\" -DPACKAGE=\"mesos\" -DVERSION=\"0.28.3\" -DSTDC_HEADERS=1 -DHAVE_SYS_TYPES_H=1 -DHAVE_SYS_STAT_H=1 -DHAVE_STDLIB_H=1 -DHAVE_STRING_H=1 -DHAVE_MEMORY_H=1 -DHAVE_STRINGS_H=1 -DHAVE_INTTYPES_H=1 -DHAVE_STDINT_H=1 -DHAVE_UNISTD_H=1 -DHAVE_DLFCN_H=1 -DLT_OBJDIR=\".libs/\" -DHAVE_PTHREAD_PRIO_INHERIT=1 -DHAVE_PTHREAD=1 -DHAVE_LIBZ=1 -DHAVE_LIBCURL=1 -DHAVE_APR_POOLS_H=1 -DHAVE_LIBAPR_1=1 -DHAVE_SVN_VERSION_H=1 -DHAVE_LIBSVN_SUBR_1=1 -DHAVE_SVN_DELTA_H=1 -DHAVE_LIBSVN_DELTA_1=1 -DHAVE_LIBSASL2=1 -DMESOS_HAS_JAVA=1 -DHAVE_PYTHON=\"2.7\" -DMESOS_HAS_PYTHON=1 -DHAVE_EVENT2_EVENT_H=1 -DHAVE_LIBEVENT=1 -DHAVE_EVENT2_THREAD_H=1 -DHAVE_LIBEVENT_PTHREADS=1 -DHAVE_OPENSSL_SSL_H=1 -DHAVE_LIBSSL=1 -DHAVE_LIBCRYPTO=1 -DHAVE_EVENT2_BUFFEREVENT_SSL_H=1 -DHAVE_LIBEVENT_OPENSSL=1 -DUSE_SSL_SOCKET=1 -I. -I../../src   -Wall -Werror -DLIBDIR=\"/mesos/mesos-0.28.3/_inst/lib\" -DPKGLIBEXECDIR=\"/mesos/mesos-0.28.3/_inst/libexec/mesos\" -DPKGDATADIR=\"/mesos/mesos-0.28.3/_inst/share/mesos\" -DPKGMODULEDIR=\"/mesos/mesos-0.28.3/_inst/lib/mesos/modules\" -I../../include -I../../3rdparty/libprocess/include -I../../3rdparty/libprocess/3rdparty/stout/include -I../include -I../include/mesos -isystem ../3rdparty/libprocess/3rdparty/boost-1.53.0 -I../3rdparty/libprocess/3rdparty/picojson-1.3.0 -DPICOJSON_USE_INT64 -D__STDC_FORMAT_MACROS -I../3rdparty/libprocess/3rdparty/protobuf-2.5.0/src -I../3rdparty/libprocess/3rdparty/glog-0.3.3/src -I../3rdparty/libprocess/3rdparty/glog-0.3.3/src -I../3rdparty/leveldb-1.4/include -I../3rdparty/zookeeper-3.4.5/src/c/include -I../3rdparty/zookeeper-3.4.5/src/c/generated -I../3rdparty/libprocess/3rdparty/protobuf-2.5.0/src -I/usr/include/subversion-1 -I/usr/include/apr-1 -I/usr/include/apr-1.0  -pthread -g1 -O0 -std=c++11 -MT examples/long_lived_framework-long_lived_framework.o -MD -MP -MF examples/.deps/long_lived_framework-long_lived_framework.Tpo -c -o examples/long_lived_framework-long_lived_framework.o `test -f 'examples/long_lived_framework.cpp' || echo '../../src/'`examples/long_lived_framework.cpp
clang++ -DPACKAGE_NAME=\"mesos\" -DPACKAGE_TARNAME=\"mesos\" -DPACKAGE_VERSION=\"0.28.3\" -DPACKAGE_STRING=\"mesos\ 0.28.3\" -DPACKAGE_BUGREPORT=\"\" -DPACKAGE_URL=\"\" -DPACKAGE=\"mesos\" -DVERSION=\"0.28.3\" -DSTDC_HEADERS=1 -DHAVE_SYS_TYPES_H=1 -DHAVE_SYS_STAT_H=1 -DHAVE_STDLIB_H=1 -DHAVE_STRING_H=1 -DHAVE_MEMORY_H=1 -DHAVE_STRINGS_H=1 -DHAVE_INTTYPES_H=1 -DHAVE_STDINT_H=1 -DHAVE_UNISTD_H=1 -DHAVE_DLFCN_H=1 -DLT_OBJDIR=\".libs/\" -DHAVE_PTHREAD_PRIO_INHERIT=1 -DHAVE_PTHREAD=1 -DHAVE_LIBZ=1 -DHAVE_LIBCURL=1 -DHAVE_APR_POOLS_H=1 -DHAVE_LIBAPR_1=1 -DHAVE_SVN_VERSION_H=1 -DHAVE_LIBSVN_SUBR_1=1 -DHAVE_SVN_DELTA_H=1 -DHAVE_LIBSVN_DELTA_1=1 -DHAVE_LIBSASL2=1 -DMESOS_HAS_JAVA=1 -DHAVE_PYTHON=\"2.7\" -DMESOS_HAS_PYTHON=1 -DHAVE_EVENT2_EVENT_H=1 -DHAVE_LIBEVENT=1 -DHAVE_EVENT2_THREAD_H=1 -DHAVE_LIBEVENT_PTHREADS=1 -DHAVE_OPENSSL_SSL_H=1 -DHAVE_LIBSSL=1 -DHAVE_LIBCRYPTO=1 -DHAVE_EVENT2_BUFFEREVENT_SSL_H=1 -DHAVE_LIBEVENT_OPENSSL=1 -DUSE_SSL_SOCKET=1 -I. -I../../src   -Wall -Werror -DLIBDIR=\"/mesos/mesos-0.28.3/_inst/lib\" -DPKGLIBEXECDIR=\"/mesos/mesos-0.28.3/_inst/libexec/mesos\" -DPKGDATADIR=\"/mesos/mesos-0.28.3/_inst/share/mesos\" -DPKGMODULEDIR=\"/mesos/mesos-0.28.3/_inst/lib/mesos/modules\" -I../../include -I../../3rdparty/libprocess/include -I../../3rdparty/libprocess/3rdparty/stout/include -I../include -I../include/mesos -isystem ../3rdparty/libprocess/3rdparty/boost-1.53.0 -I../3rdparty/libprocess/3rdparty/picojson-1.3.0 -DPICOJSON_USE_INT64 -D__STDC_FORMAT_MACROS -I../3rdparty/libprocess/3rdparty/protobuf-2.5.0/src -I../3rdparty/libprocess/3rdparty/glog-0.3.3/src -I../3rdparty/libprocess/3rdparty/glog-0.3.3/src -I../3rdparty/leveldb-1.4/include -I../3rdparty/zookeeper-3.4.5/src/c/include -I../3rdparty/zookeeper-3.4.5/src/c/generated -I../3rdparty/libprocess/3rdparty/protobuf-2.5.0/src -I/usr/include/subversion-1 -I/usr/include/apr-1 -I/usr/include/apr-1.0  -pthread -g1 -O0 -std=c++11 -MT examples/long_lived_executor-long_lived_executor.o -MD -MP -MF examples/.deps/long_lived_executor-long_lived_executor.Tpo -c -o examples/long_lived_executor-long_lived_executor.o `test -f 'examples/long_lived_executor.cpp' || echo '../../src/'`examples/long_lived_executor.cpp
clang++ -DPACKAGE_NAME=\"mesos\" -DPACKAGE_TARNAME=\"mesos\" -DPACKAGE_VERSION=\"0.28.3\" -DPACKAGE_STRING=\"mesos\ 0.28.3\" -DPACKAGE_BUGREPORT=\"\" -DPACKAGE_URL=\"\" -DPACKAGE=\"mesos\" -DVERSION=\"0.28.3\" -DSTDC_HEADERS=1 -DHAVE_SYS_TYPES_H=1 -DHAVE_SYS_STAT_H=1 -DHAVE_STDLIB_H=1 -DHAVE_STRING_H=1 -DHAVE_MEMORY_H=1 -DHAVE_STRINGS_H=1 -DHAVE_INTTYPES_H=1 -DHAVE_STDINT_H=1 -DHAVE_UNISTD_H=1 -DHAVE_DLFCN_H=1 -DLT_OBJDIR=\".libs/\" -DHAVE_PTHREAD_PRIO_INHERIT=1 -DHAVE_PTHREAD=1 -DHAVE_LIBZ=1 -DHAVE_LIBCURL=1 -DHAVE_APR_POOLS_H=1 -DHAVE_LIBAPR_1=1 -DHAVE_SVN_VERSION_H=1 -DHAVE_LIBSVN_SUBR_1=1 -DHAVE_SVN_DELTA_H=1 -DHAVE_LIBSVN_DELTA_1=1 -DHAVE_LIBSASL2=1 -DMESOS_HAS_JAVA=1 -DHAVE_PYTHON=\"2.7\" -DMESOS_HAS_PYTHON=1 -DHAVE_EVENT2_EVENT_H=1 -DHAVE_LIBEVENT=1 -DHAVE_EVENT2_THREAD_H=1 -DHAVE_LIBEVENT_PTHREADS=1 -DHAVE_OPENSSL_SSL_H=1 -DHAVE_LIBSSL=1 -DHAVE_LIBCRYPTO=1 -DHAVE_EVENT2_BUFFEREVENT_SSL_H=1 -DHAVE_LIBEVENT_OPENSSL=1 -DUSE_SSL_SOCKET=1 -I. -I../../src   -Wall -Werror -DLIBDIR=\"/mesos/mesos-0.28.3/_inst/lib\" -DPKGLIBEXECDIR=\"/mesos/mesos-0.28.3/_inst/libexec/mesos\" -DPKGDATADIR=\"/mesos/mesos-0.28.3/_inst/share/mesos\" -DPKGMODULEDIR=\"/mesos/mesos-0.28.3/_inst/lib/mesos/modules\" -I../../include -I../../3rdparty/libprocess/include -I../../3rdparty/libprocess/3rdparty/stout/include -I../include -I../include/mesos -isystem ../3rdparty/libprocess/3rdparty/boost-1.53.0 -I../3rdparty/libprocess/3rdparty/picojson-1.3.0 -DPICOJSON_USE_INT64 -D__STDC_FORMAT_MACROS -I../3rdparty/libprocess/3rdparty/protobuf-2.5.0/src -I../3rdparty/libprocess/3rdparty/glog-0.3.3/src -I../3rdparty/libprocess/3rdparty/glog-0.3.3/src -I../3rdparty/leveldb-1.4/include -I../3rdparty/zookeeper-3.4.5/src/c/include -I../3rdparty/zookeeper-3.4.5/src/c/generated -I../3rdparty/libprocess/3rdparty/protobuf-2.5.0/src -I/usr/include/subversion-1 -I/usr/include/apr-1 -I/usr/include/apr-1.0  -pthread -g1 -O0 -std=c++11 -MT examples/no_executor_framework-no_executor_framework.o -MD -MP -MF examples/.deps/no_executor_framework-no_executor_framework.Tpo -c -o examples/no_executor_framework-no_executor_framework.o `test -f 'examples/no_executor_framework.cpp' || echo '../../src/'`examples/no_executor_framework.cpp
clang++ -DPACKAGE_NAME=\"mesos\" -DPACKAGE_TARNAME=\"mesos\" -DPACKAGE_VERSION=\"0.28.3\" -DPACKAGE_STRING=\"mesos\ 0.28.3\" -DPACKAGE_BUGREPORT=\"\" -DPACKAGE_URL=\"\" -DPACKAGE=\"mesos\" -DVERSION=\"0.28.3\" -DSTDC_HEADERS=1 -DHAVE_SYS_TYPES_H=1 -DHAVE_SYS_STAT_H=1 -DHAVE_STDLIB_H=1 -DHAVE_STRING_H=1 -DHAVE_MEMORY_H=1 -DHAVE_STRINGS_H=1 -DHAVE_INTTYPES_H=1 -DHAVE_STDINT_H=1 -DHAVE_UNISTD_H=1 -DHAVE_DLFCN_H=1 -DLT_OBJDIR=\".libs/\" -DHAVE_PTHREAD_PRIO_INHERIT=1 -DHAVE_PTHREAD=1 -DHAVE_LIBZ=1 -DHAVE_LIBCURL=1 -DHAVE_APR_POOLS_H=1 -DHAVE_LIBAPR_1=1 -DHAVE_SVN_VERSION_H=1 -DHAVE_LIBSVN_SUBR_1=1 -DHAVE_SVN_DELTA_H=1 -DHAVE_LIBSVN_DELTA_1=1 -DHAVE_LIBSASL2=1 -DMESOS_HAS_JAVA=1 -DHAVE_PYTHON=\"2.7\" -DMESOS_HAS_PYTHON=1 -DHAVE_EVENT2_EVENT_H=1 -DHAVE_LIBEVENT=1 -DHAVE_EVENT2_THREAD_H=1 -DHAVE_LIBEVENT_PTHREADS=1 -DHAVE_OPENSSL_SSL_H=1 -DHAVE_LIBSSL=1 -DHAVE_LIBCRYPTO=1 -DHAVE_EVENT2_BUFFEREVENT_SSL_H=1 -DHAVE_LIBEVENT_OPENSSL=1 -DUSE_SSL_SOCKET=1 -I. -I../../src   -Wall -Werror -DLIBDIR=\"/mesos/mesos-0.28.3/_inst/lib\" -DPKGLIBEXECDIR=\"/mesos/mesos-0.28.3/_inst/libexec/mesos\" -DPKGDATADIR=\"/mesos/mesos-0.28.3/_inst/share/mesos\" -DPKGMODULEDIR=\"/mesos/mesos-0.28.3/_inst/lib/mesos/modules\" -I../../include -I../../3rdparty/libprocess/include -I../../3rdparty/libprocess/3rdparty/stout/include -I../include -I../include/mesos -isystem ../3rdparty/libprocess/3rdparty/boost-1.53.0 -I../3rdparty/libprocess/3rdparty/picojson-1.3.0 -DPICOJSON_USE_INT64 -D__STDC_FORMAT_MACROS -I../3rdparty/libprocess/3rdparty/protobuf-2.5.0/src -I../3rdparty/libprocess/3rdparty/glog-0.3.3/src -I../3rdparty/libprocess/3rdparty/glog-0.3.3/src -I../3rdparty/leveldb-1.4/include -I../3rdparty/zookeeper-3.4.5/src/c/include -I../3rdparty/zookeeper-3.4.5/src/c/generated -I../3rdparty/libprocess/3rdparty/protobuf-2.5.0/src -I/usr/include/subversion-1 -I/usr/include/apr-1 -I/usr/include/apr-1.0  -pthread -g1 -O0 -std=c++11 -MT examples/docker_no_executor_framework-docker_no_executor_framework.o -MD -MP -MF examples/.deps/docker_no_executor_framework-docker_no_executor_framework.Tpo -c -o examples/docker_no_executor_framework-docker_no_executor_framework.o `test -f 'examples/docker_no_executor_framework.cpp' || echo '../../src/'`examples/docker_no_executor_framework.cpp
mv -f examples/.deps/long_lived_executor-long_lived_executor.Tpo examples/.deps/long_lived_executor-long_lived_executor.Po
clang++ -DPACKAGE_NAME=\"mesos\" -DPACKAGE_TARNAME=\"mesos\" -DPACKAGE_VERSION=\"0.28.3\" -DPACKAGE_STRING=\"mesos\ 0.28.3\" -DPACKAGE_BUGREPORT=\"\" -DPACKAGE_URL=\"\" -DPACKAGE=\"mesos\" -DVERSION=\"0.28.3\" -DSTDC_HEADERS=1 -DHAVE_SYS_TYPES_H=1 -DHAVE_SYS_STAT_H=1 -DHAVE_STDLIB_H=1 -DHAVE_STRING_H=1 -DHAVE_MEMORY_H=1 -DHAVE_STRINGS_H=1 -DHAVE_INTTYPES_H=1 -DHAVE_STDINT_H=1 -DHAVE_UNISTD_H=1 -DHAVE_DLFCN_H=1 -DLT_OBJDIR=\".libs/\" -DHAVE_PTHREAD_PRIO_INHERIT=1 -DHAVE_PTHREAD=1 -DHAVE_LIBZ=1 -DHAVE_LIBCURL=1 -DHAVE_APR_POOLS_H=1 -DHAVE_LIBAPR_1=1 -DHAVE_SVN_VERSION_H=1 -DHAVE_LIBSVN_SUBR_1=1 -DHAVE_SVN_DELTA_H=1 -DHAVE_LIBSVN_DELTA_1=1 -DHAVE_LIBSASL2=1 -DMESOS_HAS_JAVA=1 -DHAVE_PYTHON=\"2.7\" -DMESOS_HAS_PYTHON=1 -DHAVE_EVENT2_EVENT_H=1 -DHAVE_LIBEVENT=1 -DHAVE_EVENT2_THREAD_H=1 -DHAVE_LIBEVENT_PTHREADS=1 -DHAVE_OPENSSL_SSL_H=1 -DHAVE_LIBSSL=1 -DHAVE_LIBCRYPTO=1 -DHAVE_EVENT2_BUFFEREVENT_SSL_H=1 -DHAVE_LIBEVENT_OPENSSL=1 -DUSE_SSL_SOCKET=1 -I. -I../../src   -Wall -Werror -DLIBDIR=\"/mesos/mesos-0.28.3/_inst/lib\" -DPKGLIBEXECDIR=\"/mesos/mesos-0.28.3/_inst/libexec/mesos\" -DPKGDATADIR=\"/mesos/mesos-0.28.3/_inst/share/mesos\" -DPKGMODULEDIR=\"/mesos/mesos-0.28.3/_inst/lib/mesos/modules\" -I../../include -I../../3rdparty/libprocess/include -I../../3rdparty/libprocess/3rdparty/stout/include -I../include -I../include/mesos -isystem ../3rdparty/libprocess/3rdparty/boost-1.53.0 -I../3rdparty/libprocess/3rdparty/picojson-1.3.0 -DPICOJSON_USE_INT64 -D__STDC_FORMAT_MACROS -I../3rdparty/libprocess/3rdparty/protobuf-2.5.0/src -I../3rdparty/libprocess/3rdparty/glog-0.3.3/src -I../3rdparty/libprocess/3rdparty/glog-0.3.3/src -I../3rdparty/leveldb-1.4/include -I../3rdparty/zookeeper-3.4.5/src/c/include -I../3rdparty/zookeeper-3.4.5/src/c/generated -I../3rdparty/libprocess/3rdparty/protobuf-2.5.0/src -I/usr/include/subversion-1 -I/usr/include/apr-1 -I/usr/include/apr-1.0  -pthread -g1 -O0 -std=c++11 -MT examples/balloon_framework-balloon_framework.o -MD -MP -MF examples/.deps/balloon_framework-balloon_framework.Tpo -c -o examples/balloon_framework-balloon_framework.o `test -f 'examples/balloon_framework.cpp' || echo '../../src/'`examples/balloon_framework.cpp
mv -f examples/.deps/test_executor-test_executor.Tpo examples/.deps/test_executor-test_executor.Po
clang++ -DPACKAGE_NAME=\"mesos\" -DPACKAGE_TARNAME=\"mesos\" -DPACKAGE_VERSION=\"0.28.3\" -DPACKAGE_STRING=\"mesos\ 0.28.3\" -DPACKAGE_BUGREPORT=\"\" -DPACKAGE_URL=\"\" -DPACKAGE=\"mesos\" -DVERSION=\"0.28.3\" -DSTDC_HEADERS=1 -DHAVE_SYS_TYPES_H=1 -DHAVE_SYS_STAT_H=1 -DHAVE_STDLIB_H=1 -DHAVE_STRING_H=1 -DHAVE_MEMORY_H=1 -DHAVE_STRINGS_H=1 -DHAVE_INTTYPES_H=1 -DHAVE_STDINT_H=1 -DHAVE_UNISTD_H=1 -DHAVE_DLFCN_H=1 -DLT_OBJDIR=\".libs/\" -DHAVE_PTHREAD_PRIO_INHERIT=1 -DHAVE_PTHREAD=1 -DHAVE_LIBZ=1 -DHAVE_LIBCURL=1 -DHAVE_APR_POOLS_H=1 -DHAVE_LIBAPR_1=1 -DHAVE_SVN_VERSION_H=1 -DHAVE_LIBSVN_SUBR_1=1 -DHAVE_SVN_DELTA_H=1 -DHAVE_LIBSVN_DELTA_1=1 -DHAVE_LIBSASL2=1 -DMESOS_HAS_JAVA=1 -DHAVE_PYTHON=\"2.7\" -DMESOS_HAS_PYTHON=1 -DHAVE_EVENT2_EVENT_H=1 -DHAVE_LIBEVENT=1 -DHAVE_EVENT2_THREAD_H=1 -DHAVE_LIBEVENT_PTHREADS=1 -DHAVE_OPENSSL_SSL_H=1 -DHAVE_LIBSSL=1 -DHAVE_LIBCRYPTO=1 -DHAVE_EVENT2_BUFFEREVENT_SSL_H=1 -DHAVE_LIBEVENT_OPENSSL=1 -DUSE_SSL_SOCKET=1 -I. -I../../src   -Wall -Werror -DLIBDIR=\"/mesos/mesos-0.28.3/_inst/lib\" -DPKGLIBEXECDIR=\"/mesos/mesos-0.28.3/_inst/libexec/mesos\" -DPKGDATADIR=\"/mesos/mesos-0.28.3/_inst/share/mesos\" -DPKGMODULEDIR=\"/mesos/mesos-0.28.3/_inst/lib/mesos/modules\" -I../../include -I../../3rdparty/libprocess/include -I../../3rdparty/libprocess/3rdparty/stout/include -I../include -I../include/mesos -isystem ../3rdparty/libprocess/3rdparty/boost-1.53.0 -I../3rdparty/libprocess/3rdparty/picojson-1.3.0 -DPICOJSON_USE_INT64 -D__STDC_FORMAT_MACROS -I../3rdparty/libprocess/3rdparty/protobuf-2.5.0/src -I../3rdparty/libprocess/3rdparty/glog-0.3.3/src -I../3rdparty/libprocess/3rdparty/glog-0.3.3/src -I../3rdparty/leveldb-1.4/include -I../3rdparty/zookeeper-3.4.5/src/c/include -I../3rdparty/zookeeper-3.4.5/src/c/generated -I../3rdparty/libprocess/3rdparty/protobuf-2.5.0/src -I/usr/include/subversion-1 -I/usr/include/apr-1 -I/usr/include/apr-1.0  -pthread -g1 -O0 -std=c++11 -MT examples/balloon_executor-balloon_executor.o -MD -MP -MF examples/.deps/balloon_executor-balloon_executor.Tpo -c -o examples/balloon_executor-balloon_executor.o `test -f 'examples/balloon_executor.cpp' || echo '../../src/'`examples/balloon_executor.cpp
mv -f examples/.deps/docker_no_executor_framework-docker_no_executor_framework.Tpo examples/.deps/docker_no_executor_framework-docker_no_executor_framework.Po
clang++ -DPACKAGE_NAME=\"mesos\" -DPACKAGE_TARNAME=\"mesos\" -DPACKAGE_VERSION=\"0.28.3\" -DPACKAGE_STRING=\"mesos\ 0.28.3\" -DPACKAGE_BUGREPORT=\"\" -DPACKAGE_URL=\"\" -DPACKAGE=\"mesos\" -DVERSION=\"0.28.3\" -DSTDC_HEADERS=1 -DHAVE_SYS_TYPES_H=1 -DHAVE_SYS_STAT_H=1 -DHAVE_STDLIB_H=1 -DHAVE_STRING_H=1 -DHAVE_MEMORY_H=1 -DHAVE_STRINGS_H=1 -DHAVE_INTTYPES_H=1 -DHAVE_STDINT_H=1 -DHAVE_UNISTD_H=1 -DHAVE_DLFCN_H=1 -DLT_OBJDIR=\".libs/\" -DHAVE_PTHREAD_PRIO_INHERIT=1 -DHAVE_PTHREAD=1 -DHAVE_LIBZ=1 -DHAVE_LIBCURL=1 -DHAVE_APR_POOLS_H=1 -DHAVE_LIBAPR_1=1 -DHAVE_SVN_VERSION_H=1 -DHAVE_LIBSVN_SUBR_1=1 -DHAVE_SVN_DELTA_H=1 -DHAVE_LIBSVN_DELTA_1=1 -DHAVE_LIBSASL2=1 -DMESOS_HAS_JAVA=1 -DHAVE_PYTHON=\"2.7\" -DMESOS_HAS_PYTHON=1 -DHAVE_EVENT2_EVENT_H=1 -DHAVE_LIBEVENT=1 -DHAVE_EVENT2_THREAD_H=1 -DHAVE_LIBEVENT_PTHREADS=1 -DHAVE_OPENSSL_SSL_H=1 -DHAVE_LIBSSL=1 -DHAVE_LIBCRYPTO=1 -DHAVE_EVENT2_BUFFEREVENT_SSL_H=1 -DHAVE_LIBEVENT_OPENSSL=1 -DUSE_SSL_SOCKET=1 -I. -I../../src   -Wall -Werror -DLIBDIR=\"/mesos/mesos-0.28.3/_inst/lib\" -DPKGLIBEXECDIR=\"/mesos/mesos-0.28.3/_inst/libexec/mesos\" -DPKGDATADIR=\"/mesos/mesos-0.28.3/_inst/share/mesos\" -DPKGMODULEDIR=\"/mesos/mesos-0.28.3/_inst/lib/mesos/modules\" -I../../include -I../../3rdparty/libprocess/include -I../../3rdparty/libprocess/3rdparty/stout/include -I../include -I../include/mesos -isystem ../3rdparty/libprocess/3rdparty/boost-1.53.0 -I../3rdparty/libprocess/3rdparty/picojson-1.3.0 -DPICOJSON_USE_INT64 -D__STDC_FORMAT_MACROS -I../3rdparty/libprocess/3rdparty/protobuf-2.5.0/src -I../3rdparty/libprocess/3rdparty/glog-0.3.3/src -I../3rdparty/libprocess/3rdparty/glog-0.3.3/src -I../3rdparty/leveldb-1.4/include -I../3rdparty/zookeeper-3.4.5/src/c/include -I../3rdparty/zookeeper-3.4.5/src/c/generated -I../3rdparty/libprocess/3rdparty/protobuf-2.5.0/src -I/usr/include/subversion-1 -I/usr/include/apr-1 -I/usr/include/apr-1.0  -pthread -g1 -O0 -std=c++11 -MT examples/load_generator_framework-load_generator_framework.o -MD -MP -MF examples/.deps/load_generator_framework-load_generator_framework.Tpo -c -o examples/load_generator_framework-load_generator_framework.o `test -f 'examples/load_generator_framework.cpp' || echo '../../src/'`examples/load_generator_framework.cpp
mv -f examples/.deps/long_lived_framework-long_lived_framework.Tpo examples/.deps/long_lived_framework-long_lived_framework.Po
clang++ -DPACKAGE_NAME=\"mesos\" -DPACKAGE_TARNAME=\"mesos\" -DPACKAGE_VERSION=\"0.28.3\" -DPACKAGE_STRING=\"mesos\ 0.28.3\" -DPACKAGE_BUGREPORT=\"\" -DPACKAGE_URL=\"\" -DPACKAGE=\"mesos\" -DVERSION=\"0.28.3\" -DSTDC_HEADERS=1 -DHAVE_SYS_TYPES_H=1 -DHAVE_SYS_STAT_H=1 -DHAVE_STDLIB_H=1 -DHAVE_STRING_H=1 -DHAVE_MEMORY_H=1 -DHAVE_STRINGS_H=1 -DHAVE_INTTYPES_H=1 -DHAVE_STDINT_H=1 -DHAVE_UNISTD_H=1 -DHAVE_DLFCN_H=1 -DLT_OBJDIR=\".libs/\" -DHAVE_PTHREAD_PRIO_INHERIT=1 -DHAVE_PTHREAD=1 -DHAVE_LIBZ=1 -DHAVE_LIBCURL=1 -DHAVE_APR_POOLS_H=1 -DHAVE_LIBAPR_1=1 -DHAVE_SVN_VERSION_H=1 -DHAVE_LIBSVN_SUBR_1=1 -DHAVE_SVN_DELTA_H=1 -DHAVE_LIBSVN_DELTA_1=1 -DHAVE_LIBSASL2=1 -DMESOS_HAS_JAVA=1 -DHAVE_PYTHON=\"2.7\" -DMESOS_HAS_PYTHON=1 -DHAVE_EVENT2_EVENT_H=1 -DHAVE_LIBEVENT=1 -DHAVE_EVENT2_THREAD_H=1 -DHAVE_LIBEVENT_PTHREADS=1 -DHAVE_OPENSSL_SSL_H=1 -DHAVE_LIBSSL=1 -DHAVE_LIBCRYPTO=1 -DHAVE_EVENT2_BUFFEREVENT_SSL_H=1 -DHAVE_LIBEVENT_OPENSSL=1 -DUSE_SSL_SOCKET=1 -I. -I../../src   -Wall -Werror -DLIBDIR=\"/mesos/mesos-0.28.3/_inst/lib\" -DPKGLIBEXECDIR=\"/mesos/mesos-0.28.3/_inst/libexec/mesos\" -DPKGDATADIR=\"/mesos/mesos-0.28.3/_inst/share/mesos\" -DPKGMODULEDIR=\"/mesos/mesos-0.28.3/_inst/lib/mesos/modules\" -I../../include -I../../3rdparty/libprocess/include -I../../3rdparty/libprocess/3rdparty/stout/include -I../include -I../include/mesos -isystem ../3rdparty/libprocess/3rdparty/boost-1.53.0 -I../3rdparty/libprocess/3rdparty/picojson-1.3.0 -DPICOJSON_USE_INT64 -D__STDC_FORMAT_MACROS -I../3rdparty/libprocess/3rdparty/protobuf-2.5.0/src -I../3rdparty/libprocess/3rdparty/glog-0.3.3/src -I../3rdparty/libprocess/3rdparty/glog-0.3.3/src -I../3rdparty/leveldb-1.4/include -I../3rdparty/zookeeper-3.4.5/src/c/include -I../3rdparty/zookeeper-3.4.5/src/c/generated -I../3rdparty/libprocess/3rdparty/protobuf-2.5.0/src -I/usr/include/subversion-1 -I/usr/include/apr-1 -I/usr/include/apr-1.0  -pthread -g1 -O0 -std=c++11 -MT examples/persistent_volume_framework-persistent_volume_framework.o -MD -MP -MF examples/.deps/persistent_volume_framework-persistent_volume_framework.Tpo -c -o examples/persistent_volume_framework-persistent_volume_framework.o `test -f 'examples/persistent_volume_framework.cpp' || echo '../../src/'`examples/persistent_volume_framework.cpp
mv -f examples/.deps/test_framework-test_framework.Tpo examples/.deps/test_framework-test_framework.Po
clang++ -DPACKAGE_NAME=\"mesos\" -DPACKAGE_TARNAME=\"mesos\" -DPACKAGE_VERSION=\"0.28.3\" -DPACKAGE_STRING=\"mesos\ 0.28.3\" -DPACKAGE_BUGREPORT=\"\" -DPACKAGE_URL=\"\" -DPACKAGE=\"mesos\" -DVERSION=\"0.28.3\" -DSTDC_HEADERS=1 -DHAVE_SYS_TYPES_H=1 -DHAVE_SYS_STAT_H=1 -DHAVE_STDLIB_H=1 -DHAVE_STRING_H=1 -DHAVE_MEMORY_H=1 -DHAVE_STRINGS_H=1 -DHAVE_INTTYPES_H=1 -DHAVE_STDINT_H=1 -DHAVE_UNISTD_H=1 -DHAVE_DLFCN_H=1 -DLT_OBJDIR=\".libs/\" -DHAVE_PTHREAD_PRIO_INHERIT=1 -DHAVE_PTHREAD=1 -DHAVE_LIBZ=1 -DHAVE_LIBCURL=1 -DHAVE_APR_POOLS_H=1 -DHAVE_LIBAPR_1=1 -DHAVE_SVN_VERSION_H=1 -DHAVE_LIBSVN_SUBR_1=1 -DHAVE_SVN_DELTA_H=1 -DHAVE_LIBSVN_DELTA_1=1 -DHAVE_LIBSASL2=1 -DMESOS_HAS_JAVA=1 -DHAVE_PYTHON=\"2.7\" -DMESOS_HAS_PYTHON=1 -DHAVE_EVENT2_EVENT_H=1 -DHAVE_LIBEVENT=1 -DHAVE_EVENT2_THREAD_H=1 -DHAVE_LIBEVENT_PTHREADS=1 -DHAVE_OPENSSL_SSL_H=1 -DHAVE_LIBSSL=1 -DHAVE_LIBCRYPTO=1 -DHAVE_EVENT2_BUFFEREVENT_SSL_H=1 -DHAVE_LIBEVENT_OPENSSL=1 -DUSE_SSL_SOCKET=1 -I. -I../../src   -Wall -Werror -DLIBDIR=\"/mesos/mesos-0.28.3/_inst/lib\" -DPKGLIBEXECDIR=\"/mesos/mesos-0.28.3/_inst/libexec/mesos\" -DPKGDATADIR=\"/mesos/mesos-0.28.3/_inst/share/mesos\" -DPKGMODULEDIR=\"/mesos/mesos-0.28.3/_inst/lib/mesos/modules\" -I../../include -I../../3rdparty/libprocess/include -I../../3rdparty/libprocess/3rdparty/stout/include -I../include -I../include/mesos -isystem ../3rdparty/libprocess/3rdparty/boost-1.53.0 -I../3rdparty/libprocess/3rdparty/picojson-1.3.0 -DPICOJSON_USE_INT64 -D__STDC_FORMAT_MACROS -I../3rdparty/libprocess/3rdparty/protobuf-2.5.0/src -I../3rdparty/libprocess/3rdparty/glog-0.3.3/src -I../3rdparty/libprocess/3rdparty/glog-0.3.3/src -I../3rdparty/leveldb-1.4/include -I../3rdparty/zookeeper-3.4.5/src/c/include -I../3rdparty/zookeeper-3.4.5/src/c/generated -I../3rdparty/libprocess/3rdparty/protobuf-2.5.0/src -DSOURCE_DIR=\"/mesos/mesos-0.28.3/_build/..\" -DBUILD_DIR=\"/mesos/mesos-0.28.3/_build\" -I../3rdparty/libprocess/3rdparty/gmock-1.7.0/gtest/include -I../3rdparty/libprocess/3rdparty/gmock-1.7.0/include -DTESTLIBEXECDIR=\"/mesos/mesos-0.28.3/_inst/libexec/mesos/tests\" -DSBINDIR=\"/mesos/mesos-0.28.3/_inst/sbin\" -I/usr/lib/jvm/java-7-openjdk-amd64/include -I/usr/lib/jvm/java-7-openjdk-amd64/include/linux -DZOOKEEPER_VERSION=\"3.4.5\" -I/usr/include/subversion-1 -I/usr/include/apr-1 -I/usr/include/apr-1.0  -pthread -g1 -O0 -std=c++11 -MT tests/containerizer/memory_test_helper-memory_test_helper_main.o -MD -MP -MF tests/containerizer/.deps/memory_test_helper-memory_test_helper_main.Tpo -c -o tests/containerizer/memory_test_helper-memory_test_helper_main.o `test -f 'tests/containerizer/memory_test_helper_main.cpp' || echo '../../src/'`tests/containerizer/memory_test_helper_main.cpp
mv -f examples/.deps/no_executor_framework-no_executor_framework.Tpo examples/.deps/no_executor_framework-no_executor_framework.Po
clang++ -DPACKAGE_NAME=\"mesos\" -DPACKAGE_TARNAME=\"mesos\" -DPACKAGE_VERSION=\"0.28.3\" -DPACKAGE_STRING=\"mesos\ 0.28.3\" -DPACKAGE_BUGREPORT=\"\" -DPACKAGE_URL=\"\" -DPACKAGE=\"mesos\" -DVERSION=\"0.28.3\" -DSTDC_HEADERS=1 -DHAVE_SYS_TYPES_H=1 -DHAVE_SYS_STAT_H=1 -DHAVE_STDLIB_H=1 -DHAVE_STRING_H=1 -DHAVE_MEMORY_H=1 -DHAVE_STRINGS_H=1 -DHAVE_INTTYPES_H=1 -DHAVE_STDINT_H=1 -DHAVE_UNISTD_H=1 -DHAVE_DLFCN_H=1 -DLT_OBJDIR=\".libs/\" -DHAVE_PTHREAD_PRIO_INHERIT=1 -DHAVE_PTHREAD=1 -DHAVE_LIBZ=1 -DHAVE_LIBCURL=1 -DHAVE_APR_POOLS_H=1 -DHAVE_LIBAPR_1=1 -DHAVE_SVN_VERSION_H=1 -DHAVE_LIBSVN_SUBR_1=1 -DHAVE_SVN_DELTA_H=1 -DHAVE_LIBSVN_DELTA_1=1 -DHAVE_LIBSASL2=1 -DMESOS_HAS_JAVA=1 -DHAVE_PYTHON=\"2.7\" -DMESOS_HAS_PYTHON=1 -DHAVE_EVENT2_EVENT_H=1 -DHAVE_LIBEVENT=1 -DHAVE_EVENT2_THREAD_H=1 -DHAVE_LIBEVENT_PTHREADS=1 -DHAVE_OPENSSL_SSL_H=1 -DHAVE_LIBSSL=1 -DHAVE_LIBCRYPTO=1 -DHAVE_EVENT2_BUFFEREVENT_SSL_H=1 -DHAVE_LIBEVENT_OPENSSL=1 -DUSE_SSL_SOCKET=1 -I. -I../../src   -Wall -Werror -DLIBDIR=\"/mesos/mesos-0.28.3/_inst/lib\" -DPKGLIBEXECDIR=\"/mesos/mesos-0.28.3/_inst/libexec/mesos\" -DPKGDATADIR=\"/mesos/mesos-0.28.3/_inst/share/mesos\" -DPKGMODULEDIR=\"/mesos/mesos-0.28.3/_inst/lib/mesos/modules\" -I../../include -I../../3rdparty/libprocess/include -I../../3rdparty/libprocess/3rdparty/stout/include -I../include -I../include/mesos -isystem ../3rdparty/libprocess/3rdparty/boost-1.53.0 -I../3rdparty/libprocess/3rdparty/picojson-1.3.0 -DPICOJSON_USE_INT64 -D__STDC_FORMAT_MACROS -I../3rdparty/libprocess/3rdparty/protobuf-2.5.0/src -I../3rdparty/libprocess/3rdparty/glog-0.3.3/src -I../3rdparty/libprocess/3rdparty/glog-0.3.3/src -I../3rdparty/leveldb-1.4/include -I../3rdparty/zookeeper-3.4.5/src/c/include -I../3rdparty/zookeeper-3.4.5/src/c/generated -I../3rdparty/libprocess/3rdparty/protobuf-2.5.0/src -DSOURCE_DIR=\"/mesos/mesos-0.28.3/_build/..\" -DBUILD_DIR=\"/mesos/mesos-0.28.3/_build\" -I../3rdparty/libprocess/3rdparty/gmock-1.7.0/gtest/include -I../3rdparty/libprocess/3rdparty/gmock-1.7.0/include -DTESTLIBEXECDIR=\"/mesos/mesos-0.28.3/_inst/libexec/mesos/tests\" -DSBINDIR=\"/mesos/mesos-0.28.3/_inst/sbin\" -I/usr/lib/jvm/java-7-openjdk-amd64/include -I/usr/lib/jvm/java-7-openjdk-amd64/include/linux -DZOOKEEPER_VERSION=\"3.4.5\" -I/usr/include/subversion-1 -I/usr/include/apr-1 -I/usr/include/apr-1.0  -pthread -g1 -O0 -std=c++11 -MT tests/containerizer/memory_test_helper-memory_test_helper.o -MD -MP -MF tests/containerizer/.deps/memory_test_helper-memory_test_helper.Tpo -c -o tests/containerizer/memory_test_helper-memory_test_helper.o `test -f 'tests/containerizer/memory_test_helper.cpp' || echo '../../src/'`tests/containerizer/memory_test_helper.cpp
mv -f examples/.deps/test_http_executor-test_http_executor.Tpo examples/.deps/test_http_executor-test_http_executor.Po
clang++ -DPACKAGE_NAME=\"mesos\" -DPACKAGE_TARNAME=\"mesos\" -DPACKAGE_VERSION=\"0.28.3\" -DPACKAGE_STRING=\"mesos\ 0.28.3\" -DPACKAGE_BUGREPORT=\"\" -DPACKAGE_URL=\"\" -DPACKAGE=\"mesos\" -DVERSION=\"0.28.3\" -DSTDC_HEADERS=1 -DHAVE_SYS_TYPES_H=1 -DHAVE_SYS_STAT_H=1 -DHAVE_STDLIB_H=1 -DHAVE_STRING_H=1 -DHAVE_MEMORY_H=1 -DHAVE_STRINGS_H=1 -DHAVE_INTTYPES_H=1 -DHAVE_STDINT_H=1 -DHAVE_UNISTD_H=1 -DHAVE_DLFCN_H=1 -DLT_OBJDIR=\".libs/\" -DHAVE_PTHREAD_PRIO_INHERIT=1 -DHAVE_PTHREAD=1 -DHAVE_LIBZ=1 -DHAVE_LIBCURL=1 -DHAVE_APR_POOLS_H=1 -DHAVE_LIBAPR_1=1 -DHAVE_SVN_VERSION_H=1 -DHAVE_LIBSVN_SUBR_1=1 -DHAVE_SVN_DELTA_H=1 -DHAVE_LIBSVN_DELTA_1=1 -DHAVE_LIBSASL2=1 -DMESOS_HAS_JAVA=1 -DHAVE_PYTHON=\"2.7\" -DMESOS_HAS_PYTHON=1 -DHAVE_EVENT2_EVENT_H=1 -DHAVE_LIBEVENT=1 -DHAVE_EVENT2_THREAD_H=1 -DHAVE_LIBEVENT_PTHREADS=1 -DHAVE_OPENSSL_SSL_H=1 -DHAVE_LIBSSL=1 -DHAVE_LIBCRYPTO=1 -DHAVE_EVENT2_BUFFEREVENT_SSL_H=1 -DHAVE_LIBEVENT_OPENSSL=1 -DUSE_SSL_SOCKET=1 -I. -I../../src   -Wall -Werror -DLIBDIR=\"/mesos/mesos-0.28.3/_inst/lib\" -DPKGLIBEXECDIR=\"/mesos/mesos-0.28.3/_inst/libexec/mesos\" -DPKGDATADIR=\"/mesos/mesos-0.28.3/_inst/share/mesos\" -DPKGMODULEDIR=\"/mesos/mesos-0.28.3/_inst/lib/mesos/modules\" -I../../include -I../../3rdparty/libprocess/include -I../../3rdparty/libprocess/3rdparty/stout/include -I../include -I../include/mesos -isystem ../3rdparty/libprocess/3rdparty/boost-1.53.0 -I../3rdparty/libprocess/3rdparty/picojson-1.3.0 -DPICOJSON_USE_INT64 -D__STDC_FORMAT_MACROS -I../3rdparty/libprocess/3rdparty/protobuf-2.5.0/src -I../3rdparty/libprocess/3rdparty/glog-0.3.3/src -I../3rdparty/libprocess/3rdparty/glog-0.3.3/src -I../3rdparty/leveldb-1.4/include -I../3rdparty/zookeeper-3.4.5/src/c/include -I../3rdparty/zookeeper-3.4.5/src/c/generated -I../3rdparty/libprocess/3rdparty/protobuf-2.5.0/src -I/usr/include/subversion-1 -I/usr/include/apr-1 -I/usr/include/apr-1.0  -pthread -g1 -O0 -std=c++11 -MT tests/active_user_test_helper-active_user_test_helper.o -MD -MP -MF tests/.deps/active_user_test_helper-active_user_test_helper.Tpo -c -o tests/active_user_test_helper-active_user_test_helper.o `test -f 'tests/active_user_test_helper.cpp' || echo '../../src/'`tests/active_user_test_helper.cpp
mv -f examples/.deps/balloon_executor-balloon_executor.Tpo examples/.deps/balloon_executor-balloon_executor.Po
clang++ -DPACKAGE_NAME=\"mesos\" -DPACKAGE_TARNAME=\"mesos\" -DPACKAGE_VERSION=\"0.28.3\" -DPACKAGE_STRING=\"mesos\ 0.28.3\" -DPACKAGE_BUGREPORT=\"\" -DPACKAGE_URL=\"\" -DPACKAGE=\"mesos\" -DVERSION=\"0.28.3\" -DSTDC_HEADERS=1 -DHAVE_SYS_TYPES_H=1 -DHAVE_SYS_STAT_H=1 -DHAVE_STDLIB_H=1 -DHAVE_STRING_H=1 -DHAVE_MEMORY_H=1 -DHAVE_STRINGS_H=1 -DHAVE_INTTYPES_H=1 -DHAVE_STDINT_H=1 -DHAVE_UNISTD_H=1 -DHAVE_DLFCN_H=1 -DLT_OBJDIR=\".libs/\" -DHAVE_PTHREAD_PRIO_INHERIT=1 -DHAVE_PTHREAD=1 -DHAVE_LIBZ=1 -DHAVE_LIBCURL=1 -DHAVE_APR_POOLS_H=1 -DHAVE_LIBAPR_1=1 -DHAVE_SVN_VERSION_H=1 -DHAVE_LIBSVN_SUBR_1=1 -DHAVE_SVN_DELTA_H=1 -DHAVE_LIBSVN_DELTA_1=1 -DHAVE_LIBSASL2=1 -DMESOS_HAS_JAVA=1 -DHAVE_PYTHON=\"2.7\" -DMESOS_HAS_PYTHON=1 -DHAVE_EVENT2_EVENT_H=1 -DHAVE_LIBEVENT=1 -DHAVE_EVENT2_THREAD_H=1 -DHAVE_LIBEVENT_PTHREADS=1 -DHAVE_OPENSSL_SSL_H=1 -DHAVE_LIBSSL=1 -DHAVE_LIBCRYPTO=1 -DHAVE_EVENT2_BUFFEREVENT_SSL_H=1 -DHAVE_LIBEVENT_OPENSSL=1 -DUSE_SSL_SOCKET=1 -I. -I../../src   -Wall -Werror -DLIBDIR=\"/mesos/mesos-0.28.3/_inst/lib\" -DPKGLIBEXECDIR=\"/mesos/mesos-0.28.3/_inst/libexec/mesos\" -DPKGDATADIR=\"/mesos/mesos-0.28.3/_inst/share/mesos\" -DPKGMODULEDIR=\"/mesos/mesos-0.28.3/_inst/lib/mesos/modules\" -I../../include -I../../3rdparty/libprocess/include -I../../3rdparty/libprocess/3rdparty/stout/include -I../include -I../include/mesos -isystem ../3rdparty/libprocess/3rdparty/boost-1.53.0 -I../3rdparty/libprocess/3rdparty/picojson-1.3.0 -DPICOJSON_USE_INT64 -D__STDC_FORMAT_MACROS -I../3rdparty/libprocess/3rdparty/protobuf-2.5.0/src -I../3rdparty/libprocess/3rdparty/glog-0.3.3/src -I../3rdparty/libprocess/3rdparty/glog-0.3.3/src -I../3rdparty/leveldb-1.4/include -I../3rdparty/zookeeper-3.4.5/src/c/include -I../3rdparty/zookeeper-3.4.5/src/c/generated -I../3rdparty/libprocess/3rdparty/protobuf-2.5.0/src -DSOURCE_DIR=\"/mesos/mesos-0.28.3/_build/..\" -DBUILD_DIR=\"/mesos/mesos-0.28.3/_build\" -I../3rdparty/libprocess/3rdparty/gmock-1.7.0/gtest/include -I../3rdparty/libprocess/3rdparty/gmock-1.7.0/include -DTESTLIBEXECDIR=\"/mesos/mesos-0.28.3/_inst/libexec/mesos/tests\" -DSBINDIR=\"/mesos/mesos-0.28.3/_inst/sbin\" -I/usr/lib/jvm/java-7-openjdk-amd64/include -I/usr/lib/jvm/java-7-openjdk-amd64/include/linux -DZOOKEEPER_VERSION=\"3.4.5\" -I/usr/include/subversion-1 -I/usr/include/apr-1 -I/usr/include/apr-1.0  -pthread -g1 -O0 -std=c++11 -MT slave/qos_controllers/mesos_tests-load.o -MD -MP -MF slave/qos_controllers/.deps/mesos_tests-load.Tpo -c -o slave/qos_controllers/mesos_tests-load.o `test -f 'slave/qos_controllers/load.cpp' || echo '../../src/'`slave/qos_controllers/load.cpp
mv -f examples/.deps/test_http_framework-test_http_framework.Tpo examples/.deps/test_http_framework-test_http_framework.Po
clang++ -DPACKAGE_NAME=\"mesos\" -DPACKAGE_TARNAME=\"mesos\" -DPACKAGE_VERSION=\"0.28.3\" -DPACKAGE_STRING=\"mesos\ 0.28.3\" -DPACKAGE_BUGREPORT=\"\" -DPACKAGE_URL=\"\" -DPACKAGE=\"mesos\" -DVERSION=\"0.28.3\" -DSTDC_HEADERS=1 -DHAVE_SYS_TYPES_H=1 -DHAVE_SYS_STAT_H=1 -DHAVE_STDLIB_H=1 -DHAVE_STRING_H=1 -DHAVE_MEMORY_H=1 -DHAVE_STRINGS_H=1 -DHAVE_INTTYPES_H=1 -DHAVE_STDINT_H=1 -DHAVE_UNISTD_H=1 -DHAVE_DLFCN_H=1 -DLT_OBJDIR=\".libs/\" -DHAVE_PTHREAD_PRIO_INHERIT=1 -DHAVE_PTHREAD=1 -DHAVE_LIBZ=1 -DHAVE_LIBCURL=1 -DHAVE_APR_POOLS_H=1 -DHAVE_LIBAPR_1=1 -DHAVE_SVN_VERSION_H=1 -DHAVE_LIBSVN_SUBR_1=1 -DHAVE_SVN_DELTA_H=1 -DHAVE_LIBSVN_DELTA_1=1 -DHAVE_LIBSASL2=1 -DMESOS_HAS_JAVA=1 -DHAVE_PYTHON=\"2.7\" -DMESOS_HAS_PYTHON=1 -DHAVE_EVENT2_EVENT_H=1 -DHAVE_LIBEVENT=1 -DHAVE_EVENT2_THREAD_H=1 -DHAVE_LIBEVENT_PTHREADS=1 -DHAVE_OPENSSL_SSL_H=1 -DHAVE_LIBSSL=1 -DHAVE_LIBCRYPTO=1 -DHAVE_EVENT2_BUFFEREVENT_SSL_H=1 -DHAVE_LIBEVENT_OPENSSL=1 -DUSE_SSL_SOCKET=1 -I. -I../../src   -Wall -Werror -DLIBDIR=\"/mesos/mesos-0.28.3/_inst/lib\" -DPKGLIBEXECDIR=\"/mesos/mesos-0.28.3/_inst/libexec/mesos\" -DPKGDATADIR=\"/mesos/mesos-0.28.3/_inst/share/mesos\" -DPKGMODULEDIR=\"/mesos/mesos-0.28.3/_inst/lib/mesos/modules\" -I../../include -I../../3rdparty/libprocess/include -I../../3rdparty/libprocess/3rdparty/stout/include -I../include -I../include/mesos -isystem ../3rdparty/libprocess/3rdparty/boost-1.53.0 -I../3rdparty/libprocess/3rdparty/picojson-1.3.0 -DPICOJSON_USE_INT64 -D__STDC_FORMAT_MACROS -I../3rdparty/libprocess/3rdparty/protobuf-2.5.0/src -I../3rdparty/libprocess/3rdparty/glog-0.3.3/src -I../3rdparty/libprocess/3rdparty/glog-0.3.3/src -I../3rdparty/leveldb-1.4/include -I../3rdparty/zookeeper-3.4.5/src/c/include -I../3rdparty/zookeeper-3.4.5/src/c/generated -I../3rdparty/libprocess/3rdparty/protobuf-2.5.0/src -DSOURCE_DIR=\"/mesos/mesos-0.28.3/_build/..\" -DBUILD_DIR=\"/mesos/mesos-0.28.3/_build\" -I../3rdparty/libprocess/3rdparty/gmock-1.7.0/gtest/include -I../3rdparty/libprocess/3rdparty/gmock-1.7.0/include -DTESTLIBEXECDIR=\"/mesos/mesos-0.28.3/_inst/libexec/mesos/tests\" -DSBINDIR=\"/mesos/mesos-0.28.3/_inst/sbin\" -I/usr/lib/jvm/java-7-openjdk-amd64/include -I/usr/lib/jvm/java-7-openjdk-amd64/include/linux -DZOOKEEPER_VERSION=\"3.4.5\" -I/usr/include/subversion-1 -I/usr/include/apr-1 -I/usr/include/apr-1.0  -pthread -g1 -O0 -std=c++11 -MT tests/mesos_tests-anonymous_tests.o -MD -MP -MF tests/.deps/mesos_tests-anonymous_tests.Tpo -c -o tests/mesos_tests-anonymous_tests.o `test -f 'tests/anonymous_tests.cpp' || echo '../../src/'`tests/anonymous_tests.cpp
mv -f tests/.deps/active_user_test_helper-active_user_test_helper.Tpo tests/.deps/active_user_test_helper-active_user_test_helper.Po
clang++ -DPACKAGE_NAME=\"mesos\" -DPACKAGE_TARNAME=\"mesos\" -DPACKAGE_VERSION=\"0.28.3\" -DPACKAGE_STRING=\"mesos\ 0.28.3\" -DPACKAGE_BUGREPORT=\"\" -DPACKAGE_URL=\"\" -DPACKAGE=\"mesos\" -DVERSION=\"0.28.3\" -DSTDC_HEADERS=1 -DHAVE_SYS_TYPES_H=1 -DHAVE_SYS_STAT_H=1 -DHAVE_STDLIB_H=1 -DHAVE_STRING_H=1 -DHAVE_MEMORY_H=1 -DHAVE_STRINGS_H=1 -DHAVE_INTTYPES_H=1 -DHAVE_STDINT_H=1 -DHAVE_UNISTD_H=1 -DHAVE_DLFCN_H=1 -DLT_OBJDIR=\".libs/\" -DHAVE_PTHREAD_PRIO_INHERIT=1 -DHAVE_PTHREAD=1 -DHAVE_LIBZ=1 -DHAVE_LIBCURL=1 -DHAVE_APR_POOLS_H=1 -DHAVE_LIBAPR_1=1 -DHAVE_SVN_VERSION_H=1 -DHAVE_LIBSVN_SUBR_1=1 -DHAVE_SVN_DELTA_H=1 -DHAVE_LIBSVN_DELTA_1=1 -DHAVE_LIBSASL2=1 -DMESOS_HAS_JAVA=1 -DHAVE_PYTHON=\"2.7\" -DMESOS_HAS_PYTHON=1 -DHAVE_EVENT2_EVENT_H=1 -DHAVE_LIBEVENT=1 -DHAVE_EVENT2_THREAD_H=1 -DHAVE_LIBEVENT_PTHREADS=1 -DHAVE_OPENSSL_SSL_H=1 -DHAVE_LIBSSL=1 -DHAVE_LIBCRYPTO=1 -DHAVE_EVENT2_BUFFEREVENT_SSL_H=1 -DHAVE_LIBEVENT_OPENSSL=1 -DUSE_SSL_SOCKET=1 -I. -I../../src   -Wall -Werror -DLIBDIR=\"/mesos/mesos-0.28.3/_inst/lib\" -DPKGLIBEXECDIR=\"/mesos/mesos-0.28.3/_inst/libexec/mesos\" -DPKGDATADIR=\"/mesos/mesos-0.28.3/_inst/share/mesos\" -DPKGMODULEDIR=\"/mesos/mesos-0.28.3/_inst/lib/mesos/modules\" -I../../include -I../../3rdparty/libprocess/include -I../../3rdparty/libprocess/3rdparty/stout/include -I../include -I../include/mesos -isystem ../3rdparty/libprocess/3rdparty/boost-1.53.0 -I../3rdparty/libprocess/3rdparty/picojson-1.3.0 -DPICOJSON_USE_INT64 -D__STDC_FORMAT_MACROS -I../3rdparty/libprocess/3rdparty/protobuf-2.5.0/src -I../3rdparty/libprocess/3rdparty/glog-0.3.3/src -I../3rdparty/libprocess/3rdparty/glog-0.3.3/src -I../3rdparty/leveldb-1.4/include -I../3rdparty/zookeeper-3.4.5/src/c/include -I../3rdparty/zookeeper-3.4.5/src/c/generated -I../3rdparty/libprocess/3rdparty/protobuf-2.5.0/src -DSOURCE_DIR=\"/mesos/mesos-0.28.3/_build/..\" -DBUILD_DIR=\"/mesos/mesos-0.28.3/_build\" -I../3rdparty/libprocess/3rdparty/gmock-1.7.0/gtest/include -I../3rdparty/libprocess/3rdparty/gmock-1.7.0/include -DTESTLIBEXECDIR=\"/mesos/mesos-0.28.3/_inst/libexec/mesos/tests\" -DSBINDIR=\"/mesos/mesos-0.28.3/_inst/sbin\" -I/usr/lib/jvm/java-7-openjdk-amd64/include -I/usr/lib/jvm/java-7-openjdk-amd64/include/linux -DZOOKEEPER_VERSION=\"3.4.5\" -I/usr/include/subversion-1 -I/usr/include/apr-1 -I/usr/include/apr-1.0  -pthread -g1 -O0 -std=c++11 -MT tests/mesos_tests-attributes_tests.o -MD -MP -MF tests/.deps/mesos_tests-attributes_tests.Tpo -c -o tests/mesos_tests-attributes_tests.o `test -f 'tests/attributes_tests.cpp' || echo '../../src/'`tests/attributes_tests.cpp
mv -f examples/.deps/balloon_framework-balloon_framework.Tpo examples/.deps/balloon_framework-balloon_framework.Po
clang++ -DPACKAGE_NAME=\"mesos\" -DPACKAGE_TARNAME=\"mesos\" -DPACKAGE_VERSION=\"0.28.3\" -DPACKAGE_STRING=\"mesos\ 0.28.3\" -DPACKAGE_BUGREPORT=\"\" -DPACKAGE_URL=\"\" -DPACKAGE=\"mesos\" -DVERSION=\"0.28.3\" -DSTDC_HEADERS=1 -DHAVE_SYS_TYPES_H=1 -DHAVE_SYS_STAT_H=1 -DHAVE_STDLIB_H=1 -DHAVE_STRING_H=1 -DHAVE_MEMORY_H=1 -DHAVE_STRINGS_H=1 -DHAVE_INTTYPES_H=1 -DHAVE_STDINT_H=1 -DHAVE_UNISTD_H=1 -DHAVE_DLFCN_H=1 -DLT_OBJDIR=\".libs/\" -DHAVE_PTHREAD_PRIO_INHERIT=1 -DHAVE_PTHREAD=1 -DHAVE_LIBZ=1 -DHAVE_LIBCURL=1 -DHAVE_APR_POOLS_H=1 -DHAVE_LIBAPR_1=1 -DHAVE_SVN_VERSION_H=1 -DHAVE_LIBSVN_SUBR_1=1 -DHAVE_SVN_DELTA_H=1 -DHAVE_LIBSVN_DELTA_1=1 -DHAVE_LIBSASL2=1 -DMESOS_HAS_JAVA=1 -DHAVE_PYTHON=\"2.7\" -DMESOS_HAS_PYTHON=1 -DHAVE_EVENT2_EVENT_H=1 -DHAVE_LIBEVENT=1 -DHAVE_EVENT2_THREAD_H=1 -DHAVE_LIBEVENT_PTHREADS=1 -DHAVE_OPENSSL_SSL_H=1 -DHAVE_LIBSSL=1 -DHAVE_LIBCRYPTO=1 -DHAVE_EVENT2_BUFFEREVENT_SSL_H=1 -DHAVE_LIBEVENT_OPENSSL=1 -DUSE_SSL_SOCKET=1 -I. -I../../src   -Wall -Werror -DLIBDIR=\"/mesos/mesos-0.28.3/_inst/lib\" -DPKGLIBEXECDIR=\"/mesos/mesos-0.28.3/_inst/libexec/mesos\" -DPKGDATADIR=\"/mesos/mesos-0.28.3/_inst/share/mesos\" -DPKGMODULEDIR=\"/mesos/mesos-0.28.3/_inst/lib/mesos/modules\" -I../../include -I../../3rdparty/libprocess/include -I../../3rdparty/libprocess/3rdparty/stout/include -I../include -I../include/mesos -isystem ../3rdparty/libprocess/3rdparty/boost-1.53.0 -I../3rdparty/libprocess/3rdparty/picojson-1.3.0 -DPICOJSON_USE_INT64 -D__STDC_FORMAT_MACROS -I../3rdparty/libprocess/3rdparty/protobuf-2.5.0/src -I../3rdparty/libprocess/3rdparty/glog-0.3.3/src -I../3rdparty/libprocess/3rdparty/glog-0.3.3/src -I../3rdparty/leveldb-1.4/include -I../3rdparty/zookeeper-3.4.5/src/c/include -I../3rdparty/zookeeper-3.4.5/src/c/generated -I../3rdparty/libprocess/3rdparty/protobuf-2.5.0/src -DSOURCE_DIR=\"/mesos/mesos-0.28.3/_build/..\" -DBUILD_DIR=\"/mesos/mesos-0.28.3/_build\" -I../3rdparty/libprocess/3rdparty/gmock-1.7.0/gtest/include -I../3rdparty/libprocess/3rdparty/gmock-1.7.0/include -DTESTLIBEXECDIR=\"/mesos/mesos-0.28.3/_inst/libexec/mesos/tests\" -DSBINDIR=\"/mesos/mesos-0.28.3/_inst/sbin\" -I/usr/lib/jvm/java-7-openjdk-amd64/include -I/usr/lib/jvm/java-7-openjdk-amd64/include/linux -DZOOKEEPER_VERSION=\"3.4.5\" -I/usr/include/subversion-1 -I/usr/include/apr-1 -I/usr/include/apr-1.0  -pthread -g1 -O0 -std=c++11 -MT tests/mesos_tests-authentication_tests.o -MD -MP -MF tests/.deps/mesos_tests-authentication_tests.Tpo -c -o tests/mesos_tests-authentication_tests.o `test -f 'tests/authentication_tests.cpp' || echo '../../src/'`tests/authentication_tests.cpp
mv -f examples/.deps/load_generator_framework-load_generator_framework.Tpo examples/.deps/load_generator_framework-load_generator_framework.Po
clang++ -DPACKAGE_NAME=\"mesos\" -DPACKAGE_TARNAME=\"mesos\" -DPACKAGE_VERSION=\"0.28.3\" -DPACKAGE_STRING=\"mesos\ 0.28.3\" -DPACKAGE_BUGREPORT=\"\" -DPACKAGE_URL=\"\" -DPACKAGE=\"mesos\" -DVERSION=\"0.28.3\" -DSTDC_HEADERS=1 -DHAVE_SYS_TYPES_H=1 -DHAVE_SYS_STAT_H=1 -DHAVE_STDLIB_H=1 -DHAVE_STRING_H=1 -DHAVE_MEMORY_H=1 -DHAVE_STRINGS_H=1 -DHAVE_INTTYPES_H=1 -DHAVE_STDINT_H=1 -DHAVE_UNISTD_H=1 -DHAVE_DLFCN_H=1 -DLT_OBJDIR=\".libs/\" -DHAVE_PTHREAD_PRIO_INHERIT=1 -DHAVE_PTHREAD=1 -DHAVE_LIBZ=1 -DHAVE_LIBCURL=1 -DHAVE_APR_POOLS_H=1 -DHAVE_LIBAPR_1=1 -DHAVE_SVN_VERSION_H=1 -DHAVE_LIBSVN_SUBR_1=1 -DHAVE_SVN_DELTA_H=1 -DHAVE_LIBSVN_DELTA_1=1 -DHAVE_LIBSASL2=1 -DMESOS_HAS_JAVA=1 -DHAVE_PYTHON=\"2.7\" -DMESOS_HAS_PYTHON=1 -DHAVE_EVENT2_EVENT_H=1 -DHAVE_LIBEVENT=1 -DHAVE_EVENT2_THREAD_H=1 -DHAVE_LIBEVENT_PTHREADS=1 -DHAVE_OPENSSL_SSL_H=1 -DHAVE_LIBSSL=1 -DHAVE_LIBCRYPTO=1 -DHAVE_EVENT2_BUFFEREVENT_SSL_H=1 -DHAVE_LIBEVENT_OPENSSL=1 -DUSE_SSL_SOCKET=1 -I. -I../../src   -Wall -Werror -DLIBDIR=\"/mesos/mesos-0.28.3/_inst/lib\" -DPKGLIBEXECDIR=\"/mesos/mesos-0.28.3/_inst/libexec/mesos\" -DPKGDATADIR=\"/mesos/mesos-0.28.3/_inst/share/mesos\" -DPKGMODULEDIR=\"/mesos/mesos-0.28.3/_inst/lib/mesos/modules\" -I../../include -I../../3rdparty/libprocess/include -I../../3rdparty/libprocess/3rdparty/stout/include -I../include -I../include/mesos -isystem ../3rdparty/libprocess/3rdparty/boost-1.53.0 -I../3rdparty/libprocess/3rdparty/picojson-1.3.0 -DPICOJSON_USE_INT64 -D__STDC_FORMAT_MACROS -I../3rdparty/libprocess/3rdparty/protobuf-2.5.0/src -I../3rdparty/libprocess/3rdparty/glog-0.3.3/src -I../3rdparty/libprocess/3rdparty/glog-0.3.3/src -I../3rdparty/leveldb-1.4/include -I../3rdparty/zookeeper-3.4.5/src/c/include -I../3rdparty/zookeeper-3.4.5/src/c/generated -I../3rdparty/libprocess/3rdparty/protobuf-2.5.0/src -DSOURCE_DIR=\"/mesos/mesos-0.28.3/_build/..\" -DBUILD_DIR=\"/mesos/mesos-0.28.3/_build\" -I../3rdparty/libprocess/3rdparty/gmock-1.7.0/gtest/include -I../3rdparty/libprocess/3rdparty/gmock-1.7.0/include -DTESTLIBEXECDIR=\"/mesos/mesos-0.28.3/_inst/libexec/mesos/tests\" -DSBINDIR=\"/mesos/mesos-0.28.3/_inst/sbin\" -I/usr/lib/jvm/java-7-openjdk-amd64/include -I/usr/lib/jvm/java-7-openjdk-amd64/include/linux -DZOOKEEPER_VERSION=\"3.4.5\" -I/usr/include/subversion-1 -I/usr/include/apr-1 -I/usr/include/apr-1.0  -pthread -g1 -O0 -std=c++11 -MT tests/mesos_tests-authorization_tests.o -MD -MP -MF tests/.deps/mesos_tests-authorization_tests.Tpo -c -o tests/mesos_tests-authorization_tests.o `test -f 'tests/authorization_tests.cpp' || echo '../../src/'`tests/authorization_tests.cpp
mv -f tests/containerizer/.deps/memory_test_helper-memory_test_helper_main.Tpo tests/containerizer/.deps/memory_test_helper-memory_test_helper_main.Po
clang++ -DPACKAGE_NAME=\"mesos\" -DPACKAGE_TARNAME=\"mesos\" -DPACKAGE_VERSION=\"0.28.3\" -DPACKAGE_STRING=\"mesos\ 0.28.3\" -DPACKAGE_BUGREPORT=\"\" -DPACKAGE_URL=\"\" -DPACKAGE=\"mesos\" -DVERSION=\"0.28.3\" -DSTDC_HEADERS=1 -DHAVE_SYS_TYPES_H=1 -DHAVE_SYS_STAT_H=1 -DHAVE_STDLIB_H=1 -DHAVE_STRING_H=1 -DHAVE_MEMORY_H=1 -DHAVE_STRINGS_H=1 -DHAVE_INTTYPES_H=1 -DHAVE_STDINT_H=1 -DHAVE_UNISTD_H=1 -DHAVE_DLFCN_H=1 -DLT_OBJDIR=\".libs/\" -DHAVE_PTHREAD_PRIO_INHERIT=1 -DHAVE_PTHREAD=1 -DHAVE_LIBZ=1 -DHAVE_LIBCURL=1 -DHAVE_APR_POOLS_H=1 -DHAVE_LIBAPR_1=1 -DHAVE_SVN_VERSION_H=1 -DHAVE_LIBSVN_SUBR_1=1 -DHAVE_SVN_DELTA_H=1 -DHAVE_LIBSVN_DELTA_1=1 -DHAVE_LIBSASL2=1 -DMESOS_HAS_JAVA=1 -DHAVE_PYTHON=\"2.7\" -DMESOS_HAS_PYTHON=1 -DHAVE_EVENT2_EVENT_H=1 -DHAVE_LIBEVENT=1 -DHAVE_EVENT2_THREAD_H=1 -DHAVE_LIBEVENT_PTHREADS=1 -DHAVE_OPENSSL_SSL_H=1 -DHAVE_LIBSSL=1 -DHAVE_LIBCRYPTO=1 -DHAVE_EVENT2_BUFFEREVENT_SSL_H=1 -DHAVE_LIBEVENT_OPENSSL=1 -DUSE_SSL_SOCKET=1 -I. -I../../src   -Wall -Werror -DLIBDIR=\"/mesos/mesos-0.28.3/_inst/lib\" -DPKGLIBEXECDIR=\"/mesos/mesos-0.28.3/_inst/libexec/mesos\" -DPKGDATADIR=\"/mesos/mesos-0.28.3/_inst/share/mesos\" -DPKGMODULEDIR=\"/mesos/mesos-0.28.3/_inst/lib/mesos/modules\" -I../../include -I../../3rdparty/libprocess/include -I../../3rdparty/libprocess/3rdparty/stout/include -I../include -I../include/mesos -isystem ../3rdparty/libprocess/3rdparty/boost-1.53.0 -I../3rdparty/libprocess/3rdparty/picojson-1.3.0 -DPICOJSON_USE_INT64 -D__STDC_FORMAT_MACROS -I../3rdparty/libprocess/3rdparty/protobuf-2.5.0/src -I../3rdparty/libprocess/3rdparty/glog-0.3.3/src -I../3rdparty/libprocess/3rdparty/glog-0.3.3/src -I../3rdparty/leveldb-1.4/include -I../3rdparty/zookeeper-3.4.5/src/c/include -I../3rdparty/zookeeper-3.4.5/src/c/generated -I../3rdparty/libprocess/3rdparty/protobuf-2.5.0/src -DSOURCE_DIR=\"/mesos/mesos-0.28.3/_build/..\" -DBUILD_DIR=\"/mesos/mesos-0.28.3/_build\" -I../3rdparty/libprocess/3rdparty/gmock-1.7.0/gtest/include -I../3rdparty/libprocess/3rdparty/gmock-1.7.0/include -DTESTLIBEXECDIR=\"/mesos/mesos-0.28.3/_inst/libexec/mesos/tests\" -DSBINDIR=\"/mesos/mesos-0.28.3/_inst/sbin\" -I/usr/lib/jvm/java-7-openjdk-amd64/include -I/usr/lib/jvm/java-7-openjdk-amd64/include/linux -DZOOKEEPER_VERSION=\"3.4.5\" -I/usr/include/subversion-1 -I/usr/include/apr-1 -I/usr/include/apr-1.0  -pthread -g1 -O0 -std=c++11 -MT tests/mesos_tests-cluster.o -MD -MP -MF tests/.deps/mesos_tests-cluster.Tpo -c -o tests/mesos_tests-cluster.o `test -f 'tests/cluster.cpp' || echo '../../src/'`tests/cluster.cpp
mv -f tests/.deps/mesos_tests-attributes_tests.Tpo tests/.deps/mesos_tests-attributes_tests.Po
clang++ -DPACKAGE_NAME=\"mesos\" -DPACKAGE_TARNAME=\"mesos\" -DPACKAGE_VERSION=\"0.28.3\" -DPACKAGE_STRING=\"mesos\ 0.28.3\" -DPACKAGE_BUGREPORT=\"\" -DPACKAGE_URL=\"\" -DPACKAGE=\"mesos\" -DVERSION=\"0.28.3\" -DSTDC_HEADERS=1 -DHAVE_SYS_TYPES_H=1 -DHAVE_SYS_STAT_H=1 -DHAVE_STDLIB_H=1 -DHAVE_STRING_H=1 -DHAVE_MEMORY_H=1 -DHAVE_STRINGS_H=1 -DHAVE_INTTYPES_H=1 -DHAVE_STDINT_H=1 -DHAVE_UNISTD_H=1 -DHAVE_DLFCN_H=1 -DLT_OBJDIR=\".libs/\" -DHAVE_PTHREAD_PRIO_INHERIT=1 -DHAVE_PTHREAD=1 -DHAVE_LIBZ=1 -DHAVE_LIBCURL=1 -DHAVE_APR_POOLS_H=1 -DHAVE_LIBAPR_1=1 -DHAVE_SVN_VERSION_H=1 -DHAVE_LIBSVN_SUBR_1=1 -DHAVE_SVN_DELTA_H=1 -DHAVE_LIBSVN_DELTA_1=1 -DHAVE_LIBSASL2=1 -DMESOS_HAS_JAVA=1 -DHAVE_PYTHON=\"2.7\" -DMESOS_HAS_PYTHON=1 -DHAVE_EVENT2_EVENT_H=1 -DHAVE_LIBEVENT=1 -DHAVE_EVENT2_THREAD_H=1 -DHAVE_LIBEVENT_PTHREADS=1 -DHAVE_OPENSSL_SSL_H=1 -DHAVE_LIBSSL=1 -DHAVE_LIBCRYPTO=1 -DHAVE_EVENT2_BUFFEREVENT_SSL_H=1 -DHAVE_LIBEVENT_OPENSSL=1 -DUSE_SSL_SOCKET=1 -I. -I../../src   -Wall -Werror -DLIBDIR=\"/mesos/mesos-0.28.3/_inst/lib\" -DPKGLIBEXECDIR=\"/mesos/mesos-0.28.3/_inst/libexec/mesos\" -DPKGDATADIR=\"/mesos/mesos-0.28.3/_inst/share/mesos\" -DPKGMODULEDIR=\"/mesos/mesos-0.28.3/_inst/lib/mesos/modules\" -I../../include -I../../3rdparty/libprocess/include -I../../3rdparty/libprocess/3rdparty/stout/include -I../include -I../include/mesos -isystem ../3rdparty/libprocess/3rdparty/boost-1.53.0 -I../3rdparty/libprocess/3rdparty/picojson-1.3.0 -DPICOJSON_USE_INT64 -D__STDC_FORMAT_MACROS -I../3rdparty/libprocess/3rdparty/protobuf-2.5.0/src -I../3rdparty/libprocess/3rdparty/glog-0.3.3/src -I../3rdparty/libprocess/3rdparty/glog-0.3.3/src -I../3rdparty/leveldb-1.4/include -I../3rdparty/zookeeper-3.4.5/src/c/include -I../3rdparty/zookeeper-3.4.5/src/c/generated -I../3rdparty/libprocess/3rdparty/protobuf-2.5.0/src -DSOURCE_DIR=\"/mesos/mesos-0.28.3/_build/..\" -DBUILD_DIR=\"/mesos/mesos-0.28.3/_build\" -I../3rdparty/libprocess/3rdparty/gmock-1.7.0/gtest/include -I../3rdparty/libprocess/3rdparty/gmock-1.7.0/include -DTESTLIBEXECDIR=\"/mesos/mesos-0.28.3/_inst/libexec/mesos/tests\" -DSBINDIR=\"/mesos/mesos-0.28.3/_inst/sbin\" -I/usr/lib/jvm/java-7-openjdk-amd64/include -I/usr/lib/jvm/java-7-openjdk-amd64/include/linux -DZOOKEEPER_VERSION=\"3.4.5\" -I/usr/include/subversion-1 -I/usr/include/apr-1 -I/usr/include/apr-1.0  -pthread -g1 -O0 -std=c++11 -MT tests/mesos_tests-command_executor_tests.o -MD -MP -MF tests/.deps/mesos_tests-command_executor_tests.Tpo -c -o tests/mesos_tests-command_executor_tests.o `test -f 'tests/command_executor_tests.cpp' || echo '../../src/'`tests/command_executor_tests.cpp
mv -f examples/.deps/persistent_volume_framework-persistent_volume_framework.Tpo examples/.deps/persistent_volume_framework-persistent_volume_framework.Po
clang++ -DPACKAGE_NAME=\"mesos\" -DPACKAGE_TARNAME=\"mesos\" -DPACKAGE_VERSION=\"0.28.3\" -DPACKAGE_STRING=\"mesos\ 0.28.3\" -DPACKAGE_BUGREPORT=\"\" -DPACKAGE_URL=\"\" -DPACKAGE=\"mesos\" -DVERSION=\"0.28.3\" -DSTDC_HEADERS=1 -DHAVE_SYS_TYPES_H=1 -DHAVE_SYS_STAT_H=1 -DHAVE_STDLIB_H=1 -DHAVE_STRING_H=1 -DHAVE_MEMORY_H=1 -DHAVE_STRINGS_H=1 -DHAVE_INTTYPES_H=1 -DHAVE_STDINT_H=1 -DHAVE_UNISTD_H=1 -DHAVE_DLFCN_H=1 -DLT_OBJDIR=\".libs/\" -DHAVE_PTHREAD_PRIO_INHERIT=1 -DHAVE_PTHREAD=1 -DHAVE_LIBZ=1 -DHAVE_LIBCURL=1 -DHAVE_APR_POOLS_H=1 -DHAVE_LIBAPR_1=1 -DHAVE_SVN_VERSION_H=1 -DHAVE_LIBSVN_SUBR_1=1 -DHAVE_SVN_DELTA_H=1 -DHAVE_LIBSVN_DELTA_1=1 -DHAVE_LIBSASL2=1 -DMESOS_HAS_JAVA=1 -DHAVE_PYTHON=\"2.7\" -DMESOS_HAS_PYTHON=1 -DHAVE_EVENT2_EVENT_H=1 -DHAVE_LIBEVENT=1 -DHAVE_EVENT2_THREAD_H=1 -DHAVE_LIBEVENT_PTHREADS=1 -DHAVE_OPENSSL_SSL_H=1 -DHAVE_LIBSSL=1 -DHAVE_LIBCRYPTO=1 -DHAVE_EVENT2_BUFFEREVENT_SSL_H=1 -DHAVE_LIBEVENT_OPENSSL=1 -DUSE_SSL_SOCKET=1 -I. -I../../src   -Wall -Werror -DLIBDIR=\"/mesos/mesos-0.28.3/_inst/lib\" -DPKGLIBEXECDIR=\"/mesos/mesos-0.28.3/_inst/libexec/mesos\" -DPKGDATADIR=\"/mesos/mesos-0.28.3/_inst/share/mesos\" -DPKGMODULEDIR=\"/mesos/mesos-0.28.3/_inst/lib/mesos/modules\" -I../../include -I../../3rdparty/libprocess/include -I../../3rdparty/libprocess/3rdparty/stout/include -I../include -I../include/mesos -isystem ../3rdparty/libprocess/3rdparty/boost-1.53.0 -I../3rdparty/libprocess/3rdparty/picojson-1.3.0 -DPICOJSON_USE_INT64 -D__STDC_FORMAT_MACROS -I../3rdparty/libprocess/3rdparty/protobuf-2.5.0/src -I../3rdparty/libprocess/3rdparty/glog-0.3.3/src -I../3rdparty/libprocess/3rdparty/glog-0.3.3/src -I../3rdparty/leveldb-1.4/include -I../3rdparty/zookeeper-3.4.5/src/c/include -I../3rdparty/zookeeper-3.4.5/src/c/generated -I../3rdparty/libprocess/3rdparty/protobuf-2.5.0/src -DSOURCE_DIR=\"/mesos/mesos-0.28.3/_build/..\" -DBUILD_DIR=\"/mesos/mesos-0.28.3/_build\" -I../3rdparty/libprocess/3rdparty/gmock-1.7.0/gtest/include -I../3rdparty/libprocess/3rdparty/gmock-1.7.0/include -DTESTLIBEXECDIR=\"/mesos/mesos-0.28.3/_inst/libexec/mesos/tests\" -DSBINDIR=\"/mesos/mesos-0.28.3/_inst/sbin\" -I/usr/lib/jvm/java-7-openjdk-amd64/include -I/usr/lib/jvm/java-7-openjdk-amd64/include/linux -DZOOKEEPER_VERSION=\"3.4.5\" -I/usr/include/subversion-1 -I/usr/include/apr-1 -I/usr/include/apr-1.0  -pthread -g1 -O0 -std=c++11 -MT tests/mesos_tests-container_logger_tests.o -MD -MP -MF tests/.deps/mesos_tests-container_logger_tests.Tpo -c -o tests/mesos_tests-container_logger_tests.o `test -f 'tests/container_logger_tests.cpp' || echo '../../src/'`tests/container_logger_tests.cpp
mv -f tests/containerizer/.deps/memory_test_helper-memory_test_helper.Tpo tests/containerizer/.deps/memory_test_helper-memory_test_helper.Po
clang++ -DPACKAGE_NAME=\"mesos\" -DPACKAGE_TARNAME=\"mesos\" -DPACKAGE_VERSION=\"0.28.3\" -DPACKAGE_STRING=\"mesos\ 0.28.3\" -DPACKAGE_BUGREPORT=\"\" -DPACKAGE_URL=\"\" -DPACKAGE=\"mesos\" -DVERSION=\"0.28.3\" -DSTDC_HEADERS=1 -DHAVE_SYS_TYPES_H=1 -DHAVE_SYS_STAT_H=1 -DHAVE_STDLIB_H=1 -DHAVE_STRING_H=1 -DHAVE_MEMORY_H=1 -DHAVE_STRINGS_H=1 -DHAVE_INTTYPES_H=1 -DHAVE_STDINT_H=1 -DHAVE_UNISTD_H=1 -DHAVE_DLFCN_H=1 -DLT_OBJDIR=\".libs/\" -DHAVE_PTHREAD_PRIO_INHERIT=1 -DHAVE_PTHREAD=1 -DHAVE_LIBZ=1 -DHAVE_LIBCURL=1 -DHAVE_APR_POOLS_H=1 -DHAVE_LIBAPR_1=1 -DHAVE_SVN_VERSION_H=1 -DHAVE_LIBSVN_SUBR_1=1 -DHAVE_SVN_DELTA_H=1 -DHAVE_LIBSVN_DELTA_1=1 -DHAVE_LIBSASL2=1 -DMESOS_HAS_JAVA=1 -DHAVE_PYTHON=\"2.7\" -DMESOS_HAS_PYTHON=1 -DHAVE_EVENT2_EVENT_H=1 -DHAVE_LIBEVENT=1 -DHAVE_EVENT2_THREAD_H=1 -DHAVE_LIBEVENT_PTHREADS=1 -DHAVE_OPENSSL_SSL_H=1 -DHAVE_LIBSSL=1 -DHAVE_LIBCRYPTO=1 -DHAVE_EVENT2_BUFFEREVENT_SSL_H=1 -DHAVE_LIBEVENT_OPENSSL=1 -DUSE_SSL_SOCKET=1 -I. -I../../src   -Wall -Werror -DLIBDIR=\"/mesos/mesos-0.28.3/_inst/lib\" -DPKGLIBEXECDIR=\"/mesos/mesos-0.28.3/_inst/libexec/mesos\" -DPKGDATADIR=\"/mesos/mesos-0.28.3/_inst/share/mesos\" -DPKGMODULEDIR=\"/mesos/mesos-0.28.3/_inst/lib/mesos/modules\" -I../../include -I../../3rdparty/libprocess/include -I../../3rdparty/libprocess/3rdparty/stout/include -I../include -I../include/mesos -isystem ../3rdparty/libprocess/3rdparty/boost-1.53.0 -I../3rdparty/libprocess/3rdparty/picojson-1.3.0 -DPICOJSON_USE_INT64 -D__STDC_FORMAT_MACROS -I../3rdparty/libprocess/3rdparty/protobuf-2.5.0/src -I../3rdparty/libprocess/3rdparty/glog-0.3.3/src -I../3rdparty/libprocess/3rdparty/glog-0.3.3/src -I../3rdparty/leveldb-1.4/include -I../3rdparty/zookeeper-3.4.5/src/c/include -I../3rdparty/zookeeper-3.4.5/src/c/generated -I../3rdparty/libprocess/3rdparty/protobuf-2.5.0/src -DSOURCE_DIR=\"/mesos/mesos-0.28.3/_build/..\" -DBUILD_DIR=\"/mesos/mesos-0.28.3/_build\" -I../3rdparty/libprocess/3rdparty/gmock-1.7.0/gtest/include -I../3rdparty/libprocess/3rdparty/gmock-1.7.0/include -DTESTLIBEXECDIR=\"/mesos/mesos-0.28.3/_inst/libexec/mesos/tests\" -DSBINDIR=\"/mesos/mesos-0.28.3/_inst/sbin\" -I/usr/lib/jvm/java-7-openjdk-amd64/include -I/usr/lib/jvm/java-7-openjdk-amd64/include/linux -DZOOKEEPER_VERSION=\"3.4.5\" -I/usr/include/subversion-1 -I/usr/include/apr-1 -I/usr/include/apr-1.0  -pthread -g1 -O0 -std=c++11 -MT tests/mesos_tests-containerizer.o -MD -MP -MF tests/.deps/mesos_tests-containerizer.Tpo -c -o tests/mesos_tests-containerizer.o `test -f 'tests/containerizer.cpp' || echo '../../src/'`tests/containerizer.cpp
mv -f slave/qos_controllers/.deps/mesos_tests-load.Tpo slave/qos_controllers/.deps/mesos_tests-load.Po
clang++ -DPACKAGE_NAME=\"mesos\" -DPACKAGE_TARNAME=\"mesos\" -DPACKAGE_VERSION=\"0.28.3\" -DPACKAGE_STRING=\"mesos\ 0.28.3\" -DPACKAGE_BUGREPORT=\"\" -DPACKAGE_URL=\"\" -DPACKAGE=\"mesos\" -DVERSION=\"0.28.3\" -DSTDC_HEADERS=1 -DHAVE_SYS_TYPES_H=1 -DHAVE_SYS_STAT_H=1 -DHAVE_STDLIB_H=1 -DHAVE_STRING_H=1 -DHAVE_MEMORY_H=1 -DHAVE_STRINGS_H=1 -DHAVE_INTTYPES_H=1 -DHAVE_STDINT_H=1 -DHAVE_UNISTD_H=1 -DHAVE_DLFCN_H=1 -DLT_OBJDIR=\".libs/\" -DHAVE_PTHREAD_PRIO_INHERIT=1 -DHAVE_PTHREAD=1 -DHAVE_LIBZ=1 -DHAVE_LIBCURL=1 -DHAVE_APR_POOLS_H=1 -DHAVE_LIBAPR_1=1 -DHAVE_SVN_VERSION_H=1 -DHAVE_LIBSVN_SUBR_1=1 -DHAVE_SVN_DELTA_H=1 -DHAVE_LIBSVN_DELTA_1=1 -DHAVE_LIBSASL2=1 -DMESOS_HAS_JAVA=1 -DHAVE_PYTHON=\"2.7\" -DMESOS_HAS_PYTHON=1 -DHAVE_EVENT2_EVENT_H=1 -DHAVE_LIBEVENT=1 -DHAVE_EVENT2_THREAD_H=1 -DHAVE_LIBEVENT_PTHREADS=1 -DHAVE_OPENSSL_SSL_H=1 -DHAVE_LIBSSL=1 -DHAVE_LIBCRYPTO=1 -DHAVE_EVENT2_BUFFEREVENT_SSL_H=1 -DHAVE_LIBEVENT_OPENSSL=1 -DUSE_SSL_SOCKET=1 -I. -I../../src   -Wall -Werror -DLIBDIR=\"/mesos/mesos-0.28.3/_inst/lib\" -DPKGLIBEXECDIR=\"/mesos/mesos-0.28.3/_inst/libexec/mesos\" -DPKGDATADIR=\"/mesos/mesos-0.28.3/_inst/share/mesos\" -DPKGMODULEDIR=\"/mesos/mesos-0.28.3/_inst/lib/mesos/modules\" -I../../include -I../../3rdparty/libprocess/include -I../../3rdparty/libprocess/3rdparty/stout/include -I../include -I../include/mesos -isystem ../3rdparty/libprocess/3rdparty/boost-1.53.0 -I../3rdparty/libprocess/3rdparty/picojson-1.3.0 -DPICOJSON_USE_INT64 -D__STDC_FORMAT_MACROS -I../3rdparty/libprocess/3rdparty/protobuf-2.5.0/src -I../3rdparty/libprocess/3rdparty/glog-0.3.3/src -I../3rdparty/libprocess/3rdparty/glog-0.3.3/src -I../3rdparty/leveldb-1.4/include -I../3rdparty/zookeeper-3.4.5/src/c/include -I../3rdparty/zookeeper-3.4.5/src/c/generated -I../3rdparty/libprocess/3rdparty/protobuf-2.5.0/src -DSOURCE_DIR=\"/mesos/mesos-0.28.3/_build/..\" -DBUILD_DIR=\"/mesos/mesos-0.28.3/_build\" -I../3rdparty/libprocess/3rdparty/gmock-1.7.0/gtest/include -I../3rdparty/libprocess/3rdparty/gmock-1.7.0/include -DTESTLIBEXECDIR=\"/mesos/mesos-0.28.3/_inst/libexec/mesos/tests\" -DSBINDIR=\"/mesos/mesos-0.28.3/_inst/sbin\" -I/usr/lib/jvm/java-7-openjdk-amd64/include -I/usr/lib/jvm/java-7-openjdk-amd64/include/linux -DZOOKEEPER_VERSION=\"3.4.5\" -I/usr/include/subversion-1 -I/usr/include/apr-1 -I/usr/include/apr-1.0  -pthread -g1 -O0 -std=c++11 -MT tests/mesos_tests-cram_md5_authentication_tests.o -MD -MP -MF tests/.deps/mesos_tests-cram_md5_authentication_tests.Tpo -c -o tests/mesos_tests-cram_md5_authentication_tests.o `test -f 'tests/cram_md5_authentication_tests.cpp' || echo '../../src/'`tests/cram_md5_authentication_tests.cpp
mv -f tests/.deps/mesos_tests-anonymous_tests.Tpo tests/.deps/mesos_tests-anonymous_tests.Po
clang++ -DPACKAGE_NAME=\"mesos\" -DPACKAGE_TARNAME=\"mesos\" -DPACKAGE_VERSION=\"0.28.3\" -DPACKAGE_STRING=\"mesos\ 0.28.3\" -DPACKAGE_BUGREPORT=\"\" -DPACKAGE_URL=\"\" -DPACKAGE=\"mesos\" -DVERSION=\"0.28.3\" -DSTDC_HEADERS=1 -DHAVE_SYS_TYPES_H=1 -DHAVE_SYS_STAT_H=1 -DHAVE_STDLIB_H=1 -DHAVE_STRING_H=1 -DHAVE_MEMORY_H=1 -DHAVE_STRINGS_H=1 -DHAVE_INTTYPES_H=1 -DHAVE_STDINT_H=1 -DHAVE_UNISTD_H=1 -DHAVE_DLFCN_H=1 -DLT_OBJDIR=\".libs/\" -DHAVE_PTHREAD_PRIO_INHERIT=1 -DHAVE_PTHREAD=1 -DHAVE_LIBZ=1 -DHAVE_LIBCURL=1 -DHAVE_APR_POOLS_H=1 -DHAVE_LIBAPR_1=1 -DHAVE_SVN_VERSION_H=1 -DHAVE_LIBSVN_SUBR_1=1 -DHAVE_SVN_DELTA_H=1 -DHAVE_LIBSVN_DELTA_1=1 -DHAVE_LIBSASL2=1 -DMESOS_HAS_JAVA=1 -DHAVE_PYTHON=\"2.7\" -DMESOS_HAS_PYTHON=1 -DHAVE_EVENT2_EVENT_H=1 -DHAVE_LIBEVENT=1 -DHAVE_EVENT2_THREAD_H=1 -DHAVE_LIBEVENT_PTHREADS=1 -DHAVE_OPENSSL_SSL_H=1 -DHAVE_LIBSSL=1 -DHAVE_LIBCRYPTO=1 -DHAVE_EVENT2_BUFFEREVENT_SSL_H=1 -DHAVE_LIBEVENT_OPENSSL=1 -DUSE_SSL_SOCKET=1 -I. -I../../src   -Wall -Werror -DLIBDIR=\"/mesos/mesos-0.28.3/_inst/lib\" -DPKGLIBEXECDIR=\"/mesos/mesos-0.28.3/_inst/libexec/mesos\" -DPKGDATADIR=\"/mesos/mesos-0.28.3/_inst/share/mesos\" -DPKGMODULEDIR=\"/mesos/mesos-0.28.3/_inst/lib/mesos/modules\" -I../../include -I../../3rdparty/libprocess/include -I../../3rdparty/libprocess/3rdparty/stout/include -I../include -I../include/mesos -isystem ../3rdparty/libprocess/3rdparty/boost-1.53.0 -I../3rdparty/libprocess/3rdparty/picojson-1.3.0 -DPICOJSON_USE_INT64 -D__STDC_FORMAT_MACROS -I../3rdparty/libprocess/3rdparty/protobuf-2.5.0/src -I../3rdparty/libprocess/3rdparty/glog-0.3.3/src -I../3rdparty/libprocess/3rdparty/glog-0.3.3/src -I../3rdparty/leveldb-1.4/include -I../3rdparty/zookeeper-3.4.5/src/c/include -I../3rdparty/zookeeper-3.4.5/src/c/generated -I../3rdparty/libprocess/3rdparty/protobuf-2.5.0/src -DSOURCE_DIR=\"/mesos/mesos-0.28.3/_build/..\" -DBUILD_DIR=\"/mesos/mesos-0.28.3/_build\" -I../3rdparty/libprocess/3rdparty/gmock-1.7.0/gtest/include -I../3rdparty/libprocess/3rdparty/gmock-1.7.0/include -DTESTLIBEXECDIR=\"/mesos/mesos-0.28.3/_inst/libexec/mesos/tests\" -DSBINDIR=\"/mesos/mesos-0.28.3/_inst/sbin\" -I/usr/lib/jvm/java-7-openjdk-amd64/include -I/usr/lib/jvm/java-7-openjdk-amd64/include/linux -DZOOKEEPER_VERSION=\"3.4.5\" -I/usr/include/subversion-1 -I/usr/include/apr-1 -I/usr/include/apr-1.0  -pthread -g1 -O0 -std=c++11 -MT tests/mesos_tests-credentials_tests.o -MD -MP -MF tests/.deps/mesos_tests-credentials_tests.Tpo -c -o tests/mesos_tests-credentials_tests.o `test -f 'tests/credentials_tests.cpp' || echo '../../src/'`tests/credentials_tests.cpp
mv -f tests/.deps/mesos_tests-authorization_tests.Tpo tests/.deps/mesos_tests-authorization_tests.Po
clang++ -DPACKAGE_NAME=\"mesos\" -DPACKAGE_TARNAME=\"mesos\" -DPACKAGE_VERSION=\"0.28.3\" -DPACKAGE_STRING=\"mesos\ 0.28.3\" -DPACKAGE_BUGREPORT=\"\" -DPACKAGE_URL=\"\" -DPACKAGE=\"mesos\" -DVERSION=\"0.28.3\" -DSTDC_HEADERS=1 -DHAVE_SYS_TYPES_H=1 -DHAVE_SYS_STAT_H=1 -DHAVE_STDLIB_H=1 -DHAVE_STRING_H=1 -DHAVE_MEMORY_H=1 -DHAVE_STRINGS_H=1 -DHAVE_INTTYPES_H=1 -DHAVE_STDINT_H=1 -DHAVE_UNISTD_H=1 -DHAVE_DLFCN_H=1 -DLT_OBJDIR=\".libs/\" -DHAVE_PTHREAD_PRIO_INHERIT=1 -DHAVE_PTHREAD=1 -DHAVE_LIBZ=1 -DHAVE_LIBCURL=1 -DHAVE_APR_POOLS_H=1 -DHAVE_LIBAPR_1=1 -DHAVE_SVN_VERSION_H=1 -DHAVE_LIBSVN_SUBR_1=1 -DHAVE_SVN_DELTA_H=1 -DHAVE_LIBSVN_DELTA_1=1 -DHAVE_LIBSASL2=1 -DMESOS_HAS_JAVA=1 -DHAVE_PYTHON=\"2.7\" -DMESOS_HAS_PYTHON=1 -DHAVE_EVENT2_EVENT_H=1 -DHAVE_LIBEVENT=1 -DHAVE_EVENT2_THREAD_H=1 -DHAVE_LIBEVENT_PTHREADS=1 -DHAVE_OPENSSL_SSL_H=1 -DHAVE_LIBSSL=1 -DHAVE_LIBCRYPTO=1 -DHAVE_EVENT2_BUFFEREVENT_SSL_H=1 -DHAVE_LIBEVENT_OPENSSL=1 -DUSE_SSL_SOCKET=1 -I. -I../../src   -Wall -Werror -DLIBDIR=\"/mesos/mesos-0.28.3/_inst/lib\" -DPKGLIBEXECDIR=\"/mesos/mesos-0.28.3/_inst/libexec/mesos\" -DPKGDATADIR=\"/mesos/mesos-0.28.3/_inst/share/mesos\" -DPKGMODULEDIR=\"/mesos/mesos-0.28.3/_inst/lib/mesos/modules\" -I../../include -I../../3rdparty/libprocess/include -I../../3rdparty/libprocess/3rdparty/stout/include -I../include -I../include/mesos -isystem ../3rdparty/libprocess/3rdparty/boost-1.53.0 -I../3rdparty/libprocess/3rdparty/picojson-1.3.0 -DPICOJSON_USE_INT64 -D__STDC_FORMAT_MACROS -I../3rdparty/libprocess/3rdparty/protobuf-2.5.0/src -I../3rdparty/libprocess/3rdparty/glog-0.3.3/src -I../3rdparty/libprocess/3rdparty/glog-0.3.3/src -I../3rdparty/leveldb-1.4/include -I../3rdparty/zookeeper-3.4.5/src/c/include -I../3rdparty/zookeeper-3.4.5/src/c/generated -I../3rdparty/libprocess/3rdparty/protobuf-2.5.0/src -DSOURCE_DIR=\"/mesos/mesos-0.28.3/_build/..\" -DBUILD_DIR=\"/mesos/mesos-0.28.3/_build\" -I../3rdparty/libprocess/3rdparty/gmock-1.7.0/gtest/include -I../3rdparty/libprocess/3rdparty/gmock-1.7.0/include -DTESTLIBEXECDIR=\"/mesos/mesos-0.28.3/_inst/libexec/mesos/tests\" -DSBINDIR=\"/mesos/mesos-0.28.3/_inst/sbin\" -I/usr/lib/jvm/java-7-openjdk-amd64/include -I/usr/lib/jvm/java-7-openjdk-amd64/include/linux -DZOOKEEPER_VERSION=\"3.4.5\" -I/usr/include/subversion-1 -I/usr/include/apr-1 -I/usr/include/apr-1.0  -pthread -g1 -O0 -std=c++11 -MT tests/mesos_tests-disk_quota_tests.o -MD -MP -MF tests/.deps/mesos_tests-disk_quota_tests.Tpo -c -o tests/mesos_tests-disk_quota_tests.o `test -f 'tests/disk_quota_tests.cpp' || echo '../../src/'`tests/disk_quota_tests.cpp
mv -f tests/.deps/mesos_tests-command_executor_tests.Tpo tests/.deps/mesos_tests-command_executor_tests.Po
clang++ -DPACKAGE_NAME=\"mesos\" -DPACKAGE_TARNAME=\"mesos\" -DPACKAGE_VERSION=\"0.28.3\" -DPACKAGE_STRING=\"mesos\ 0.28.3\" -DPACKAGE_BUGREPORT=\"\" -DPACKAGE_URL=\"\" -DPACKAGE=\"mesos\" -DVERSION=\"0.28.3\" -DSTDC_HEADERS=1 -DHAVE_SYS_TYPES_H=1 -DHAVE_SYS_STAT_H=1 -DHAVE_STDLIB_H=1 -DHAVE_STRING_H=1 -DHAVE_MEMORY_H=1 -DHAVE_STRINGS_H=1 -DHAVE_INTTYPES_H=1 -DHAVE_STDINT_H=1 -DHAVE_UNISTD_H=1 -DHAVE_DLFCN_H=1 -DLT_OBJDIR=\".libs/\" -DHAVE_PTHREAD_PRIO_INHERIT=1 -DHAVE_PTHREAD=1 -DHAVE_LIBZ=1 -DHAVE_LIBCURL=1 -DHAVE_APR_POOLS_H=1 -DHAVE_LIBAPR_1=1 -DHAVE_SVN_VERSION_H=1 -DHAVE_LIBSVN_SUBR_1=1 -DHAVE_SVN_DELTA_H=1 -DHAVE_LIBSVN_DELTA_1=1 -DHAVE_LIBSASL2=1 -DMESOS_HAS_JAVA=1 -DHAVE_PYTHON=\"2.7\" -DMESOS_HAS_PYTHON=1 -DHAVE_EVENT2_EVENT_H=1 -DHAVE_LIBEVENT=1 -DHAVE_EVENT2_THREAD_H=1 -DHAVE_LIBEVENT_PTHREADS=1 -DHAVE_OPENSSL_SSL_H=1 -DHAVE_LIBSSL=1 -DHAVE_LIBCRYPTO=1 -DHAVE_EVENT2_BUFFEREVENT_SSL_H=1 -DHAVE_LIBEVENT_OPENSSL=1 -DUSE_SSL_SOCKET=1 -I. -I../../src   -Wall -Werror -DLIBDIR=\"/mesos/mesos-0.28.3/_inst/lib\" -DPKGLIBEXECDIR=\"/mesos/mesos-0.28.3/_inst/libexec/mesos\" -DPKGDATADIR=\"/mesos/mesos-0.28.3/_inst/share/mesos\" -DPKGMODULEDIR=\"/mesos/mesos-0.28.3/_inst/lib/mesos/modules\" -I../../include -I../../3rdparty/libprocess/include -I../../3rdparty/libprocess/3rdparty/stout/include -I../include -I../include/mesos -isystem ../3rdparty/libprocess/3rdparty/boost-1.53.0 -I../3rdparty/libprocess/3rdparty/picojson-1.3.0 -DPICOJSON_USE_INT64 -D__STDC_FORMAT_MACROS -I../3rdparty/libprocess/3rdparty/protobuf-2.5.0/src -I../3rdparty/libprocess/3rdparty/glog-0.3.3/src -I../3rdparty/libprocess/3rdparty/glog-0.3.3/src -I../3rdparty/leveldb-1.4/include -I../3rdparty/zookeeper-3.4.5/src/c/include -I../3rdparty/zookeeper-3.4.5/src/c/generated -I../3rdparty/libprocess/3rdparty/protobuf-2.5.0/src -DSOURCE_DIR=\"/mesos/mesos-0.28.3/_build/..\" -DBUILD_DIR=\"/mesos/mesos-0.28.3/_build\" -I../3rdparty/libprocess/3rdparty/gmock-1.7.0/gtest/include -I../3rdparty/libprocess/3rdparty/gmock-1.7.0/include -DTESTLIBEXECDIR=\"/mesos/mesos-0.28.3/_inst/libexec/mesos/tests\" -DSBINDIR=\"/mesos/mesos-0.28.3/_inst/sbin\" -I/usr/lib/jvm/java-7-openjdk-amd64/include -I/usr/lib/jvm/java-7-openjdk-amd64/include/linux -DZOOKEEPER_VERSION=\"3.4.5\" -I/usr/include/subversion-1 -I/usr/include/apr-1 -I/usr/include/apr-1.0  -pthread -g1 -O0 -std=c++11 -MT tests/mesos_tests-environment.o -MD -MP -MF tests/.deps/mesos_tests-environment.Tpo -c -o tests/mesos_tests-environment.o `test -f 'tests/environment.cpp' || echo '../../src/'`tests/environment.cpp
mv -f tests/.deps/mesos_tests-cluster.Tpo tests/.deps/mesos_tests-cluster.Po
clang++ -DPACKAGE_NAME=\"mesos\" -DPACKAGE_TARNAME=\"mesos\" -DPACKAGE_VERSION=\"0.28.3\" -DPACKAGE_STRING=\"mesos\ 0.28.3\" -DPACKAGE_BUGREPORT=\"\" -DPACKAGE_URL=\"\" -DPACKAGE=\"mesos\" -DVERSION=\"0.28.3\" -DSTDC_HEADERS=1 -DHAVE_SYS_TYPES_H=1 -DHAVE_SYS_STAT_H=1 -DHAVE_STDLIB_H=1 -DHAVE_STRING_H=1 -DHAVE_MEMORY_H=1 -DHAVE_STRINGS_H=1 -DHAVE_INTTYPES_H=1 -DHAVE_STDINT_H=1 -DHAVE_UNISTD_H=1 -DHAVE_DLFCN_H=1 -DLT_OBJDIR=\".libs/\" -DHAVE_PTHREAD_PRIO_INHERIT=1 -DHAVE_PTHREAD=1 -DHAVE_LIBZ=1 -DHAVE_LIBCURL=1 -DHAVE_APR_POOLS_H=1 -DHAVE_LIBAPR_1=1 -DHAVE_SVN_VERSION_H=1 -DHAVE_LIBSVN_SUBR_1=1 -DHAVE_SVN_DELTA_H=1 -DHAVE_LIBSVN_DELTA_1=1 -DHAVE_LIBSASL2=1 -DMESOS_HAS_JAVA=1 -DHAVE_PYTHON=\"2.7\" -DMESOS_HAS_PYTHON=1 -DHAVE_EVENT2_EVENT_H=1 -DHAVE_LIBEVENT=1 -DHAVE_EVENT2_THREAD_H=1 -DHAVE_LIBEVENT_PTHREADS=1 -DHAVE_OPENSSL_SSL_H=1 -DHAVE_LIBSSL=1 -DHAVE_LIBCRYPTO=1 -DHAVE_EVENT2_BUFFEREVENT_SSL_H=1 -DHAVE_LIBEVENT_OPENSSL=1 -DUSE_SSL_SOCKET=1 -I. -I../../src   -Wall -Werror -DLIBDIR=\"/mesos/mesos-0.28.3/_inst/lib\" -DPKGLIBEXECDIR=\"/mesos/mesos-0.28.3/_inst/libexec/mesos\" -DPKGDATADIR=\"/mesos/mesos-0.28.3/_inst/share/mesos\" -DPKGMODULEDIR=\"/mesos/mesos-0.28.3/_inst/lib/mesos/modules\" -I../../include -I../../3rdparty/libprocess/include -I../../3rdparty/libprocess/3rdparty/stout/include -I../include -I../include/mesos -isystem ../3rdparty/libprocess/3rdparty/boost-1.53.0 -I../3rdparty/libprocess/3rdparty/picojson-1.3.0 -DPICOJSON_USE_INT64 -D__STDC_FORMAT_MACROS -I../3rdparty/libprocess/3rdparty/protobuf-2.5.0/src -I../3rdparty/libprocess/3rdparty/glog-0.3.3/src -I../3rdparty/libprocess/3rdparty/glog-0.3.3/src -I../3rdparty/leveldb-1.4/include -I../3rdparty/zookeeper-3.4.5/src/c/include -I../3rdparty/zookeeper-3.4.5/src/c/generated -I../3rdparty/libprocess/3rdparty/protobuf-2.5.0/src -DSOURCE_DIR=\"/mesos/mesos-0.28.3/_build/..\" -DBUILD_DIR=\"/mesos/mesos-0.28.3/_build\" -I../3rdparty/libprocess/3rdparty/gmock-1.7.0/gtest/include -I../3rdparty/libprocess/3rdparty/gmock-1.7.0/include -DTESTLIBEXECDIR=\"/mesos/mesos-0.28.3/_inst/libexec/mesos/tests\" -DSBINDIR=\"/mesos/mesos-0.28.3/_inst/sbin\" -I/usr/lib/jvm/java-7-openjdk-amd64/include -I/usr/lib/jvm/java-7-openjdk-amd64/include/linux -DZOOKEEPER_VERSION=\"3.4.5\" -I/usr/include/subversion-1 -I/usr/include/apr-1 -I/usr/include/apr-1.0  -pthread -g1 -O0 -std=c++11 -MT tests/mesos_tests-examples_tests.o -MD -MP -MF tests/.deps/mesos_tests-examples_tests.Tpo -c -o tests/mesos_tests-examples_tests.o `test -f 'tests/examples_tests.cpp' || echo '../../src/'`tests/examples_tests.cpp
mv -f tests/.deps/mesos_tests-examples_tests.Tpo tests/.deps/mesos_tests-examples_tests.Po
clang++ -DPACKAGE_NAME=\"mesos\" -DPACKAGE_TARNAME=\"mesos\" -DPACKAGE_VERSION=\"0.28.3\" -DPACKAGE_STRING=\"mesos\ 0.28.3\" -DPACKAGE_BUGREPORT=\"\" -DPACKAGE_URL=\"\" -DPACKAGE=\"mesos\" -DVERSION=\"0.28.3\" -DSTDC_HEADERS=1 -DHAVE_SYS_TYPES_H=1 -DHAVE_SYS_STAT_H=1 -DHAVE_STDLIB_H=1 -DHAVE_STRING_H=1 -DHAVE_MEMORY_H=1 -DHAVE_STRINGS_H=1 -DHAVE_INTTYPES_H=1 -DHAVE_STDINT_H=1 -DHAVE_UNISTD_H=1 -DHAVE_DLFCN_H=1 -DLT_OBJDIR=\".libs/\" -DHAVE_PTHREAD_PRIO_INHERIT=1 -DHAVE_PTHREAD=1 -DHAVE_LIBZ=1 -DHAVE_LIBCURL=1 -DHAVE_APR_POOLS_H=1 -DHAVE_LIBAPR_1=1 -DHAVE_SVN_VERSION_H=1 -DHAVE_LIBSVN_SUBR_1=1 -DHAVE_SVN_DELTA_H=1 -DHAVE_LIBSVN_DELTA_1=1 -DHAVE_LIBSASL2=1 -DMESOS_HAS_JAVA=1 -DHAVE_PYTHON=\"2.7\" -DMESOS_HAS_PYTHON=1 -DHAVE_EVENT2_EVENT_H=1 -DHAVE_LIBEVENT=1 -DHAVE_EVENT2_THREAD_H=1 -DHAVE_LIBEVENT_PTHREADS=1 -DHAVE_OPENSSL_SSL_H=1 -DHAVE_LIBSSL=1 -DHAVE_LIBCRYPTO=1 -DHAVE_EVENT2_BUFFEREVENT_SSL_H=1 -DHAVE_LIBEVENT_OPENSSL=1 -DUSE_SSL_SOCKET=1 -I. -I../../src   -Wall -Werror -DLIBDIR=\"/mesos/mesos-0.28.3/_inst/lib\" -DPKGLIBEXECDIR=\"/mesos/mesos-0.28.3/_inst/libexec/mesos\" -DPKGDATADIR=\"/mesos/mesos-0.28.3/_inst/share/mesos\" -DPKGMODULEDIR=\"/mesos/mesos-0.28.3/_inst/lib/mesos/modules\" -I../../include -I../../3rdparty/libprocess/include -I../../3rdparty/libprocess/3rdparty/stout/include -I../include -I../include/mesos -isystem ../3rdparty/libprocess/3rdparty/boost-1.53.0 -I../3rdparty/libprocess/3rdparty/picojson-1.3.0 -DPICOJSON_USE_INT64 -D__STDC_FORMAT_MACROS -I../3rdparty/libprocess/3rdparty/protobuf-2.5.0/src -I../3rdparty/libprocess/3rdparty/glog-0.3.3/src -I../3rdparty/libprocess/3rdparty/glog-0.3.3/src -I../3rdparty/leveldb-1.4/include -I../3rdparty/zookeeper-3.4.5/src/c/include -I../3rdparty/zookeeper-3.4.5/src/c/generated -I../3rdparty/libprocess/3rdparty/protobuf-2.5.0/src -DSOURCE_DIR=\"/mesos/mesos-0.28.3/_build/..\" -DBUILD_DIR=\"/mesos/mesos-0.28.3/_build\" -I../3rdparty/libprocess/3rdparty/gmock-1.7.0/gtest/include -I../3rdparty/libprocess/3rdparty/gmock-1.7.0/include -DTESTLIBEXECDIR=\"/mesos/mesos-0.28.3/_inst/libexec/mesos/tests\" -DSBINDIR=\"/mesos/mesos-0.28.3/_inst/sbin\" -I/usr/lib/jvm/java-7-openjdk-amd64/include -I/usr/lib/jvm/java-7-openjdk-amd64/include/linux -DZOOKEEPER_VERSION=\"3.4.5\" -I/usr/include/subversion-1 -I/usr/include/apr-1 -I/usr/include/apr-1.0  -pthread -g1 -O0 -std=c++11 -MT tests/mesos_tests-exception_tests.o -MD -MP -MF tests/.deps/mesos_tests-exception_tests.Tpo -c -o tests/mesos_tests-exception_tests.o `test -f 'tests/exception_tests.cpp' || echo '../../src/'`tests/exception_tests.cpp
mv -f tests/.deps/mesos_tests-cram_md5_authentication_tests.Tpo tests/.deps/mesos_tests-cram_md5_authentication_tests.Po
clang++ -DPACKAGE_NAME=\"mesos\" -DPACKAGE_TARNAME=\"mesos\" -DPACKAGE_VERSION=\"0.28.3\" -DPACKAGE_STRING=\"mesos\ 0.28.3\" -DPACKAGE_BUGREPORT=\"\" -DPACKAGE_URL=\"\" -DPACKAGE=\"mesos\" -DVERSION=\"0.28.3\" -DSTDC_HEADERS=1 -DHAVE_SYS_TYPES_H=1 -DHAVE_SYS_STAT_H=1 -DHAVE_STDLIB_H=1 -DHAVE_STRING_H=1 -DHAVE_MEMORY_H=1 -DHAVE_STRINGS_H=1 -DHAVE_INTTYPES_H=1 -DHAVE_STDINT_H=1 -DHAVE_UNISTD_H=1 -DHAVE_DLFCN_H=1 -DLT_OBJDIR=\".libs/\" -DHAVE_PTHREAD_PRIO_INHERIT=1 -DHAVE_PTHREAD=1 -DHAVE_LIBZ=1 -DHAVE_LIBCURL=1 -DHAVE_APR_POOLS_H=1 -DHAVE_LIBAPR_1=1 -DHAVE_SVN_VERSION_H=1 -DHAVE_LIBSVN_SUBR_1=1 -DHAVE_SVN_DELTA_H=1 -DHAVE_LIBSVN_DELTA_1=1 -DHAVE_LIBSASL2=1 -DMESOS_HAS_JAVA=1 -DHAVE_PYTHON=\"2.7\" -DMESOS_HAS_PYTHON=1 -DHAVE_EVENT2_EVENT_H=1 -DHAVE_LIBEVENT=1 -DHAVE_EVENT2_THREAD_H=1 -DHAVE_LIBEVENT_PTHREADS=1 -DHAVE_OPENSSL_SSL_H=1 -DHAVE_LIBSSL=1 -DHAVE_LIBCRYPTO=1 -DHAVE_EVENT2_BUFFEREVENT_SSL_H=1 -DHAVE_LIBEVENT_OPENSSL=1 -DUSE_SSL_SOCKET=1 -I. -I../../src   -Wall -Werror -DLIBDIR=\"/mesos/mesos-0.28.3/_inst/lib\" -DPKGLIBEXECDIR=\"/mesos/mesos-0.28.3/_inst/libexec/mesos\" -DPKGDATADIR=\"/mesos/mesos-0.28.3/_inst/share/mesos\" -DPKGMODULEDIR=\"/mesos/mesos-0.28.3/_inst/lib/mesos/modules\" -I../../include -I../../3rdparty/libprocess/include -I../../3rdparty/libprocess/3rdparty/stout/include -I../include -I../include/mesos -isystem ../3rdparty/libprocess/3rdparty/boost-1.53.0 -I../3rdparty/libprocess/3rdparty/picojson-1.3.0 -DPICOJSON_USE_INT64 -D__STDC_FORMAT_MACROS -I../3rdparty/libprocess/3rdparty/protobuf-2.5.0/src -I../3rdparty/libprocess/3rdparty/glog-0.3.3/src -I../3rdparty/libprocess/3rdparty/glog-0.3.3/src -I../3rdparty/leveldb-1.4/include -I../3rdparty/zookeeper-3.4.5/src/c/include -I../3rdparty/zookeeper-3.4.5/src/c/generated -I../3rdparty/libprocess/3rdparty/protobuf-2.5.0/src -DSOURCE_DIR=\"/mesos/mesos-0.28.3/_build/..\" -DBUILD_DIR=\"/mesos/mesos-0.28.3/_build\" -I../3rdparty/libprocess/3rdparty/gmock-1.7.0/gtest/include -I../3rdparty/libprocess/3rdparty/gmock-1.7.0/include -DTESTLIBEXECDIR=\"/mesos/mesos-0.28.3/_inst/libexec/mesos/tests\" -DSBINDIR=\"/mesos/mesos-0.28.3/_inst/sbin\" -I/usr/lib/jvm/java-7-openjdk-amd64/include -I/usr/lib/jvm/java-7-openjdk-amd64/include/linux -DZOOKEEPER_VERSION=\"3.4.5\" -I/usr/include/subversion-1 -I/usr/include/apr-1 -I/usr/include/apr-1.0  -pthread -g1 -O0 -std=c++11 -MT tests/mesos_tests-executor_http_api_tests.o -MD -MP -MF tests/.deps/mesos_tests-executor_http_api_tests.Tpo -c -o tests/mesos_tests-executor_http_api_tests.o `test -f 'tests/executor_http_api_tests.cpp' || echo '../../src/'`tests/executor_http_api_tests.cpp
mv -f tests/.deps/mesos_tests-authentication_tests.Tpo tests/.deps/mesos_tests-authentication_tests.Po
mv -f tests/.deps/mesos_tests-containerizer.Tpo tests/.deps/mesos_tests-containerizer.Po
clang++ -DPACKAGE_NAME=\"mesos\" -DPACKAGE_TARNAME=\"mesos\" -DPACKAGE_VERSION=\"0.28.3\" -DPACKAGE_STRING=\"mesos\ 0.28.3\" -DPACKAGE_BUGREPORT=\"\" -DPACKAGE_URL=\"\" -DPACKAGE=\"mesos\" -DVERSION=\"0.28.3\" -DSTDC_HEADERS=1 -DHAVE_SYS_TYPES_H=1 -DHAVE_SYS_STAT_H=1 -DHAVE_STDLIB_H=1 -DHAVE_STRING_H=1 -DHAVE_MEMORY_H=1 -DHAVE_STRINGS_H=1 -DHAVE_INTTYPES_H=1 -DHAVE_STDINT_H=1 -DHAVE_UNISTD_H=1 -DHAVE_DLFCN_H=1 -DLT_OBJDIR=\".libs/\" -DHAVE_PTHREAD_PRIO_INHERIT=1 -DHAVE_PTHREAD=1 -DHAVE_LIBZ=1 -DHAVE_LIBCURL=1 -DHAVE_APR_POOLS_H=1 -DHAVE_LIBAPR_1=1 -DHAVE_SVN_VERSION_H=1 -DHAVE_LIBSVN_SUBR_1=1 -DHAVE_SVN_DELTA_H=1 -DHAVE_LIBSVN_DELTA_1=1 -DHAVE_LIBSASL2=1 -DMESOS_HAS_JAVA=1 -DHAVE_PYTHON=\"2.7\" -DMESOS_HAS_PYTHON=1 -DHAVE_EVENT2_EVENT_H=1 -DHAVE_LIBEVENT=1 -DHAVE_EVENT2_THREAD_H=1 -DHAVE_LIBEVENT_PTHREADS=1 -DHAVE_OPENSSL_SSL_H=1 -DHAVE_LIBSSL=1 -DHAVE_LIBCRYPTO=1 -DHAVE_EVENT2_BUFFEREVENT_SSL_H=1 -DHAVE_LIBEVENT_OPENSSL=1 -DUSE_SSL_SOCKET=1 -I. -I../../src   -Wall -Werror -DLIBDIR=\"/mesos/mesos-0.28.3/_inst/lib\" -DPKGLIBEXECDIR=\"/mesos/mesos-0.28.3/_inst/libexec/mesos\" -DPKGDATADIR=\"/mesos/mesos-0.28.3/_inst/share/mesos\" -DPKGMODULEDIR=\"/mesos/mesos-0.28.3/_inst/lib/mesos/modules\" -I../../include -I../../3rdparty/libprocess/include -I../../3rdparty/libprocess/3rdparty/stout/include -I../include -I../include/mesos -isystem ../3rdparty/libprocess/3rdparty/boost-1.53.0 -I../3rdparty/libprocess/3rdparty/picojson-1.3.0 -DPICOJSON_USE_INT64 -D__STDC_FORMAT_MACROS -I../3rdparty/libprocess/3rdparty/protobuf-2.5.0/src -I../3rdparty/libprocess/3rdparty/glog-0.3.3/src -I../3rdparty/libprocess/3rdparty/glog-0.3.3/src -I../3rdparty/leveldb-1.4/include -I../3rdparty/zookeeper-3.4.5/src/c/include -I../3rdparty/zookeeper-3.4.5/src/c/generated -I../3rdparty/libprocess/3rdparty/protobuf-2.5.0/src -DSOURCE_DIR=\"/mesos/mesos-0.28.3/_build/..\" -DBUILD_DIR=\"/mesos/mesos-0.28.3/_build\" -I../3rdparty/libprocess/3rdparty/gmock-1.7.0/gtest/include -I../3rdparty/libprocess/3rdparty/gmock-1.7.0/include -DTESTLIBEXECDIR=\"/mesos/mesos-0.28.3/_inst/libexec/mesos/tests\" -DSBINDIR=\"/mesos/mesos-0.28.3/_inst/sbin\" -I/usr/lib/jvm/java-7-openjdk-amd64/include -I/usr/lib/jvm/java-7-openjdk-amd64/include/linux -DZOOKEEPER_VERSION=\"3.4.5\" -I/usr/include/subversion-1 -I/usr/include/apr-1 -I/usr/include/apr-1.0  -pthread -g1 -O0 -std=c++11 -MT tests/mesos_tests-fault_tolerance_tests.o -MD -MP -MF tests/.deps/mesos_tests-fault_tolerance_tests.Tpo -c -o tests/mesos_tests-fault_tolerance_tests.o `test -f 'tests/fault_tolerance_tests.cpp' || echo '../../src/'`tests/fault_tolerance_tests.cpp
clang++ -DPACKAGE_NAME=\"mesos\" -DPACKAGE_TARNAME=\"mesos\" -DPACKAGE_VERSION=\"0.28.3\" -DPACKAGE_STRING=\"mesos\ 0.28.3\" -DPACKAGE_BUGREPORT=\"\" -DPACKAGE_URL=\"\" -DPACKAGE=\"mesos\" -DVERSION=\"0.28.3\" -DSTDC_HEADERS=1 -DHAVE_SYS_TYPES_H=1 -DHAVE_SYS_STAT_H=1 -DHAVE_STDLIB_H=1 -DHAVE_STRING_H=1 -DHAVE_MEMORY_H=1 -DHAVE_STRINGS_H=1 -DHAVE_INTTYPES_H=1 -DHAVE_STDINT_H=1 -DHAVE_UNISTD_H=1 -DHAVE_DLFCN_H=1 -DLT_OBJDIR=\".libs/\" -DHAVE_PTHREAD_PRIO_INHERIT=1 -DHAVE_PTHREAD=1 -DHAVE_LIBZ=1 -DHAVE_LIBCURL=1 -DHAVE_APR_POOLS_H=1 -DHAVE_LIBAPR_1=1 -DHAVE_SVN_VERSION_H=1 -DHAVE_LIBSVN_SUBR_1=1 -DHAVE_SVN_DELTA_H=1 -DHAVE_LIBSVN_DELTA_1=1 -DHAVE_LIBSASL2=1 -DMESOS_HAS_JAVA=1 -DHAVE_PYTHON=\"2.7\" -DMESOS_HAS_PYTHON=1 -DHAVE_EVENT2_EVENT_H=1 -DHAVE_LIBEVENT=1 -DHAVE_EVENT2_THREAD_H=1 -DHAVE_LIBEVENT_PTHREADS=1 -DHAVE_OPENSSL_SSL_H=1 -DHAVE_LIBSSL=1 -DHAVE_LIBCRYPTO=1 -DHAVE_EVENT2_BUFFEREVENT_SSL_H=1 -DHAVE_LIBEVENT_OPENSSL=1 -DUSE_SSL_SOCKET=1 -I. -I../../src   -Wall -Werror -DLIBDIR=\"/mesos/mesos-0.28.3/_inst/lib\" -DPKGLIBEXECDIR=\"/mesos/mesos-0.28.3/_inst/libexec/mesos\" -DPKGDATADIR=\"/mesos/mesos-0.28.3/_inst/share/mesos\" -DPKGMODULEDIR=\"/mesos/mesos-0.28.3/_inst/lib/mesos/modules\" -I../../include -I../../3rdparty/libprocess/include -I../../3rdparty/libprocess/3rdparty/stout/include -I../include -I../include/mesos -isystem ../3rdparty/libprocess/3rdparty/boost-1.53.0 -I../3rdparty/libprocess/3rdparty/picojson-1.3.0 -DPICOJSON_USE_INT64 -D__STDC_FORMAT_MACROS -I../3rdparty/libprocess/3rdparty/protobuf-2.5.0/src -I../3rdparty/libprocess/3rdparty/glog-0.3.3/src -I../3rdparty/libprocess/3rdparty/glog-0.3.3/src -I../3rdparty/leveldb-1.4/include -I../3rdparty/zookeeper-3.4.5/src/c/include -I../3rdparty/zookeeper-3.4.5/src/c/generated -I../3rdparty/libprocess/3rdparty/protobuf-2.5.0/src -DSOURCE_DIR=\"/mesos/mesos-0.28.3/_build/..\" -DBUILD_DIR=\"/mesos/mesos-0.28.3/_build\" -I../3rdparty/libprocess/3rdparty/gmock-1.7.0/gtest/include -I../3rdparty/libprocess/3rdparty/gmock-1.7.0/include -DTESTLIBEXECDIR=\"/mesos/mesos-0.28.3/_inst/libexec/mesos/tests\" -DSBINDIR=\"/mesos/mesos-0.28.3/_inst/sbin\" -I/usr/lib/jvm/java-7-openjdk-amd64/include -I/usr/lib/jvm/java-7-openjdk-amd64/include/linux -DZOOKEEPER_VERSION=\"3.4.5\" -I/usr/include/subversion-1 -I/usr/include/apr-1 -I/usr/include/apr-1.0  -pthread -g1 -O0 -std=c++11 -MT tests/mesos_tests-fetcher_cache_tests.o -MD -MP -MF tests/.deps/mesos_tests-fetcher_cache_tests.Tpo -c -o tests/mesos_tests-fetcher_cache_tests.o `test -f 'tests/fetcher_cache_tests.cpp' || echo '../../src/'`tests/fetcher_cache_tests.cpp
mv -f tests/.deps/mesos_tests-container_logger_tests.Tpo tests/.deps/mesos_tests-container_logger_tests.Po
clang++ -DPACKAGE_NAME=\"mesos\" -DPACKAGE_TARNAME=\"mesos\" -DPACKAGE_VERSION=\"0.28.3\" -DPACKAGE_STRING=\"mesos\ 0.28.3\" -DPACKAGE_BUGREPORT=\"\" -DPACKAGE_URL=\"\" -DPACKAGE=\"mesos\" -DVERSION=\"0.28.3\" -DSTDC_HEADERS=1 -DHAVE_SYS_TYPES_H=1 -DHAVE_SYS_STAT_H=1 -DHAVE_STDLIB_H=1 -DHAVE_STRING_H=1 -DHAVE_MEMORY_H=1 -DHAVE_STRINGS_H=1 -DHAVE_INTTYPES_H=1 -DHAVE_STDINT_H=1 -DHAVE_UNISTD_H=1 -DHAVE_DLFCN_H=1 -DLT_OBJDIR=\".libs/\" -DHAVE_PTHREAD_PRIO_INHERIT=1 -DHAVE_PTHREAD=1 -DHAVE_LIBZ=1 -DHAVE_LIBCURL=1 -DHAVE_APR_POOLS_H=1 -DHAVE_LIBAPR_1=1 -DHAVE_SVN_VERSION_H=1 -DHAVE_LIBSVN_SUBR_1=1 -DHAVE_SVN_DELTA_H=1 -DHAVE_LIBSVN_DELTA_1=1 -DHAVE_LIBSASL2=1 -DMESOS_HAS_JAVA=1 -DHAVE_PYTHON=\"2.7\" -DMESOS_HAS_PYTHON=1 -DHAVE_EVENT2_EVENT_H=1 -DHAVE_LIBEVENT=1 -DHAVE_EVENT2_THREAD_H=1 -DHAVE_LIBEVENT_PTHREADS=1 -DHAVE_OPENSSL_SSL_H=1 -DHAVE_LIBSSL=1 -DHAVE_LIBCRYPTO=1 -DHAVE_EVENT2_BUFFEREVENT_SSL_H=1 -DHAVE_LIBEVENT_OPENSSL=1 -DUSE_SSL_SOCKET=1 -I. -I../../src   -Wall -Werror -DLIBDIR=\"/mesos/mesos-0.28.3/_inst/lib\" -DPKGLIBEXECDIR=\"/mesos/mesos-0.28.3/_inst/libexec/mesos\" -DPKGDATADIR=\"/mesos/mesos-0.28.3/_inst/share/mesos\" -DPKGMODULEDIR=\"/mesos/mesos-0.28.3/_inst/lib/mesos/modules\" -I../../include -I../../3rdparty/libprocess/include -I../../3rdparty/libprocess/3rdparty/stout/include -I../include -I../include/mesos -isystem ../3rdparty/libprocess/3rdparty/boost-1.53.0 -I../3rdparty/libprocess/3rdparty/picojson-1.3.0 -DPICOJSON_USE_INT64 -D__STDC_FORMAT_MACROS -I../3rdparty/libprocess/3rdparty/protobuf-2.5.0/src -I../3rdparty/libprocess/3rdparty/glog-0.3.3/src -I../3rdparty/libprocess/3rdparty/glog-0.3.3/src -I../3rdparty/leveldb-1.4/include -I../3rdparty/zookeeper-3.4.5/src/c/include -I../3rdparty/zookeeper-3.4.5/src/c/generated -I../3rdparty/libprocess/3rdparty/protobuf-2.5.0/src -DSOURCE_DIR=\"/mesos/mesos-0.28.3/_build/..\" -DBUILD_DIR=\"/mesos/mesos-0.28.3/_build\" -I../3rdparty/libprocess/3rdparty/gmock-1.7.0/gtest/include -I../3rdparty/libprocess/3rdparty/gmock-1.7.0/include -DTESTLIBEXECDIR=\"/mesos/mesos-0.28.3/_inst/libexec/mesos/tests\" -DSBINDIR=\"/mesos/mesos-0.28.3/_inst/sbin\" -I/usr/lib/jvm/java-7-openjdk-amd64/include -I/usr/lib/jvm/java-7-openjdk-amd64/include/linux -DZOOKEEPER_VERSION=\"3.4.5\" -I/usr/include/subversion-1 -I/usr/include/apr-1 -I/usr/include/apr-1.0  -pthread -g1 -O0 -std=c++11 -MT tests/mesos_tests-fetcher_tests.o -MD -MP -MF tests/.deps/mesos_tests-fetcher_tests.Tpo -c -o tests/mesos_tests-fetcher_tests.o `test -f 'tests/fetcher_tests.cpp' || echo '../../src/'`tests/fetcher_tests.cpp
mv -f tests/.deps/mesos_tests-environment.Tpo tests/.deps/mesos_tests-environment.Po
clang++ -DPACKAGE_NAME=\"mesos\" -DPACKAGE_TARNAME=\"mesos\" -DPACKAGE_VERSION=\"0.28.3\" -DPACKAGE_STRING=\"mesos\ 0.28.3\" -DPACKAGE_BUGREPORT=\"\" -DPACKAGE_URL=\"\" -DPACKAGE=\"mesos\" -DVERSION=\"0.28.3\" -DSTDC_HEADERS=1 -DHAVE_SYS_TYPES_H=1 -DHAVE_SYS_STAT_H=1 -DHAVE_STDLIB_H=1 -DHAVE_STRING_H=1 -DHAVE_MEMORY_H=1 -DHAVE_STRINGS_H=1 -DHAVE_INTTYPES_H=1 -DHAVE_STDINT_H=1 -DHAVE_UNISTD_H=1 -DHAVE_DLFCN_H=1 -DLT_OBJDIR=\".libs/\" -DHAVE_PTHREAD_PRIO_INHERIT=1 -DHAVE_PTHREAD=1 -DHAVE_LIBZ=1 -DHAVE_LIBCURL=1 -DHAVE_APR_POOLS_H=1 -DHAVE_LIBAPR_1=1 -DHAVE_SVN_VERSION_H=1 -DHAVE_LIBSVN_SUBR_1=1 -DHAVE_SVN_DELTA_H=1 -DHAVE_LIBSVN_DELTA_1=1 -DHAVE_LIBSASL2=1 -DMESOS_HAS_JAVA=1 -DHAVE_PYTHON=\"2.7\" -DMESOS_HAS_PYTHON=1 -DHAVE_EVENT2_EVENT_H=1 -DHAVE_LIBEVENT=1 -DHAVE_EVENT2_THREAD_H=1 -DHAVE_LIBEVENT_PTHREADS=1 -DHAVE_OPENSSL_SSL_H=1 -DHAVE_LIBSSL=1 -DHAVE_LIBCRYPTO=1 -DHAVE_EVENT2_BUFFEREVENT_SSL_H=1 -DHAVE_LIBEVENT_OPENSSL=1 -DUSE_SSL_SOCKET=1 -I. -I../../src   -Wall -Werror -DLIBDIR=\"/mesos/mesos-0.28.3/_inst/lib\" -DPKGLIBEXECDIR=\"/mesos/mesos-0.28.3/_inst/libexec/mesos\" -DPKGDATADIR=\"/mesos/mesos-0.28.3/_inst/share/mesos\" -DPKGMODULEDIR=\"/mesos/mesos-0.28.3/_inst/lib/mesos/modules\" -I../../include -I../../3rdparty/libprocess/include -I../../3rdparty/libprocess/3rdparty/stout/include -I../include -I../include/mesos -isystem ../3rdparty/libprocess/3rdparty/boost-1.53.0 -I../3rdparty/libprocess/3rdparty/picojson-1.3.0 -DPICOJSON_USE_INT64 -D__STDC_FORMAT_MACROS -I../3rdparty/libprocess/3rdparty/protobuf-2.5.0/src -I../3rdparty/libprocess/3rdparty/glog-0.3.3/src -I../3rdparty/libprocess/3rdparty/glog-0.3.3/src -I../3rdparty/leveldb-1.4/include -I../3rdparty/zookeeper-3.4.5/src/c/include -I../3rdparty/zookeeper-3.4.5/src/c/generated -I../3rdparty/libprocess/3rdparty/protobuf-2.5.0/src -DSOURCE_DIR=\"/mesos/mesos-0.28.3/_build/..\" -DBUILD_DIR=\"/mesos/mesos-0.28.3/_build\" -I../3rdparty/libprocess/3rdparty/gmock-1.7.0/gtest/include -I../3rdparty/libprocess/3rdparty/gmock-1.7.0/include -DTESTLIBEXECDIR=\"/mesos/mesos-0.28.3/_inst/libexec/mesos/tests\" -DSBINDIR=\"/mesos/mesos-0.28.3/_inst/sbin\" -I/usr/lib/jvm/java-7-openjdk-amd64/include -I/usr/lib/jvm/java-7-openjdk-amd64/include/linux -DZOOKEEPER_VERSION=\"3.4.5\" -I/usr/include/subversion-1 -I/usr/include/apr-1 -I/usr/include/apr-1.0  -pthread -g1 -O0 -std=c++11 -MT tests/mesos_tests-files_tests.o -MD -MP -MF tests/.deps/mesos_tests-files_tests.Tpo -c -o tests/mesos_tests-files_tests.o `test -f 'tests/files_tests.cpp' || echo '../../src/'`tests/files_tests.cpp
mv -f tests/.deps/mesos_tests-credentials_tests.Tpo tests/.deps/mesos_tests-credentials_tests.Po
clang++ -DPACKAGE_NAME=\"mesos\" -DPACKAGE_TARNAME=\"mesos\" -DPACKAGE_VERSION=\"0.28.3\" -DPACKAGE_STRING=\"mesos\ 0.28.3\" -DPACKAGE_BUGREPORT=\"\" -DPACKAGE_URL=\"\" -DPACKAGE=\"mesos\" -DVERSION=\"0.28.3\" -DSTDC_HEADERS=1 -DHAVE_SYS_TYPES_H=1 -DHAVE_SYS_STAT_H=1 -DHAVE_STDLIB_H=1 -DHAVE_STRING_H=1 -DHAVE_MEMORY_H=1 -DHAVE_STRINGS_H=1 -DHAVE_INTTYPES_H=1 -DHAVE_STDINT_H=1 -DHAVE_UNISTD_H=1 -DHAVE_DLFCN_H=1 -DLT_OBJDIR=\".libs/\" -DHAVE_PTHREAD_PRIO_INHERIT=1 -DHAVE_PTHREAD=1 -DHAVE_LIBZ=1 -DHAVE_LIBCURL=1 -DHAVE_APR_POOLS_H=1 -DHAVE_LIBAPR_1=1 -DHAVE_SVN_VERSION_H=1 -DHAVE_LIBSVN_SUBR_1=1 -DHAVE_SVN_DELTA_H=1 -DHAVE_LIBSVN_DELTA_1=1 -DHAVE_LIBSASL2=1 -DMESOS_HAS_JAVA=1 -DHAVE_PYTHON=\"2.7\" -DMESOS_HAS_PYTHON=1 -DHAVE_EVENT2_EVENT_H=1 -DHAVE_LIBEVENT=1 -DHAVE_EVENT2_THREAD_H=1 -DHAVE_LIBEVENT_PTHREADS=1 -DHAVE_OPENSSL_SSL_H=1 -DHAVE_LIBSSL=1 -DHAVE_LIBCRYPTO=1 -DHAVE_EVENT2_BUFFEREVENT_SSL_H=1 -DHAVE_LIBEVENT_OPENSSL=1 -DUSE_SSL_SOCKET=1 -I. -I../../src   -Wall -Werror -DLIBDIR=\"/mesos/mesos-0.28.3/_inst/lib\" -DPKGLIBEXECDIR=\"/mesos/mesos-0.28.3/_inst/libexec/mesos\" -DPKGDATADIR=\"/mesos/mesos-0.28.3/_inst/share/mesos\" -DPKGMODULEDIR=\"/mesos/mesos-0.28.3/_inst/lib/mesos/modules\" -I../../include -I../../3rdparty/libprocess/include -I../../3rdparty/libprocess/3rdparty/stout/include -I../include -I../include/mesos -isystem ../3rdparty/libprocess/3rdparty/boost-1.53.0 -I../3rdparty/libprocess/3rdparty/picojson-1.3.0 -DPICOJSON_USE_INT64 -D__STDC_FORMAT_MACROS -I../3rdparty/libprocess/3rdparty/protobuf-2.5.0/src -I../3rdparty/libprocess/3rdparty/glog-0.3.3/src -I../3rdparty/libprocess/3rdparty/glog-0.3.3/src -I../3rdparty/leveldb-1.4/include -I../3rdparty/zookeeper-3.4.5/src/c/include -I../3rdparty/zookeeper-3.4.5/src/c/generated -I../3rdparty/libprocess/3rdparty/protobuf-2.5.0/src -DSOURCE_DIR=\"/mesos/mesos-0.28.3/_build/..\" -DBUILD_DIR=\"/mesos/mesos-0.28.3/_build\" -I../3rdparty/libprocess/3rdparty/gmock-1.7.0/gtest/include -I../3rdparty/libprocess/3rdparty/gmock-1.7.0/include -DTESTLIBEXECDIR=\"/mesos/mesos-0.28.3/_inst/libexec/mesos/tests\" -DSBINDIR=\"/mesos/mesos-0.28.3/_inst/sbin\" -I/usr/lib/jvm/java-7-openjdk-amd64/include -I/usr/lib/jvm/java-7-openjdk-amd64/include/linux -DZOOKEEPER_VERSION=\"3.4.5\" -I/usr/include/subversion-1 -I/usr/include/apr-1 -I/usr/include/apr-1.0  -pthread -g1 -O0 -std=c++11 -MT tests/mesos_tests-flags.o -MD -MP -MF tests/.deps/mesos_tests-flags.Tpo -c -o tests/mesos_tests-flags.o `test -f 'tests/flags.cpp' || echo '../../src/'`tests/flags.cpp
mv -f tests/.deps/mesos_tests-files_tests.Tpo tests/.deps/mesos_tests-files_tests.Po
clang++ -DPACKAGE_NAME=\"mesos\" -DPACKAGE_TARNAME=\"mesos\" -DPACKAGE_VERSION=\"0.28.3\" -DPACKAGE_STRING=\"mesos\ 0.28.3\" -DPACKAGE_BUGREPORT=\"\" -DPACKAGE_URL=\"\" -DPACKAGE=\"mesos\" -DVERSION=\"0.28.3\" -DSTDC_HEADERS=1 -DHAVE_SYS_TYPES_H=1 -DHAVE_SYS_STAT_H=1 -DHAVE_STDLIB_H=1 -DHAVE_STRING_H=1 -DHAVE_MEMORY_H=1 -DHAVE_STRINGS_H=1 -DHAVE_INTTYPES_H=1 -DHAVE_STDINT_H=1 -DHAVE_UNISTD_H=1 -DHAVE_DLFCN_H=1 -DLT_OBJDIR=\".libs/\" -DHAVE_PTHREAD_PRIO_INHERIT=1 -DHAVE_PTHREAD=1 -DHAVE_LIBZ=1 -DHAVE_LIBCURL=1 -DHAVE_APR_POOLS_H=1 -DHAVE_LIBAPR_1=1 -DHAVE_SVN_VERSION_H=1 -DHAVE_LIBSVN_SUBR_1=1 -DHAVE_SVN_DELTA_H=1 -DHAVE_LIBSVN_DELTA_1=1 -DHAVE_LIBSASL2=1 -DMESOS_HAS_JAVA=1 -DHAVE_PYTHON=\"2.7\" -DMESOS_HAS_PYTHON=1 -DHAVE_EVENT2_EVENT_H=1 -DHAVE_LIBEVENT=1 -DHAVE_EVENT2_THREAD_H=1 -DHAVE_LIBEVENT_PTHREADS=1 -DHAVE_OPENSSL_SSL_H=1 -DHAVE_LIBSSL=1 -DHAVE_LIBCRYPTO=1 -DHAVE_EVENT2_BUFFEREVENT_SSL_H=1 -DHAVE_LIBEVENT_OPENSSL=1 -DUSE_SSL_SOCKET=1 -I. -I../../src   -Wall -Werror -DLIBDIR=\"/mesos/mesos-0.28.3/_inst/lib\" -DPKGLIBEXECDIR=\"/mesos/mesos-0.28.3/_inst/libexec/mesos\" -DPKGDATADIR=\"/mesos/mesos-0.28.3/_inst/share/mesos\" -DPKGMODULEDIR=\"/mesos/mesos-0.28.3/_inst/lib/mesos/modules\" -I../../include -I../../3rdparty/libprocess/include -I../../3rdparty/libprocess/3rdparty/stout/include -I../include -I../include/mesos -isystem ../3rdparty/libprocess/3rdparty/boost-1.53.0 -I../3rdparty/libprocess/3rdparty/picojson-1.3.0 -DPICOJSON_USE_INT64 -D__STDC_FORMAT_MACROS -I../3rdparty/libprocess/3rdparty/protobuf-2.5.0/src -I../3rdparty/libprocess/3rdparty/glog-0.3.3/src -I../3rdparty/libprocess/3rdparty/glog-0.3.3/src -I../3rdparty/leveldb-1.4/include -I../3rdparty/zookeeper-3.4.5/src/c/include -I../3rdparty/zookeeper-3.4.5/src/c/generated -I../3rdparty/libprocess/3rdparty/protobuf-2.5.0/src -DSOURCE_DIR=\"/mesos/mesos-0.28.3/_build/..\" -DBUILD_DIR=\"/mesos/mesos-0.28.3/_build\" -I../3rdparty/libprocess/3rdparty/gmock-1.7.0/gtest/include -I../3rdparty/libprocess/3rdparty/gmock-1.7.0/include -DTESTLIBEXECDIR=\"/mesos/mesos-0.28.3/_inst/libexec/mesos/tests\" -DSBINDIR=\"/mesos/mesos-0.28.3/_inst/sbin\" -I/usr/lib/jvm/java-7-openjdk-amd64/include -I/usr/lib/jvm/java-7-openjdk-amd64/include/linux -DZOOKEEPER_VERSION=\"3.4.5\" -I/usr/include/subversion-1 -I/usr/include/apr-1 -I/usr/include/apr-1.0  -pthread -g1 -O0 -std=c++11 -MT tests/mesos_tests-gc_tests.o -MD -MP -MF tests/.deps/mesos_tests-gc_tests.Tpo -c -o tests/mesos_tests-gc_tests.o `test -f 'tests/gc_tests.cpp' || echo '../../src/'`tests/gc_tests.cpp
mv -f tests/.deps/mesos_tests-disk_quota_tests.Tpo tests/.deps/mesos_tests-disk_quota_tests.Po
clang++ -DPACKAGE_NAME=\"mesos\" -DPACKAGE_TARNAME=\"mesos\" -DPACKAGE_VERSION=\"0.28.3\" -DPACKAGE_STRING=\"mesos\ 0.28.3\" -DPACKAGE_BUGREPORT=\"\" -DPACKAGE_URL=\"\" -DPACKAGE=\"mesos\" -DVERSION=\"0.28.3\" -DSTDC_HEADERS=1 -DHAVE_SYS_TYPES_H=1 -DHAVE_SYS_STAT_H=1 -DHAVE_STDLIB_H=1 -DHAVE_STRING_H=1 -DHAVE_MEMORY_H=1 -DHAVE_STRINGS_H=1 -DHAVE_INTTYPES_H=1 -DHAVE_STDINT_H=1 -DHAVE_UNISTD_H=1 -DHAVE_DLFCN_H=1 -DLT_OBJDIR=\".libs/\" -DHAVE_PTHREAD_PRIO_INHERIT=1 -DHAVE_PTHREAD=1 -DHAVE_LIBZ=1 -DHAVE_LIBCURL=1 -DHAVE_APR_POOLS_H=1 -DHAVE_LIBAPR_1=1 -DHAVE_SVN_VERSION_H=1 -DHAVE_LIBSVN_SUBR_1=1 -DHAVE_SVN_DELTA_H=1 -DHAVE_LIBSVN_DELTA_1=1 -DHAVE_LIBSASL2=1 -DMESOS_HAS_JAVA=1 -DHAVE_PYTHON=\"2.7\" -DMESOS_HAS_PYTHON=1 -DHAVE_EVENT2_EVENT_H=1 -DHAVE_LIBEVENT=1 -DHAVE_EVENT2_THREAD_H=1 -DHAVE_LIBEVENT_PTHREADS=1 -DHAVE_OPENSSL_SSL_H=1 -DHAVE_LIBSSL=1 -DHAVE_LIBCRYPTO=1 -DHAVE_EVENT2_BUFFEREVENT_SSL_H=1 -DHAVE_LIBEVENT_OPENSSL=1 -DUSE_SSL_SOCKET=1 -I. -I../../src   -Wall -Werror -DLIBDIR=\"/mesos/mesos-0.28.3/_inst/lib\" -DPKGLIBEXECDIR=\"/mesos/mesos-0.28.3/_inst/libexec/mesos\" -DPKGDATADIR=\"/mesos/mesos-0.28.3/_inst/share/mesos\" -DPKGMODULEDIR=\"/mesos/mesos-0.28.3/_inst/lib/mesos/modules\" -I../../include -I../../3rdparty/libprocess/include -I../../3rdparty/libprocess/3rdparty/stout/include -I../include -I../include/mesos -isystem ../3rdparty/libprocess/3rdparty/boost-1.53.0 -I../3rdparty/libprocess/3rdparty/picojson-1.3.0 -DPICOJSON_USE_INT64 -D__STDC_FORMAT_MACROS -I../3rdparty/libprocess/3rdparty/protobuf-2.5.0/src -I../3rdparty/libprocess/3rdparty/glog-0.3.3/src -I../3rdparty/libprocess/3rdparty/glog-0.3.3/src -I../3rdparty/leveldb-1.4/include -I../3rdparty/zookeeper-3.4.5/src/c/include -I../3rdparty/zookeeper-3.4.5/src/c/generated -I../3rdparty/libprocess/3rdparty/protobuf-2.5.0/src -DSOURCE_DIR=\"/mesos/mesos-0.28.3/_build/..\" -DBUILD_DIR=\"/mesos/mesos-0.28.3/_build\" -I../3rdparty/libprocess/3rdparty/gmock-1.7.0/gtest/include -I../3rdparty/libprocess/3rdparty/gmock-1.7.0/include -DTESTLIBEXECDIR=\"/mesos/mesos-0.28.3/_inst/libexec/mesos/tests\" -DSBINDIR=\"/mesos/mesos-0.28.3/_inst/sbin\" -I/usr/lib/jvm/java-7-openjdk-amd64/include -I/usr/lib/jvm/java-7-openjdk-amd64/include/linux -DZOOKEEPER_VERSION=\"3.4.5\" -I/usr/include/subversion-1 -I/usr/include/apr-1 -I/usr/include/apr-1.0  -pthread -g1 -O0 -std=c++11 -MT tests/mesos_tests-hdfs_tests.o -MD -MP -MF tests/.deps/mesos_tests-hdfs_tests.Tpo -c -o tests/mesos_tests-hdfs_tests.o `test -f 'tests/hdfs_tests.cpp' || echo '../../src/'`tests/hdfs_tests.cpp
mv -f tests/.deps/mesos_tests-flags.Tpo tests/.deps/mesos_tests-flags.Po
clang++ -DPACKAGE_NAME=\"mesos\" -DPACKAGE_TARNAME=\"mesos\" -DPACKAGE_VERSION=\"0.28.3\" -DPACKAGE_STRING=\"mesos\ 0.28.3\" -DPACKAGE_BUGREPORT=\"\" -DPACKAGE_URL=\"\" -DPACKAGE=\"mesos\" -DVERSION=\"0.28.3\" -DSTDC_HEADERS=1 -DHAVE_SYS_TYPES_H=1 -DHAVE_SYS_STAT_H=1 -DHAVE_STDLIB_H=1 -DHAVE_STRING_H=1 -DHAVE_MEMORY_H=1 -DHAVE_STRINGS_H=1 -DHAVE_INTTYPES_H=1 -DHAVE_STDINT_H=1 -DHAVE_UNISTD_H=1 -DHAVE_DLFCN_H=1 -DLT_OBJDIR=\".libs/\" -DHAVE_PTHREAD_PRIO_INHERIT=1 -DHAVE_PTHREAD=1 -DHAVE_LIBZ=1 -DHAVE_LIBCURL=1 -DHAVE_APR_POOLS_H=1 -DHAVE_LIBAPR_1=1 -DHAVE_SVN_VERSION_H=1 -DHAVE_LIBSVN_SUBR_1=1 -DHAVE_SVN_DELTA_H=1 -DHAVE_LIBSVN_DELTA_1=1 -DHAVE_LIBSASL2=1 -DMESOS_HAS_JAVA=1 -DHAVE_PYTHON=\"2.7\" -DMESOS_HAS_PYTHON=1 -DHAVE_EVENT2_EVENT_H=1 -DHAVE_LIBEVENT=1 -DHAVE_EVENT2_THREAD_H=1 -DHAVE_LIBEVENT_PTHREADS=1 -DHAVE_OPENSSL_SSL_H=1 -DHAVE_LIBSSL=1 -DHAVE_LIBCRYPTO=1 -DHAVE_EVENT2_BUFFEREVENT_SSL_H=1 -DHAVE_LIBEVENT_OPENSSL=1 -DUSE_SSL_SOCKET=1 -I. -I../../src   -Wall -Werror -DLIBDIR=\"/mesos/mesos-0.28.3/_inst/lib\" -DPKGLIBEXECDIR=\"/mesos/mesos-0.28.3/_inst/libexec/mesos\" -DPKGDATADIR=\"/mesos/mesos-0.28.3/_inst/share/mesos\" -DPKGMODULEDIR=\"/mesos/mesos-0.28.3/_inst/lib/mesos/modules\" -I../../include -I../../3rdparty/libprocess/include -I../../3rdparty/libprocess/3rdparty/stout/include -I../include -I../include/mesos -isystem ../3rdparty/libprocess/3rdparty/boost-1.53.0 -I../3rdparty/libprocess/3rdparty/picojson-1.3.0 -DPICOJSON_USE_INT64 -D__STDC_FORMAT_MACROS -I../3rdparty/libprocess/3rdparty/protobuf-2.5.0/src -I../3rdparty/libprocess/3rdparty/glog-0.3.3/src -I../3rdparty/libprocess/3rdparty/glog-0.3.3/src -I../3rdparty/leveldb-1.4/include -I../3rdparty/zookeeper-3.4.5/src/c/include -I../3rdparty/zookeeper-3.4.5/src/c/generated -I../3rdparty/libprocess/3rdparty/protobuf-2.5.0/src -DSOURCE_DIR=\"/mesos/mesos-0.28.3/_build/..\" -DBUILD_DIR=\"/mesos/mesos-0.28.3/_build\" -I../3rdparty/libprocess/3rdparty/gmock-1.7.0/gtest/include -I../3rdparty/libprocess/3rdparty/gmock-1.7.0/include -DTESTLIBEXECDIR=\"/mesos/mesos-0.28.3/_inst/libexec/mesos/tests\" -DSBINDIR=\"/mesos/mesos-0.28.3/_inst/sbin\" -I/usr/lib/jvm/java-7-openjdk-amd64/include -I/usr/lib/jvm/java-7-openjdk-amd64/include/linux -DZOOKEEPER_VERSION=\"3.4.5\" -I/usr/include/subversion-1 -I/usr/include/apr-1 -I/usr/include/apr-1.0  -pthread -g1 -O0 -std=c++11 -MT tests/mesos_tests-health_check_tests.o -MD -MP -MF tests/.deps/mesos_tests-health_check_tests.Tpo -c -o tests/mesos_tests-health_check_tests.o `test -f 'tests/health_check_tests.cpp' || echo '../../src/'`tests/health_check_tests.cpp
mv -f tests/.deps/mesos_tests-exception_tests.Tpo tests/.deps/mesos_tests-exception_tests.Po
clang++ -DPACKAGE_NAME=\"mesos\" -DPACKAGE_TARNAME=\"mesos\" -DPACKAGE_VERSION=\"0.28.3\" -DPACKAGE_STRING=\"mesos\ 0.28.3\" -DPACKAGE_BUGREPORT=\"\" -DPACKAGE_URL=\"\" -DPACKAGE=\"mesos\" -DVERSION=\"0.28.3\" -DSTDC_HEADERS=1 -DHAVE_SYS_TYPES_H=1 -DHAVE_SYS_STAT_H=1 -DHAVE_STDLIB_H=1 -DHAVE_STRING_H=1 -DHAVE_MEMORY_H=1 -DHAVE_STRINGS_H=1 -DHAVE_INTTYPES_H=1 -DHAVE_STDINT_H=1 -DHAVE_UNISTD_H=1 -DHAVE_DLFCN_H=1 -DLT_OBJDIR=\".libs/\" -DHAVE_PTHREAD_PRIO_INHERIT=1 -DHAVE_PTHREAD=1 -DHAVE_LIBZ=1 -DHAVE_LIBCURL=1 -DHAVE_APR_POOLS_H=1 -DHAVE_LIBAPR_1=1 -DHAVE_SVN_VERSION_H=1 -DHAVE_LIBSVN_SUBR_1=1 -DHAVE_SVN_DELTA_H=1 -DHAVE_LIBSVN_DELTA_1=1 -DHAVE_LIBSASL2=1 -DMESOS_HAS_JAVA=1 -DHAVE_PYTHON=\"2.7\" -DMESOS_HAS_PYTHON=1 -DHAVE_EVENT2_EVENT_H=1 -DHAVE_LIBEVENT=1 -DHAVE_EVENT2_THREAD_H=1 -DHAVE_LIBEVENT_PTHREADS=1 -DHAVE_OPENSSL_SSL_H=1 -DHAVE_LIBSSL=1 -DHAVE_LIBCRYPTO=1 -DHAVE_EVENT2_BUFFEREVENT_SSL_H=1 -DHAVE_LIBEVENT_OPENSSL=1 -DUSE_SSL_SOCKET=1 -I. -I../../src   -Wall -Werror -DLIBDIR=\"/mesos/mesos-0.28.3/_inst/lib\" -DPKGLIBEXECDIR=\"/mesos/mesos-0.28.3/_inst/libexec/mesos\" -DPKGDATADIR=\"/mesos/mesos-0.28.3/_inst/share/mesos\" -DPKGMODULEDIR=\"/mesos/mesos-0.28.3/_inst/lib/mesos/modules\" -I../../include -I../../3rdparty/libprocess/include -I../../3rdparty/libprocess/3rdparty/stout/include -I../include -I../include/mesos -isystem ../3rdparty/libprocess/3rdparty/boost-1.53.0 -I../3rdparty/libprocess/3rdparty/picojson-1.3.0 -DPICOJSON_USE_INT64 -D__STDC_FORMAT_MACROS -I../3rdparty/libprocess/3rdparty/protobuf-2.5.0/src -I../3rdparty/libprocess/3rdparty/glog-0.3.3/src -I../3rdparty/libprocess/3rdparty/glog-0.3.3/src -I../3rdparty/leveldb-1.4/include -I../3rdparty/zookeeper-3.4.5/src/c/include -I../3rdparty/zookeeper-3.4.5/src/c/generated -I../3rdparty/libprocess/3rdparty/protobuf-2.5.0/src -DSOURCE_DIR=\"/mesos/mesos-0.28.3/_build/..\" -DBUILD_DIR=\"/mesos/mesos-0.28.3/_build\" -I../3rdparty/libprocess/3rdparty/gmock-1.7.0/gtest/include -I../3rdparty/libprocess/3rdparty/gmock-1.7.0/include -DTESTLIBEXECDIR=\"/mesos/mesos-0.28.3/_inst/libexec/mesos/tests\" -DSBINDIR=\"/mesos/mesos-0.28.3/_inst/sbin\" -I/usr/lib/jvm/java-7-openjdk-amd64/include -I/usr/lib/jvm/java-7-openjdk-amd64/include/linux -DZOOKEEPER_VERSION=\"3.4.5\" -I/usr/include/subversion-1 -I/usr/include/apr-1 -I/usr/include/apr-1.0  -pthread -g1 -O0 -std=c++11 -MT tests/mesos_tests-hierarchical_allocator_tests.o -MD -MP -MF tests/.deps/mesos_tests-hierarchical_allocator_tests.Tpo -c -o tests/mesos_tests-hierarchical_allocator_tests.o `test -f 'tests/hierarchical_allocator_tests.cpp' || echo '../../src/'`tests/hierarchical_allocator_tests.cpp
mv -f tests/.deps/mesos_tests-fetcher_tests.Tpo tests/.deps/mesos_tests-fetcher_tests.Po
clang++ -DPACKAGE_NAME=\"mesos\" -DPACKAGE_TARNAME=\"mesos\" -DPACKAGE_VERSION=\"0.28.3\" -DPACKAGE_STRING=\"mesos\ 0.28.3\" -DPACKAGE_BUGREPORT=\"\" -DPACKAGE_URL=\"\" -DPACKAGE=\"mesos\" -DVERSION=\"0.28.3\" -DSTDC_HEADERS=1 -DHAVE_SYS_TYPES_H=1 -DHAVE_SYS_STAT_H=1 -DHAVE_STDLIB_H=1 -DHAVE_STRING_H=1 -DHAVE_MEMORY_H=1 -DHAVE_STRINGS_H=1 -DHAVE_INTTYPES_H=1 -DHAVE_STDINT_H=1 -DHAVE_UNISTD_H=1 -DHAVE_DLFCN_H=1 -DLT_OBJDIR=\".libs/\" -DHAVE_PTHREAD_PRIO_INHERIT=1 -DHAVE_PTHREAD=1 -DHAVE_LIBZ=1 -DHAVE_LIBCURL=1 -DHAVE_APR_POOLS_H=1 -DHAVE_LIBAPR_1=1 -DHAVE_SVN_VERSION_H=1 -DHAVE_LIBSVN_SUBR_1=1 -DHAVE_SVN_DELTA_H=1 -DHAVE_LIBSVN_DELTA_1=1 -DHAVE_LIBSASL2=1 -DMESOS_HAS_JAVA=1 -DHAVE_PYTHON=\"2.7\" -DMESOS_HAS_PYTHON=1 -DHAVE_EVENT2_EVENT_H=1 -DHAVE_LIBEVENT=1 -DHAVE_EVENT2_THREAD_H=1 -DHAVE_LIBEVENT_PTHREADS=1 -DHAVE_OPENSSL_SSL_H=1 -DHAVE_LIBSSL=1 -DHAVE_LIBCRYPTO=1 -DHAVE_EVENT2_BUFFEREVENT_SSL_H=1 -DHAVE_LIBEVENT_OPENSSL=1 -DUSE_SSL_SOCKET=1 -I. -I../../src   -Wall -Werror -DLIBDIR=\"/mesos/mesos-0.28.3/_inst/lib\" -DPKGLIBEXECDIR=\"/mesos/mesos-0.28.3/_inst/libexec/mesos\" -DPKGDATADIR=\"/mesos/mesos-0.28.3/_inst/share/mesos\" -DPKGMODULEDIR=\"/mesos/mesos-0.28.3/_inst/lib/mesos/modules\" -I../../include -I../../3rdparty/libprocess/include -I../../3rdparty/libprocess/3rdparty/stout/include -I../include -I../include/mesos -isystem ../3rdparty/libprocess/3rdparty/boost-1.53.0 -I../3rdparty/libprocess/3rdparty/picojson-1.3.0 -DPICOJSON_USE_INT64 -D__STDC_FORMAT_MACROS -I../3rdparty/libprocess/3rdparty/protobuf-2.5.0/src -I../3rdparty/libprocess/3rdparty/glog-0.3.3/src -I../3rdparty/libprocess/3rdparty/glog-0.3.3/src -I../3rdparty/leveldb-1.4/include -I../3rdparty/zookeeper-3.4.5/src/c/include -I../3rdparty/zookeeper-3.4.5/src/c/generated -I../3rdparty/libprocess/3rdparty/protobuf-2.5.0/src -DSOURCE_DIR=\"/mesos/mesos-0.28.3/_build/..\" -DBUILD_DIR=\"/mesos/mesos-0.28.3/_build\" -I../3rdparty/libprocess/3rdparty/gmock-1.7.0/gtest/include -I../3rdparty/libprocess/3rdparty/gmock-1.7.0/include -DTESTLIBEXECDIR=\"/mesos/mesos-0.28.3/_inst/libexec/mesos/tests\" -DSBINDIR=\"/mesos/mesos-0.28.3/_inst/sbin\" -I/usr/lib/jvm/java-7-openjdk-amd64/include -I/usr/lib/jvm/java-7-openjdk-amd64/include/linux -DZOOKEEPER_VERSION=\"3.4.5\" -I/usr/include/subversion-1 -I/usr/include/apr-1 -I/usr/include/apr-1.0  -pthread -g1 -O0 -std=c++11 -MT tests/mesos_tests-hook_tests.o -MD -MP -MF tests/.deps/mesos_tests-hook_tests.Tpo -c -o tests/mesos_tests-hook_tests.o `test -f 'tests/hook_tests.cpp' || echo '../../src/'`tests/hook_tests.cpp
mv -f tests/.deps/mesos_tests-hdfs_tests.Tpo tests/.deps/mesos_tests-hdfs_tests.Po
clang++ -DPACKAGE_NAME=\"mesos\" -DPACKAGE_TARNAME=\"mesos\" -DPACKAGE_VERSION=\"0.28.3\" -DPACKAGE_STRING=\"mesos\ 0.28.3\" -DPACKAGE_BUGREPORT=\"\" -DPACKAGE_URL=\"\" -DPACKAGE=\"mesos\" -DVERSION=\"0.28.3\" -DSTDC_HEADERS=1 -DHAVE_SYS_TYPES_H=1 -DHAVE_SYS_STAT_H=1 -DHAVE_STDLIB_H=1 -DHAVE_STRING_H=1 -DHAVE_MEMORY_H=1 -DHAVE_STRINGS_H=1 -DHAVE_INTTYPES_H=1 -DHAVE_STDINT_H=1 -DHAVE_UNISTD_H=1 -DHAVE_DLFCN_H=1 -DLT_OBJDIR=\".libs/\" -DHAVE_PTHREAD_PRIO_INHERIT=1 -DHAVE_PTHREAD=1 -DHAVE_LIBZ=1 -DHAVE_LIBCURL=1 -DHAVE_APR_POOLS_H=1 -DHAVE_LIBAPR_1=1 -DHAVE_SVN_VERSION_H=1 -DHAVE_LIBSVN_SUBR_1=1 -DHAVE_SVN_DELTA_H=1 -DHAVE_LIBSVN_DELTA_1=1 -DHAVE_LIBSASL2=1 -DMESOS_HAS_JAVA=1 -DHAVE_PYTHON=\"2.7\" -DMESOS_HAS_PYTHON=1 -DHAVE_EVENT2_EVENT_H=1 -DHAVE_LIBEVENT=1 -DHAVE_EVENT2_THREAD_H=1 -DHAVE_LIBEVENT_PTHREADS=1 -DHAVE_OPENSSL_SSL_H=1 -DHAVE_LIBSSL=1 -DHAVE_LIBCRYPTO=1 -DHAVE_EVENT2_BUFFEREVENT_SSL_H=1 -DHAVE_LIBEVENT_OPENSSL=1 -DUSE_SSL_SOCKET=1 -I. -I../../src   -Wall -Werror -DLIBDIR=\"/mesos/mesos-0.28.3/_inst/lib\" -DPKGLIBEXECDIR=\"/mesos/mesos-0.28.3/_inst/libexec/mesos\" -DPKGDATADIR=\"/mesos/mesos-0.28.3/_inst/share/mesos\" -DPKGMODULEDIR=\"/mesos/mesos-0.28.3/_inst/lib/mesos/modules\" -I../../include -I../../3rdparty/libprocess/include -I../../3rdparty/libprocess/3rdparty/stout/include -I../include -I../include/mesos -isystem ../3rdparty/libprocess/3rdparty/boost-1.53.0 -I../3rdparty/libprocess/3rdparty/picojson-1.3.0 -DPICOJSON_USE_INT64 -D__STDC_FORMAT_MACROS -I../3rdparty/libprocess/3rdparty/protobuf-2.5.0/src -I../3rdparty/libprocess/3rdparty/glog-0.3.3/src -I../3rdparty/libprocess/3rdparty/glog-0.3.3/src -I../3rdparty/leveldb-1.4/include -I../3rdparty/zookeeper-3.4.5/src/c/include -I../3rdparty/zookeeper-3.4.5/src/c/generated -I../3rdparty/libprocess/3rdparty/protobuf-2.5.0/src -DSOURCE_DIR=\"/mesos/mesos-0.28.3/_build/..\" -DBUILD_DIR=\"/mesos/mesos-0.28.3/_build\" -I../3rdparty/libprocess/3rdparty/gmock-1.7.0/gtest/include -I../3rdparty/libprocess/3rdparty/gmock-1.7.0/include -DTESTLIBEXECDIR=\"/mesos/mesos-0.28.3/_inst/libexec/mesos/tests\" -DSBINDIR=\"/mesos/mesos-0.28.3/_inst/sbin\" -I/usr/lib/jvm/java-7-openjdk-amd64/include -I/usr/lib/jvm/java-7-openjdk-amd64/include/linux -DZOOKEEPER_VERSION=\"3.4.5\" -I/usr/include/subversion-1 -I/usr/include/apr-1 -I/usr/include/apr-1.0  -pthread -g1 -O0 -std=c++11 -MT tests/mesos_tests-http_authentication_tests.o -MD -MP -MF tests/.deps/mesos_tests-http_authentication_tests.Tpo -c -o tests/mesos_tests-http_authentication_tests.o `test -f 'tests/http_authentication_tests.cpp' || echo '../../src/'`tests/http_authentication_tests.cpp
mv -f tests/.deps/mesos_tests-fetcher_cache_tests.Tpo tests/.deps/mesos_tests-fetcher_cache_tests.Po
mv -f tests/.deps/mesos_tests-executor_http_api_tests.Tpo tests/.deps/mesos_tests-executor_http_api_tests.Po
clang++ -DPACKAGE_NAME=\"mesos\" -DPACKAGE_TARNAME=\"mesos\" -DPACKAGE_VERSION=\"0.28.3\" -DPACKAGE_STRING=\"mesos\ 0.28.3\" -DPACKAGE_BUGREPORT=\"\" -DPACKAGE_URL=\"\" -DPACKAGE=\"mesos\" -DVERSION=\"0.28.3\" -DSTDC_HEADERS=1 -DHAVE_SYS_TYPES_H=1 -DHAVE_SYS_STAT_H=1 -DHAVE_STDLIB_H=1 -DHAVE_STRING_H=1 -DHAVE_MEMORY_H=1 -DHAVE_STRINGS_H=1 -DHAVE_INTTYPES_H=1 -DHAVE_STDINT_H=1 -DHAVE_UNISTD_H=1 -DHAVE_DLFCN_H=1 -DLT_OBJDIR=\".libs/\" -DHAVE_PTHREAD_PRIO_INHERIT=1 -DHAVE_PTHREAD=1 -DHAVE_LIBZ=1 -DHAVE_LIBCURL=1 -DHAVE_APR_POOLS_H=1 -DHAVE_LIBAPR_1=1 -DHAVE_SVN_VERSION_H=1 -DHAVE_LIBSVN_SUBR_1=1 -DHAVE_SVN_DELTA_H=1 -DHAVE_LIBSVN_DELTA_1=1 -DHAVE_LIBSASL2=1 -DMESOS_HAS_JAVA=1 -DHAVE_PYTHON=\"2.7\" -DMESOS_HAS_PYTHON=1 -DHAVE_EVENT2_EVENT_H=1 -DHAVE_LIBEVENT=1 -DHAVE_EVENT2_THREAD_H=1 -DHAVE_LIBEVENT_PTHREADS=1 -DHAVE_OPENSSL_SSL_H=1 -DHAVE_LIBSSL=1 -DHAVE_LIBCRYPTO=1 -DHAVE_EVENT2_BUFFEREVENT_SSL_H=1 -DHAVE_LIBEVENT_OPENSSL=1 -DUSE_SSL_SOCKET=1 -I. -I../../src   -Wall -Werror -DLIBDIR=\"/mesos/mesos-0.28.3/_inst/lib\" -DPKGLIBEXECDIR=\"/mesos/mesos-0.28.3/_inst/libexec/mesos\" -DPKGDATADIR=\"/mesos/mesos-0.28.3/_inst/share/mesos\" -DPKGMODULEDIR=\"/mesos/mesos-0.28.3/_inst/lib/mesos/modules\" -I../../include -I../../3rdparty/libprocess/include -I../../3rdparty/libprocess/3rdparty/stout/include -I../include -I../include/mesos -isystem ../3rdparty/libprocess/3rdparty/boost-1.53.0 -I../3rdparty/libprocess/3rdparty/picojson-1.3.0 -DPICOJSON_USE_INT64 -D__STDC_FORMAT_MACROS -I../3rdparty/libprocess/3rdparty/protobuf-2.5.0/src -I../3rdparty/libprocess/3rdparty/glog-0.3.3/src -I../3rdparty/libprocess/3rdparty/glog-0.3.3/src -I../3rdparty/leveldb-1.4/include -I../3rdparty/zookeeper-3.4.5/src/c/include -I../3rdparty/zookeeper-3.4.5/src/c/generated -I../3rdparty/libprocess/3rdparty/protobuf-2.5.0/src -DSOURCE_DIR=\"/mesos/mesos-0.28.3/_build/..\" -DBUILD_DIR=\"/mesos/mesos-0.28.3/_build\" -I../3rdparty/libprocess/3rdparty/gmock-1.7.0/gtest/include -I../3rdparty/libprocess/3rdparty/gmock-1.7.0/include -DTESTLIBEXECDIR=\"/mesos/mesos-0.28.3/_inst/libexec/mesos/tests\" -DSBINDIR=\"/mesos/mesos-0.28.3/_inst/sbin\" -I/usr/lib/jvm/java-7-openjdk-amd64/include -I/usr/lib/jvm/java-7-openjdk-amd64/include/linux -DZOOKEEPER_VERSION=\"3.4.5\" -I/usr/include/subversion-1 -I/usr/include/apr-1 -I/usr/include/apr-1.0  -pthread -g1 -O0 -std=c++11 -MT tests/mesos_tests-log_tests.o -MD -MP -MF tests/.deps/mesos_tests-log_tests.Tpo -c -o tests/mesos_tests-log_tests.o `test -f 'tests/log_tests.cpp' || echo '../../src/'`tests/log_tests.cpp
clang++ -DPACKAGE_NAME=\"mesos\" -DPACKAGE_TARNAME=\"mesos\" -DPACKAGE_VERSION=\"0.28.3\" -DPACKAGE_STRING=\"mesos\ 0.28.3\" -DPACKAGE_BUGREPORT=\"\" -DPACKAGE_URL=\"\" -DPACKAGE=\"mesos\" -DVERSION=\"0.28.3\" -DSTDC_HEADERS=1 -DHAVE_SYS_TYPES_H=1 -DHAVE_SYS_STAT_H=1 -DHAVE_STDLIB_H=1 -DHAVE_STRING_H=1 -DHAVE_MEMORY_H=1 -DHAVE_STRINGS_H=1 -DHAVE_INTTYPES_H=1 -DHAVE_STDINT_H=1 -DHAVE_UNISTD_H=1 -DHAVE_DLFCN_H=1 -DLT_OBJDIR=\".libs/\" -DHAVE_PTHREAD_PRIO_INHERIT=1 -DHAVE_PTHREAD=1 -DHAVE_LIBZ=1 -DHAVE_LIBCURL=1 -DHAVE_APR_POOLS_H=1 -DHAVE_LIBAPR_1=1 -DHAVE_SVN_VERSION_H=1 -DHAVE_LIBSVN_SUBR_1=1 -DHAVE_SVN_DELTA_H=1 -DHAVE_LIBSVN_DELTA_1=1 -DHAVE_LIBSASL2=1 -DMESOS_HAS_JAVA=1 -DHAVE_PYTHON=\"2.7\" -DMESOS_HAS_PYTHON=1 -DHAVE_EVENT2_EVENT_H=1 -DHAVE_LIBEVENT=1 -DHAVE_EVENT2_THREAD_H=1 -DHAVE_LIBEVENT_PTHREADS=1 -DHAVE_OPENSSL_SSL_H=1 -DHAVE_LIBSSL=1 -DHAVE_LIBCRYPTO=1 -DHAVE_EVENT2_BUFFEREVENT_SSL_H=1 -DHAVE_LIBEVENT_OPENSSL=1 -DUSE_SSL_SOCKET=1 -I. -I../../src   -Wall -Werror -DLIBDIR=\"/mesos/mesos-0.28.3/_inst/lib\" -DPKGLIBEXECDIR=\"/mesos/mesos-0.28.3/_inst/libexec/mesos\" -DPKGDATADIR=\"/mesos/mesos-0.28.3/_inst/share/mesos\" -DPKGMODULEDIR=\"/mesos/mesos-0.28.3/_inst/lib/mesos/modules\" -I../../include -I../../3rdparty/libprocess/include -I../../3rdparty/libprocess/3rdparty/stout/include -I../include -I../include/mesos -isystem ../3rdparty/libprocess/3rdparty/boost-1.53.0 -I../3rdparty/libprocess/3rdparty/picojson-1.3.0 -DPICOJSON_USE_INT64 -D__STDC_FORMAT_MACROS -I../3rdparty/libprocess/3rdparty/protobuf-2.5.0/src -I../3rdparty/libprocess/3rdparty/glog-0.3.3/src -I../3rdparty/libprocess/3rdparty/glog-0.3.3/src -I../3rdparty/leveldb-1.4/include -I../3rdparty/zookeeper-3.4.5/src/c/include -I../3rdparty/zookeeper-3.4.5/src/c/generated -I../3rdparty/libprocess/3rdparty/protobuf-2.5.0/src -DSOURCE_DIR=\"/mesos/mesos-0.28.3/_build/..\" -DBUILD_DIR=\"/mesos/mesos-0.28.3/_build\" -I../3rdparty/libprocess/3rdparty/gmock-1.7.0/gtest/include -I../3rdparty/libprocess/3rdparty/gmock-1.7.0/include -DTESTLIBEXECDIR=\"/mesos/mesos-0.28.3/_inst/libexec/mesos/tests\" -DSBINDIR=\"/mesos/mesos-0.28.3/_inst/sbin\" -I/usr/lib/jvm/java-7-openjdk-amd64/include -I/usr/lib/jvm/java-7-openjdk-amd64/include/linux -DZOOKEEPER_VERSION=\"3.4.5\" -I/usr/include/subversion-1 -I/usr/include/apr-1 -I/usr/include/apr-1.0  -pthread -g1 -O0 -std=c++11 -MT tests/mesos_tests-logging_tests.o -MD -MP -MF tests/.deps/mesos_tests-logging_tests.Tpo -c -o tests/mesos_tests-logging_tests.o `test -f 'tests/logging_tests.cpp' || echo '../../src/'`tests/logging_tests.cpp
mv -f tests/.deps/mesos_tests-logging_tests.Tpo tests/.deps/mesos_tests-logging_tests.Po
clang++ -DPACKAGE_NAME=\"mesos\" -DPACKAGE_TARNAME=\"mesos\" -DPACKAGE_VERSION=\"0.28.3\" -DPACKAGE_STRING=\"mesos\ 0.28.3\" -DPACKAGE_BUGREPORT=\"\" -DPACKAGE_URL=\"\" -DPACKAGE=\"mesos\" -DVERSION=\"0.28.3\" -DSTDC_HEADERS=1 -DHAVE_SYS_TYPES_H=1 -DHAVE_SYS_STAT_H=1 -DHAVE_STDLIB_H=1 -DHAVE_STRING_H=1 -DHAVE_MEMORY_H=1 -DHAVE_STRINGS_H=1 -DHAVE_INTTYPES_H=1 -DHAVE_STDINT_H=1 -DHAVE_UNISTD_H=1 -DHAVE_DLFCN_H=1 -DLT_OBJDIR=\".libs/\" -DHAVE_PTHREAD_PRIO_INHERIT=1 -DHAVE_PTHREAD=1 -DHAVE_LIBZ=1 -DHAVE_LIBCURL=1 -DHAVE_APR_POOLS_H=1 -DHAVE_LIBAPR_1=1 -DHAVE_SVN_VERSION_H=1 -DHAVE_LIBSVN_SUBR_1=1 -DHAVE_SVN_DELTA_H=1 -DHAVE_LIBSVN_DELTA_1=1 -DHAVE_LIBSASL2=1 -DMESOS_HAS_JAVA=1 -DHAVE_PYTHON=\"2.7\" -DMESOS_HAS_PYTHON=1 -DHAVE_EVENT2_EVENT_H=1 -DHAVE_LIBEVENT=1 -DHAVE_EVENT2_THREAD_H=1 -DHAVE_LIBEVENT_PTHREADS=1 -DHAVE_OPENSSL_SSL_H=1 -DHAVE_LIBSSL=1 -DHAVE_LIBCRYPTO=1 -DHAVE_EVENT2_BUFFEREVENT_SSL_H=1 -DHAVE_LIBEVENT_OPENSSL=1 -DUSE_SSL_SOCKET=1 -I. -I../../src   -Wall -Werror -DLIBDIR=\"/mesos/mesos-0.28.3/_inst/lib\" -DPKGLIBEXECDIR=\"/mesos/mesos-0.28.3/_inst/libexec/mesos\" -DPKGDATADIR=\"/mesos/mesos-0.28.3/_inst/share/mesos\" -DPKGMODULEDIR=\"/mesos/mesos-0.28.3/_inst/lib/mesos/modules\" -I../../include -I../../3rdparty/libprocess/include -I../../3rdparty/libprocess/3rdparty/stout/include -I../include -I../include/mesos -isystem ../3rdparty/libprocess/3rdparty/boost-1.53.0 -I../3rdparty/libprocess/3rdparty/picojson-1.3.0 -DPICOJSON_USE_INT64 -D__STDC_FORMAT_MACROS -I../3rdparty/libprocess/3rdparty/protobuf-2.5.0/src -I../3rdparty/libprocess/3rdparty/glog-0.3.3/src -I../3rdparty/libprocess/3rdparty/glog-0.3.3/src -I../3rdparty/leveldb-1.4/include -I../3rdparty/zookeeper-3.4.5/src/c/include -I../3rdparty/zookeeper-3.4.5/src/c/generated -I../3rdparty/libprocess/3rdparty/protobuf-2.5.0/src -DSOURCE_DIR=\"/mesos/mesos-0.28.3/_build/..\" -DBUILD_DIR=\"/mesos/mesos-0.28.3/_build\" -I../3rdparty/libprocess/3rdparty/gmock-1.7.0/gtest/include -I../3rdparty/libprocess/3rdparty/gmock-1.7.0/include -DTESTLIBEXECDIR=\"/mesos/mesos-0.28.3/_inst/libexec/mesos/tests\" -DSBINDIR=\"/mesos/mesos-0.28.3/_inst/sbin\" -I/usr/lib/jvm/java-7-openjdk-amd64/include -I/usr/lib/jvm/java-7-openjdk-amd64/include/linux -DZOOKEEPER_VERSION=\"3.4.5\" -I/usr/include/subversion-1 -I/usr/include/apr-1 -I/usr/include/apr-1.0  -pthread -g1 -O0 -std=c++11 -MT tests/mesos_tests-main.o -MD -MP -MF tests/.deps/mesos_tests-main.Tpo -c -o tests/mesos_tests-main.o `test -f 'tests/main.cpp' || echo '../../src/'`tests/main.cpp
mv -f tests/.deps/mesos_tests-fault_tolerance_tests.Tpo tests/.deps/mesos_tests-fault_tolerance_tests.Po
clang++ -DPACKAGE_NAME=\"mesos\" -DPACKAGE_TARNAME=\"mesos\" -DPACKAGE_VERSION=\"0.28.3\" -DPACKAGE_STRING=\"mesos\ 0.28.3\" -DPACKAGE_BUGREPORT=\"\" -DPACKAGE_URL=\"\" -DPACKAGE=\"mesos\" -DVERSION=\"0.28.3\" -DSTDC_HEADERS=1 -DHAVE_SYS_TYPES_H=1 -DHAVE_SYS_STAT_H=1 -DHAVE_STDLIB_H=1 -DHAVE_STRING_H=1 -DHAVE_MEMORY_H=1 -DHAVE_STRINGS_H=1 -DHAVE_INTTYPES_H=1 -DHAVE_STDINT_H=1 -DHAVE_UNISTD_H=1 -DHAVE_DLFCN_H=1 -DLT_OBJDIR=\".libs/\" -DHAVE_PTHREAD_PRIO_INHERIT=1 -DHAVE_PTHREAD=1 -DHAVE_LIBZ=1 -DHAVE_LIBCURL=1 -DHAVE_APR_POOLS_H=1 -DHAVE_LIBAPR_1=1 -DHAVE_SVN_VERSION_H=1 -DHAVE_LIBSVN_SUBR_1=1 -DHAVE_SVN_DELTA_H=1 -DHAVE_LIBSVN_DELTA_1=1 -DHAVE_LIBSASL2=1 -DMESOS_HAS_JAVA=1 -DHAVE_PYTHON=\"2.7\" -DMESOS_HAS_PYTHON=1 -DHAVE_EVENT2_EVENT_H=1 -DHAVE_LIBEVENT=1 -DHAVE_EVENT2_THREAD_H=1 -DHAVE_LIBEVENT_PTHREADS=1 -DHAVE_OPENSSL_SSL_H=1 -DHAVE_LIBSSL=1 -DHAVE_LIBCRYPTO=1 -DHAVE_EVENT2_BUFFEREVENT_SSL_H=1 -DHAVE_LIBEVENT_OPENSSL=1 -DUSE_SSL_SOCKET=1 -I. -I../../src   -Wall -Werror -DLIBDIR=\"/mesos/mesos-0.28.3/_inst/lib\" -DPKGLIBEXECDIR=\"/mesos/mesos-0.28.3/_inst/libexec/mesos\" -DPKGDATADIR=\"/mesos/mesos-0.28.3/_inst/share/mesos\" -DPKGMODULEDIR=\"/mesos/mesos-0.28.3/_inst/lib/mesos/modules\" -I../../include -I../../3rdparty/libprocess/include -I../../3rdparty/libprocess/3rdparty/stout/include -I../include -I../include/mesos -isystem ../3rdparty/libprocess/3rdparty/boost-1.53.0 -I../3rdparty/libprocess/3rdparty/picojson-1.3.0 -DPICOJSON_USE_INT64 -D__STDC_FORMAT_MACROS -I../3rdparty/libprocess/3rdparty/protobuf-2.5.0/src -I../3rdparty/libprocess/3rdparty/glog-0.3.3/src -I../3rdparty/libprocess/3rdparty/glog-0.3.3/src -I../3rdparty/leveldb-1.4/include -I../3rdparty/zookeeper-3.4.5/src/c/include -I../3rdparty/zookeeper-3.4.5/src/c/generated -I../3rdparty/libprocess/3rdparty/protobuf-2.5.0/src -DSOURCE_DIR=\"/mesos/mesos-0.28.3/_build/..\" -DBUILD_DIR=\"/mesos/mesos-0.28.3/_build\" -I../3rdparty/libprocess/3rdparty/gmock-1.7.0/gtest/include -I../3rdparty/libprocess/3rdparty/gmock-1.7.0/include -DTESTLIBEXECDIR=\"/mesos/mesos-0.28.3/_inst/libexec/mesos/tests\" -DSBINDIR=\"/mesos/mesos-0.28.3/_inst/sbin\" -I/usr/lib/jvm/java-7-openjdk-amd64/include -I/usr/lib/jvm/java-7-openjdk-amd64/include/linux -DZOOKEEPER_VERSION=\"3.4.5\" -I/usr/include/subversion-1 -I/usr/include/apr-1 -I/usr/include/apr-1.0  -pthread -g1 -O0 -std=c++11 -MT tests/mesos_tests-master_allocator_tests.o -MD -MP -MF tests/.deps/mesos_tests-master_allocator_tests.Tpo -c -o tests/mesos_tests-master_allocator_tests.o `test -f 'tests/master_allocator_tests.cpp' || echo '../../src/'`tests/master_allocator_tests.cpp
mv -f tests/.deps/mesos_tests-gc_tests.Tpo tests/.deps/mesos_tests-gc_tests.Po
clang++ -DPACKAGE_NAME=\"mesos\" -DPACKAGE_TARNAME=\"mesos\" -DPACKAGE_VERSION=\"0.28.3\" -DPACKAGE_STRING=\"mesos\ 0.28.3\" -DPACKAGE_BUGREPORT=\"\" -DPACKAGE_URL=\"\" -DPACKAGE=\"mesos\" -DVERSION=\"0.28.3\" -DSTDC_HEADERS=1 -DHAVE_SYS_TYPES_H=1 -DHAVE_SYS_STAT_H=1 -DHAVE_STDLIB_H=1 -DHAVE_STRING_H=1 -DHAVE_MEMORY_H=1 -DHAVE_STRINGS_H=1 -DHAVE_INTTYPES_H=1 -DHAVE_STDINT_H=1 -DHAVE_UNISTD_H=1 -DHAVE_DLFCN_H=1 -DLT_OBJDIR=\".libs/\" -DHAVE_PTHREAD_PRIO_INHERIT=1 -DHAVE_PTHREAD=1 -DHAVE_LIBZ=1 -DHAVE_LIBCURL=1 -DHAVE_APR_POOLS_H=1 -DHAVE_LIBAPR_1=1 -DHAVE_SVN_VERSION_H=1 -DHAVE_LIBSVN_SUBR_1=1 -DHAVE_SVN_DELTA_H=1 -DHAVE_LIBSVN_DELTA_1=1 -DHAVE_LIBSASL2=1 -DMESOS_HAS_JAVA=1 -DHAVE_PYTHON=\"2.7\" -DMESOS_HAS_PYTHON=1 -DHAVE_EVENT2_EVENT_H=1 -DHAVE_LIBEVENT=1 -DHAVE_EVENT2_THREAD_H=1 -DHAVE_LIBEVENT_PTHREADS=1 -DHAVE_OPENSSL_SSL_H=1 -DHAVE_LIBSSL=1 -DHAVE_LIBCRYPTO=1 -DHAVE_EVENT2_BUFFEREVENT_SSL_H=1 -DHAVE_LIBEVENT_OPENSSL=1 -DUSE_SSL_SOCKET=1 -I. -I../../src   -Wall -Werror -DLIBDIR=\"/mesos/mesos-0.28.3/_inst/lib\" -DPKGLIBEXECDIR=\"/mesos/mesos-0.28.3/_inst/libexec/mesos\" -DPKGDATADIR=\"/mesos/mesos-0.28.3/_inst/share/mesos\" -DPKGMODULEDIR=\"/mesos/mesos-0.28.3/_inst/lib/mesos/modules\" -I../../include -I../../3rdparty/libprocess/include -I../../3rdparty/libprocess/3rdparty/stout/include -I../include -I../include/mesos -isystem ../3rdparty/libprocess/3rdparty/boost-1.53.0 -I../3rdparty/libprocess/3rdparty/picojson-1.3.0 -DPICOJSON_USE_INT64 -D__STDC_FORMAT_MACROS -I../3rdparty/libprocess/3rdparty/protobuf-2.5.0/src -I../3rdparty/libprocess/3rdparty/glog-0.3.3/src -I../3rdparty/libprocess/3rdparty/glog-0.3.3/src -I../3rdparty/leveldb-1.4/include -I../3rdparty/zookeeper-3.4.5/src/c/include -I../3rdparty/zookeeper-3.4.5/src/c/generated -I../3rdparty/libprocess/3rdparty/protobuf-2.5.0/src -DSOURCE_DIR=\"/mesos/mesos-0.28.3/_build/..\" -DBUILD_DIR=\"/mesos/mesos-0.28.3/_build\" -I../3rdparty/libprocess/3rdparty/gmock-1.7.0/gtest/include -I../3rdparty/libprocess/3rdparty/gmock-1.7.0/include -DTESTLIBEXECDIR=\"/mesos/mesos-0.28.3/_inst/libexec/mesos/tests\" -DSBINDIR=\"/mesos/mesos-0.28.3/_inst/sbin\" -I/usr/lib/jvm/java-7-openjdk-amd64/include -I/usr/lib/jvm/java-7-openjdk-amd64/include/linux -DZOOKEEPER_VERSION=\"3.4.5\" -I/usr/include/subversion-1 -I/usr/include/apr-1 -I/usr/include/apr-1.0  -pthread -g1 -O0 -std=c++11 -MT tests/mesos_tests-master_authorization_tests.o -MD -MP -MF tests/.deps/mesos_tests-master_authorization_tests.Tpo -c -o tests/mesos_tests-master_authorization_tests.o `test -f 'tests/master_authorization_tests.cpp' || echo '../../src/'`tests/master_authorization_tests.cpp
mv -f tests/.deps/mesos_tests-health_check_tests.Tpo tests/.deps/mesos_tests-health_check_tests.Po
clang++ -DPACKAGE_NAME=\"mesos\" -DPACKAGE_TARNAME=\"mesos\" -DPACKAGE_VERSION=\"0.28.3\" -DPACKAGE_STRING=\"mesos\ 0.28.3\" -DPACKAGE_BUGREPORT=\"\" -DPACKAGE_URL=\"\" -DPACKAGE=\"mesos\" -DVERSION=\"0.28.3\" -DSTDC_HEADERS=1 -DHAVE_SYS_TYPES_H=1 -DHAVE_SYS_STAT_H=1 -DHAVE_STDLIB_H=1 -DHAVE_STRING_H=1 -DHAVE_MEMORY_H=1 -DHAVE_STRINGS_H=1 -DHAVE_INTTYPES_H=1 -DHAVE_STDINT_H=1 -DHAVE_UNISTD_H=1 -DHAVE_DLFCN_H=1 -DLT_OBJDIR=\".libs/\" -DHAVE_PTHREAD_PRIO_INHERIT=1 -DHAVE_PTHREAD=1 -DHAVE_LIBZ=1 -DHAVE_LIBCURL=1 -DHAVE_APR_POOLS_H=1 -DHAVE_LIBAPR_1=1 -DHAVE_SVN_VERSION_H=1 -DHAVE_LIBSVN_SUBR_1=1 -DHAVE_SVN_DELTA_H=1 -DHAVE_LIBSVN_DELTA_1=1 -DHAVE_LIBSASL2=1 -DMESOS_HAS_JAVA=1 -DHAVE_PYTHON=\"2.7\" -DMESOS_HAS_PYTHON=1 -DHAVE_EVENT2_EVENT_H=1 -DHAVE_LIBEVENT=1 -DHAVE_EVENT2_THREAD_H=1 -DHAVE_LIBEVENT_PTHREADS=1 -DHAVE_OPENSSL_SSL_H=1 -DHAVE_LIBSSL=1 -DHAVE_LIBCRYPTO=1 -DHAVE_EVENT2_BUFFEREVENT_SSL_H=1 -DHAVE_LIBEVENT_OPENSSL=1 -DUSE_SSL_SOCKET=1 -I. -I../../src   -Wall -Werror -DLIBDIR=\"/mesos/mesos-0.28.3/_inst/lib\" -DPKGLIBEXECDIR=\"/mesos/mesos-0.28.3/_inst/libexec/mesos\" -DPKGDATADIR=\"/mesos/mesos-0.28.3/_inst/share/mesos\" -DPKGMODULEDIR=\"/mesos/mesos-0.28.3/_inst/lib/mesos/modules\" -I../../include -I../../3rdparty/libprocess/include -I../../3rdparty/libprocess/3rdparty/stout/include -I../include -I../include/mesos -isystem ../3rdparty/libprocess/3rdparty/boost-1.53.0 -I../3rdparty/libprocess/3rdparty/picojson-1.3.0 -DPICOJSON_USE_INT64 -D__STDC_FORMAT_MACROS -I../3rdparty/libprocess/3rdparty/protobuf-2.5.0/src -I../3rdparty/libprocess/3rdparty/glog-0.3.3/src -I../3rdparty/libprocess/3rdparty/glog-0.3.3/src -I../3rdparty/leveldb-1.4/include -I../3rdparty/zookeeper-3.4.5/src/c/include -I../3rdparty/zookeeper-3.4.5/src/c/generated -I../3rdparty/libprocess/3rdparty/protobuf-2.5.0/src -DSOURCE_DIR=\"/mesos/mesos-0.28.3/_build/..\" -DBUILD_DIR=\"/mesos/mesos-0.28.3/_build\" -I../3rdparty/libprocess/3rdparty/gmock-1.7.0/gtest/include -I../3rdparty/libprocess/3rdparty/gmock-1.7.0/include -DTESTLIBEXECDIR=\"/mesos/mesos-0.28.3/_inst/libexec/mesos/tests\" -DSBINDIR=\"/mesos/mesos-0.28.3/_inst/sbin\" -I/usr/lib/jvm/java-7-openjdk-amd64/include -I/usr/lib/jvm/java-7-openjdk-amd64/include/linux -DZOOKEEPER_VERSION=\"3.4.5\" -I/usr/include/subversion-1 -I/usr/include/apr-1 -I/usr/include/apr-1.0  -pthread -g1 -O0 -std=c++11 -MT tests/mesos_tests-master_contender_detector_tests.o -MD -MP -MF tests/.deps/mesos_tests-master_contender_detector_tests.Tpo -c -o tests/mesos_tests-master_contender_detector_tests.o `test -f 'tests/master_contender_detector_tests.cpp' || echo '../../src/'`tests/master_contender_detector_tests.cpp
mv -f tests/.deps/mesos_tests-http_authentication_tests.Tpo tests/.deps/mesos_tests-http_authentication_tests.Po
clang++ -DPACKAGE_NAME=\"mesos\" -DPACKAGE_TARNAME=\"mesos\" -DPACKAGE_VERSION=\"0.28.3\" -DPACKAGE_STRING=\"mesos\ 0.28.3\" -DPACKAGE_BUGREPORT=\"\" -DPACKAGE_URL=\"\" -DPACKAGE=\"mesos\" -DVERSION=\"0.28.3\" -DSTDC_HEADERS=1 -DHAVE_SYS_TYPES_H=1 -DHAVE_SYS_STAT_H=1 -DHAVE_STDLIB_H=1 -DHAVE_STRING_H=1 -DHAVE_MEMORY_H=1 -DHAVE_STRINGS_H=1 -DHAVE_INTTYPES_H=1 -DHAVE_STDINT_H=1 -DHAVE_UNISTD_H=1 -DHAVE_DLFCN_H=1 -DLT_OBJDIR=\".libs/\" -DHAVE_PTHREAD_PRIO_INHERIT=1 -DHAVE_PTHREAD=1 -DHAVE_LIBZ=1 -DHAVE_LIBCURL=1 -DHAVE_APR_POOLS_H=1 -DHAVE_LIBAPR_1=1 -DHAVE_SVN_VERSION_H=1 -DHAVE_LIBSVN_SUBR_1=1 -DHAVE_SVN_DELTA_H=1 -DHAVE_LIBSVN_DELTA_1=1 -DHAVE_LIBSASL2=1 -DMESOS_HAS_JAVA=1 -DHAVE_PYTHON=\"2.7\" -DMESOS_HAS_PYTHON=1 -DHAVE_EVENT2_EVENT_H=1 -DHAVE_LIBEVENT=1 -DHAVE_EVENT2_THREAD_H=1 -DHAVE_LIBEVENT_PTHREADS=1 -DHAVE_OPENSSL_SSL_H=1 -DHAVE_LIBSSL=1 -DHAVE_LIBCRYPTO=1 -DHAVE_EVENT2_BUFFEREVENT_SSL_H=1 -DHAVE_LIBEVENT_OPENSSL=1 -DUSE_SSL_SOCKET=1 -I. -I../../src   -Wall -Werror -DLIBDIR=\"/mesos/mesos-0.28.3/_inst/lib\" -DPKGLIBEXECDIR=\"/mesos/mesos-0.28.3/_inst/libexec/mesos\" -DPKGDATADIR=\"/mesos/mesos-0.28.3/_inst/share/mesos\" -DPKGMODULEDIR=\"/mesos/mesos-0.28.3/_inst/lib/mesos/modules\" -I../../include -I../../3rdparty/libprocess/include -I../../3rdparty/libprocess/3rdparty/stout/include -I../include -I../include/mesos -isystem ../3rdparty/libprocess/3rdparty/boost-1.53.0 -I../3rdparty/libprocess/3rdparty/picojson-1.3.0 -DPICOJSON_USE_INT64 -D__STDC_FORMAT_MACROS -I../3rdparty/libprocess/3rdparty/protobuf-2.5.0/src -I../3rdparty/libprocess/3rdparty/glog-0.3.3/src -I../3rdparty/libprocess/3rdparty/glog-0.3.3/src -I../3rdparty/leveldb-1.4/include -I../3rdparty/zookeeper-3.4.5/src/c/include -I../3rdparty/zookeeper-3.4.5/src/c/generated -I../3rdparty/libprocess/3rdparty/protobuf-2.5.0/src -DSOURCE_DIR=\"/mesos/mesos-0.28.3/_build/..\" -DBUILD_DIR=\"/mesos/mesos-0.28.3/_build\" -I../3rdparty/libprocess/3rdparty/gmock-1.7.0/gtest/include -I../3rdparty/libprocess/3rdparty/gmock-1.7.0/include -DTESTLIBEXECDIR=\"/mesos/mesos-0.28.3/_inst/libexec/mesos/tests\" -DSBINDIR=\"/mesos/mesos-0.28.3/_inst/sbin\" -I/usr/lib/jvm/java-7-openjdk-amd64/include -I/usr/lib/jvm/java-7-openjdk-amd64/include/linux -DZOOKEEPER_VERSION=\"3.4.5\" -I/usr/include/subversion-1 -I/usr/include/apr-1 -I/usr/include/apr-1.0  -pthread -g1 -O0 -std=c++11 -MT tests/mesos_tests-master_maintenance_tests.o -MD -MP -MF tests/.deps/mesos_tests-master_maintenance_tests.Tpo -c -o tests/mesos_tests-master_maintenance_tests.o `test -f 'tests/master_maintenance_tests.cpp' || echo '../../src/'`tests/master_maintenance_tests.cpp
mv -f tests/.deps/mesos_tests-hierarchical_allocator_tests.Tpo tests/.deps/mesos_tests-hierarchical_allocator_tests.Po
clang++ -DPACKAGE_NAME=\"mesos\" -DPACKAGE_TARNAME=\"mesos\" -DPACKAGE_VERSION=\"0.28.3\" -DPACKAGE_STRING=\"mesos\ 0.28.3\" -DPACKAGE_BUGREPORT=\"\" -DPACKAGE_URL=\"\" -DPACKAGE=\"mesos\" -DVERSION=\"0.28.3\" -DSTDC_HEADERS=1 -DHAVE_SYS_TYPES_H=1 -DHAVE_SYS_STAT_H=1 -DHAVE_STDLIB_H=1 -DHAVE_STRING_H=1 -DHAVE_MEMORY_H=1 -DHAVE_STRINGS_H=1 -DHAVE_INTTYPES_H=1 -DHAVE_STDINT_H=1 -DHAVE_UNISTD_H=1 -DHAVE_DLFCN_H=1 -DLT_OBJDIR=\".libs/\" -DHAVE_PTHREAD_PRIO_INHERIT=1 -DHAVE_PTHREAD=1 -DHAVE_LIBZ=1 -DHAVE_LIBCURL=1 -DHAVE_APR_POOLS_H=1 -DHAVE_LIBAPR_1=1 -DHAVE_SVN_VERSION_H=1 -DHAVE_LIBSVN_SUBR_1=1 -DHAVE_SVN_DELTA_H=1 -DHAVE_LIBSVN_DELTA_1=1 -DHAVE_LIBSASL2=1 -DMESOS_HAS_JAVA=1 -DHAVE_PYTHON=\"2.7\" -DMESOS_HAS_PYTHON=1 -DHAVE_EVENT2_EVENT_H=1 -DHAVE_LIBEVENT=1 -DHAVE_EVENT2_THREAD_H=1 -DHAVE_LIBEVENT_PTHREADS=1 -DHAVE_OPENSSL_SSL_H=1 -DHAVE_LIBSSL=1 -DHAVE_LIBCRYPTO=1 -DHAVE_EVENT2_BUFFEREVENT_SSL_H=1 -DHAVE_LIBEVENT_OPENSSL=1 -DUSE_SSL_SOCKET=1 -I. -I../../src   -Wall -Werror -DLIBDIR=\"/mesos/mesos-0.28.3/_inst/lib\" -DPKGLIBEXECDIR=\"/mesos/mesos-0.28.3/_inst/libexec/mesos\" -DPKGDATADIR=\"/mesos/mesos-0.28.3/_inst/share/mesos\" -DPKGMODULEDIR=\"/mesos/mesos-0.28.3/_inst/lib/mesos/modules\" -I../../include -I../../3rdparty/libprocess/include -I../../3rdparty/libprocess/3rdparty/stout/include -I../include -I../include/mesos -isystem ../3rdparty/libprocess/3rdparty/boost-1.53.0 -I../3rdparty/libprocess/3rdparty/picojson-1.3.0 -DPICOJSON_USE_INT64 -D__STDC_FORMAT_MACROS -I../3rdparty/libprocess/3rdparty/protobuf-2.5.0/src -I../3rdparty/libprocess/3rdparty/glog-0.3.3/src -I../3rdparty/libprocess/3rdparty/glog-0.3.3/src -I../3rdparty/leveldb-1.4/include -I../3rdparty/zookeeper-3.4.5/src/c/include -I../3rdparty/zookeeper-3.4.5/src/c/generated -I../3rdparty/libprocess/3rdparty/protobuf-2.5.0/src -DSOURCE_DIR=\"/mesos/mesos-0.28.3/_build/..\" -DBUILD_DIR=\"/mesos/mesos-0.28.3/_build\" -I../3rdparty/libprocess/3rdparty/gmock-1.7.0/gtest/include -I../3rdparty/libprocess/3rdparty/gmock-1.7.0/include -DTESTLIBEXECDIR=\"/mesos/mesos-0.28.3/_inst/libexec/mesos/tests\" -DSBINDIR=\"/mesos/mesos-0.28.3/_inst/sbin\" -I/usr/lib/jvm/java-7-openjdk-amd64/include -I/usr/lib/jvm/java-7-openjdk-amd64/include/linux -DZOOKEEPER_VERSION=\"3.4.5\" -I/usr/include/subversion-1 -I/usr/include/apr-1 -I/usr/include/apr-1.0  -pthread -g1 -O0 -std=c++11 -MT tests/mesos_tests-master_quota_tests.o -MD -MP -MF tests/.deps/mesos_tests-master_quota_tests.Tpo -c -o tests/mesos_tests-master_quota_tests.o `test -f 'tests/master_quota_tests.cpp' || echo '../../src/'`tests/master_quota_tests.cpp
mv -f tests/.deps/mesos_tests-hook_tests.Tpo tests/.deps/mesos_tests-hook_tests.Po
clang++ -DPACKAGE_NAME=\"mesos\" -DPACKAGE_TARNAME=\"mesos\" -DPACKAGE_VERSION=\"0.28.3\" -DPACKAGE_STRING=\"mesos\ 0.28.3\" -DPACKAGE_BUGREPORT=\"\" -DPACKAGE_URL=\"\" -DPACKAGE=\"mesos\" -DVERSION=\"0.28.3\" -DSTDC_HEADERS=1 -DHAVE_SYS_TYPES_H=1 -DHAVE_SYS_STAT_H=1 -DHAVE_STDLIB_H=1 -DHAVE_STRING_H=1 -DHAVE_MEMORY_H=1 -DHAVE_STRINGS_H=1 -DHAVE_INTTYPES_H=1 -DHAVE_STDINT_H=1 -DHAVE_UNISTD_H=1 -DHAVE_DLFCN_H=1 -DLT_OBJDIR=\".libs/\" -DHAVE_PTHREAD_PRIO_INHERIT=1 -DHAVE_PTHREAD=1 -DHAVE_LIBZ=1 -DHAVE_LIBCURL=1 -DHAVE_APR_POOLS_H=1 -DHAVE_LIBAPR_1=1 -DHAVE_SVN_VERSION_H=1 -DHAVE_LIBSVN_SUBR_1=1 -DHAVE_SVN_DELTA_H=1 -DHAVE_LIBSVN_DELTA_1=1 -DHAVE_LIBSASL2=1 -DMESOS_HAS_JAVA=1 -DHAVE_PYTHON=\"2.7\" -DMESOS_HAS_PYTHON=1 -DHAVE_EVENT2_EVENT_H=1 -DHAVE_LIBEVENT=1 -DHAVE_EVENT2_THREAD_H=1 -DHAVE_LIBEVENT_PTHREADS=1 -DHAVE_OPENSSL_SSL_H=1 -DHAVE_LIBSSL=1 -DHAVE_LIBCRYPTO=1 -DHAVE_EVENT2_BUFFEREVENT_SSL_H=1 -DHAVE_LIBEVENT_OPENSSL=1 -DUSE_SSL_SOCKET=1 -I. -I../../src   -Wall -Werror -DLIBDIR=\"/mesos/mesos-0.28.3/_inst/lib\" -DPKGLIBEXECDIR=\"/mesos/mesos-0.28.3/_inst/libexec/mesos\" -DPKGDATADIR=\"/mesos/mesos-0.28.3/_inst/share/mesos\" -DPKGMODULEDIR=\"/mesos/mesos-0.28.3/_inst/lib/mesos/modules\" -I../../include -I../../3rdparty/libprocess/include -I../../3rdparty/libprocess/3rdparty/stout/include -I../include -I../include/mesos -isystem ../3rdparty/libprocess/3rdparty/boost-1.53.0 -I../3rdparty/libprocess/3rdparty/picojson-1.3.0 -DPICOJSON_USE_INT64 -D__STDC_FORMAT_MACROS -I../3rdparty/libprocess/3rdparty/protobuf-2.5.0/src -I../3rdparty/libprocess/3rdparty/glog-0.3.3/src -I../3rdparty/libprocess/3rdparty/glog-0.3.3/src -I../3rdparty/leveldb-1.4/include -I../3rdparty/zookeeper-3.4.5/src/c/include -I../3rdparty/zookeeper-3.4.5/src/c/generated -I../3rdparty/libprocess/3rdparty/protobuf-2.5.0/src -DSOURCE_DIR=\"/mesos/mesos-0.28.3/_build/..\" -DBUILD_DIR=\"/mesos/mesos-0.28.3/_build\" -I../3rdparty/libprocess/3rdparty/gmock-1.7.0/gtest/include -I../3rdparty/libprocess/3rdparty/gmock-1.7.0/include -DTESTLIBEXECDIR=\"/mesos/mesos-0.28.3/_inst/libexec/mesos/tests\" -DSBINDIR=\"/mesos/mesos-0.28.3/_inst/sbin\" -I/usr/lib/jvm/java-7-openjdk-amd64/include -I/usr/lib/jvm/java-7-openjdk-amd64/include/linux -DZOOKEEPER_VERSION=\"3.4.5\" -I/usr/include/subversion-1 -I/usr/include/apr-1 -I/usr/include/apr-1.0  -pthread -g1 -O0 -std=c++11 -MT tests/mesos_tests-master_slave_reconciliation_tests.o -MD -MP -MF tests/.deps/mesos_tests-master_slave_reconciliation_tests.Tpo -c -o tests/mesos_tests-master_slave_reconciliation_tests.o `test -f 'tests/master_slave_reconciliation_tests.cpp' || echo '../../src/'`tests/master_slave_reconciliation_tests.cpp
mv -f tests/.deps/mesos_tests-main.Tpo tests/.deps/mesos_tests-main.Po
clang++ -DPACKAGE_NAME=\"mesos\" -DPACKAGE_TARNAME=\"mesos\" -DPACKAGE_VERSION=\"0.28.3\" -DPACKAGE_STRING=\"mesos\ 0.28.3\" -DPACKAGE_BUGREPORT=\"\" -DPACKAGE_URL=\"\" -DPACKAGE=\"mesos\" -DVERSION=\"0.28.3\" -DSTDC_HEADERS=1 -DHAVE_SYS_TYPES_H=1 -DHAVE_SYS_STAT_H=1 -DHAVE_STDLIB_H=1 -DHAVE_STRING_H=1 -DHAVE_MEMORY_H=1 -DHAVE_STRINGS_H=1 -DHAVE_INTTYPES_H=1 -DHAVE_STDINT_H=1 -DHAVE_UNISTD_H=1 -DHAVE_DLFCN_H=1 -DLT_OBJDIR=\".libs/\" -DHAVE_PTHREAD_PRIO_INHERIT=1 -DHAVE_PTHREAD=1 -DHAVE_LIBZ=1 -DHAVE_LIBCURL=1 -DHAVE_APR_POOLS_H=1 -DHAVE_LIBAPR_1=1 -DHAVE_SVN_VERSION_H=1 -DHAVE_LIBSVN_SUBR_1=1 -DHAVE_SVN_DELTA_H=1 -DHAVE_LIBSVN_DELTA_1=1 -DHAVE_LIBSASL2=1 -DMESOS_HAS_JAVA=1 -DHAVE_PYTHON=\"2.7\" -DMESOS_HAS_PYTHON=1 -DHAVE_EVENT2_EVENT_H=1 -DHAVE_LIBEVENT=1 -DHAVE_EVENT2_THREAD_H=1 -DHAVE_LIBEVENT_PTHREADS=1 -DHAVE_OPENSSL_SSL_H=1 -DHAVE_LIBSSL=1 -DHAVE_LIBCRYPTO=1 -DHAVE_EVENT2_BUFFEREVENT_SSL_H=1 -DHAVE_LIBEVENT_OPENSSL=1 -DUSE_SSL_SOCKET=1 -I. -I../../src   -Wall -Werror -DLIBDIR=\"/mesos/mesos-0.28.3/_inst/lib\" -DPKGLIBEXECDIR=\"/mesos/mesos-0.28.3/_inst/libexec/mesos\" -DPKGDATADIR=\"/mesos/mesos-0.28.3/_inst/share/mesos\" -DPKGMODULEDIR=\"/mesos/mesos-0.28.3/_inst/lib/mesos/modules\" -I../../include -I../../3rdparty/libprocess/include -I../../3rdparty/libprocess/3rdparty/stout/include -I../include -I../include/mesos -isystem ../3rdparty/libprocess/3rdparty/boost-1.53.0 -I../3rdparty/libprocess/3rdparty/picojson-1.3.0 -DPICOJSON_USE_INT64 -D__STDC_FORMAT_MACROS -I../3rdparty/libprocess/3rdparty/protobuf-2.5.0/src -I../3rdparty/libprocess/3rdparty/glog-0.3.3/src -I../3rdparty/libprocess/3rdparty/glog-0.3.3/src -I../3rdparty/leveldb-1.4/include -I../3rdparty/zookeeper-3.4.5/src/c/include -I../3rdparty/zookeeper-3.4.5/src/c/generated -I../3rdparty/libprocess/3rdparty/protobuf-2.5.0/src -DSOURCE_DIR=\"/mesos/mesos-0.28.3/_build/..\" -DBUILD_DIR=\"/mesos/mesos-0.28.3/_build\" -I../3rdparty/libprocess/3rdparty/gmock-1.7.0/gtest/include -I../3rdparty/libprocess/3rdparty/gmock-1.7.0/include -DTESTLIBEXECDIR=\"/mesos/mesos-0.28.3/_inst/libexec/mesos/tests\" -DSBINDIR=\"/mesos/mesos-0.28.3/_inst/sbin\" -I/usr/lib/jvm/java-7-openjdk-amd64/include -I/usr/lib/jvm/java-7-openjdk-amd64/include/linux -DZOOKEEPER_VERSION=\"3.4.5\" -I/usr/include/subversion-1 -I/usr/include/apr-1 -I/usr/include/apr-1.0  -pthread -g1 -O0 -std=c++11 -MT tests/mesos_tests-master_tests.o -MD -MP -MF tests/.deps/mesos_tests-master_tests.Tpo -c -o tests/mesos_tests-master_tests.o `test -f 'tests/master_tests.cpp' || echo '../../src/'`tests/master_tests.cpp
mv -f tests/.deps/mesos_tests-log_tests.Tpo tests/.deps/mesos_tests-log_tests.Po
clang++ -DPACKAGE_NAME=\"mesos\" -DPACKAGE_TARNAME=\"mesos\" -DPACKAGE_VERSION=\"0.28.3\" -DPACKAGE_STRING=\"mesos\ 0.28.3\" -DPACKAGE_BUGREPORT=\"\" -DPACKAGE_URL=\"\" -DPACKAGE=\"mesos\" -DVERSION=\"0.28.3\" -DSTDC_HEADERS=1 -DHAVE_SYS_TYPES_H=1 -DHAVE_SYS_STAT_H=1 -DHAVE_STDLIB_H=1 -DHAVE_STRING_H=1 -DHAVE_MEMORY_H=1 -DHAVE_STRINGS_H=1 -DHAVE_INTTYPES_H=1 -DHAVE_STDINT_H=1 -DHAVE_UNISTD_H=1 -DHAVE_DLFCN_H=1 -DLT_OBJDIR=\".libs/\" -DHAVE_PTHREAD_PRIO_INHERIT=1 -DHAVE_PTHREAD=1 -DHAVE_LIBZ=1 -DHAVE_LIBCURL=1 -DHAVE_APR_POOLS_H=1 -DHAVE_LIBAPR_1=1 -DHAVE_SVN_VERSION_H=1 -DHAVE_LIBSVN_SUBR_1=1 -DHAVE_SVN_DELTA_H=1 -DHAVE_LIBSVN_DELTA_1=1 -DHAVE_LIBSASL2=1 -DMESOS_HAS_JAVA=1 -DHAVE_PYTHON=\"2.7\" -DMESOS_HAS_PYTHON=1 -DHAVE_EVENT2_EVENT_H=1 -DHAVE_LIBEVENT=1 -DHAVE_EVENT2_THREAD_H=1 -DHAVE_LIBEVENT_PTHREADS=1 -DHAVE_OPENSSL_SSL_H=1 -DHAVE_LIBSSL=1 -DHAVE_LIBCRYPTO=1 -DHAVE_EVENT2_BUFFEREVENT_SSL_H=1 -DHAVE_LIBEVENT_OPENSSL=1 -DUSE_SSL_SOCKET=1 -I. -I../../src   -Wall -Werror -DLIBDIR=\"/mesos/mesos-0.28.3/_inst/lib\" -DPKGLIBEXECDIR=\"/mesos/mesos-0.28.3/_inst/libexec/mesos\" -DPKGDATADIR=\"/mesos/mesos-0.28.3/_inst/share/mesos\" -DPKGMODULEDIR=\"/mesos/mesos-0.28.3/_inst/lib/mesos/modules\" -I../../include -I../../3rdparty/libprocess/include -I../../3rdparty/libprocess/3rdparty/stout/include -I../include -I../include/mesos -isystem ../3rdparty/libprocess/3rdparty/boost-1.53.0 -I../3rdparty/libprocess/3rdparty/picojson-1.3.0 -DPICOJSON_USE_INT64 -D__STDC_FORMAT_MACROS -I../3rdparty/libprocess/3rdparty/protobuf-2.5.0/src -I../3rdparty/libprocess/3rdparty/glog-0.3.3/src -I../3rdparty/libprocess/3rdparty/glog-0.3.3/src -I../3rdparty/leveldb-1.4/include -I../3rdparty/zookeeper-3.4.5/src/c/include -I../3rdparty/zookeeper-3.4.5/src/c/generated -I../3rdparty/libprocess/3rdparty/protobuf-2.5.0/src -DSOURCE_DIR=\"/mesos/mesos-0.28.3/_build/..\" -DBUILD_DIR=\"/mesos/mesos-0.28.3/_build\" -I../3rdparty/libprocess/3rdparty/gmock-1.7.0/gtest/include -I../3rdparty/libprocess/3rdparty/gmock-1.7.0/include -DTESTLIBEXECDIR=\"/mesos/mesos-0.28.3/_inst/libexec/mesos/tests\" -DSBINDIR=\"/mesos/mesos-0.28.3/_inst/sbin\" -I/usr/lib/jvm/java-7-openjdk-amd64/include -I/usr/lib/jvm/java-7-openjdk-amd64/include/linux -DZOOKEEPER_VERSION=\"3.4.5\" -I/usr/include/subversion-1 -I/usr/include/apr-1 -I/usr/include/apr-1.0  -pthread -g1 -O0 -std=c++11 -MT tests/mesos_tests-master_validation_tests.o -MD -MP -MF tests/.deps/mesos_tests-master_validation_tests.Tpo -c -o tests/mesos_tests-master_validation_tests.o `test -f 'tests/master_validation_tests.cpp' || echo '../../src/'`tests/master_validation_tests.cpp
mv -f tests/.deps/mesos_tests-master_authorization_tests.Tpo tests/.deps/mesos_tests-master_authorization_tests.Po
clang++ -DPACKAGE_NAME=\"mesos\" -DPACKAGE_TARNAME=\"mesos\" -DPACKAGE_VERSION=\"0.28.3\" -DPACKAGE_STRING=\"mesos\ 0.28.3\" -DPACKAGE_BUGREPORT=\"\" -DPACKAGE_URL=\"\" -DPACKAGE=\"mesos\" -DVERSION=\"0.28.3\" -DSTDC_HEADERS=1 -DHAVE_SYS_TYPES_H=1 -DHAVE_SYS_STAT_H=1 -DHAVE_STDLIB_H=1 -DHAVE_STRING_H=1 -DHAVE_MEMORY_H=1 -DHAVE_STRINGS_H=1 -DHAVE_INTTYPES_H=1 -DHAVE_STDINT_H=1 -DHAVE_UNISTD_H=1 -DHAVE_DLFCN_H=1 -DLT_OBJDIR=\".libs/\" -DHAVE_PTHREAD_PRIO_INHERIT=1 -DHAVE_PTHREAD=1 -DHAVE_LIBZ=1 -DHAVE_LIBCURL=1 -DHAVE_APR_POOLS_H=1 -DHAVE_LIBAPR_1=1 -DHAVE_SVN_VERSION_H=1 -DHAVE_LIBSVN_SUBR_1=1 -DHAVE_SVN_DELTA_H=1 -DHAVE_LIBSVN_DELTA_1=1 -DHAVE_LIBSASL2=1 -DMESOS_HAS_JAVA=1 -DHAVE_PYTHON=\"2.7\" -DMESOS_HAS_PYTHON=1 -DHAVE_EVENT2_EVENT_H=1 -DHAVE_LIBEVENT=1 -DHAVE_EVENT2_THREAD_H=1 -DHAVE_LIBEVENT_PTHREADS=1 -DHAVE_OPENSSL_SSL_H=1 -DHAVE_LIBSSL=1 -DHAVE_LIBCRYPTO=1 -DHAVE_EVENT2_BUFFEREVENT_SSL_H=1 -DHAVE_LIBEVENT_OPENSSL=1 -DUSE_SSL_SOCKET=1 -I. -I../../src   -Wall -Werror -DLIBDIR=\"/mesos/mesos-0.28.3/_inst/lib\" -DPKGLIBEXECDIR=\"/mesos/mesos-0.28.3/_inst/libexec/mesos\" -DPKGDATADIR=\"/mesos/mesos-0.28.3/_inst/share/mesos\" -DPKGMODULEDIR=\"/mesos/mesos-0.28.3/_inst/lib/mesos/modules\" -I../../include -I../../3rdparty/libprocess/include -I../../3rdparty/libprocess/3rdparty/stout/include -I../include -I../include/mesos -isystem ../3rdparty/libprocess/3rdparty/boost-1.53.0 -I../3rdparty/libprocess/3rdparty/picojson-1.3.0 -DPICOJSON_USE_INT64 -D__STDC_FORMAT_MACROS -I../3rdparty/libprocess/3rdparty/protobuf-2.5.0/src -I../3rdparty/libprocess/3rdparty/glog-0.3.3/src -I../3rdparty/libprocess/3rdparty/glog-0.3.3/src -I../3rdparty/leveldb-1.4/include -I../3rdparty/zookeeper-3.4.5/src/c/include -I../3rdparty/zookeeper-3.4.5/src/c/generated -I../3rdparty/libprocess/3rdparty/protobuf-2.5.0/src -DSOURCE_DIR=\"/mesos/mesos-0.28.3/_build/..\" -DBUILD_DIR=\"/mesos/mesos-0.28.3/_build\" -I../3rdparty/libprocess/3rdparty/gmock-1.7.0/gtest/include -I../3rdparty/libprocess/3rdparty/gmock-1.7.0/include -DTESTLIBEXECDIR=\"/mesos/mesos-0.28.3/_inst/libexec/mesos/tests\" -DSBINDIR=\"/mesos/mesos-0.28.3/_inst/sbin\" -I/usr/lib/jvm/java-7-openjdk-amd64/include -I/usr/lib/jvm/java-7-openjdk-amd64/include/linux -DZOOKEEPER_VERSION=\"3.4.5\" -I/usr/include/subversion-1 -I/usr/include/apr-1 -I/usr/include/apr-1.0  -pthread -g1 -O0 -std=c++11 -MT tests/mesos_tests-mesos.o -MD -MP -MF tests/.deps/mesos_tests-mesos.Tpo -c -o tests/mesos_tests-mesos.o `test -f 'tests/mesos.cpp' || echo '../../src/'`tests/mesos.cpp
mv -f tests/.deps/mesos_tests-master_contender_detector_tests.Tpo tests/.deps/mesos_tests-master_contender_detector_tests.Po
clang++ -DPACKAGE_NAME=\"mesos\" -DPACKAGE_TARNAME=\"mesos\" -DPACKAGE_VERSION=\"0.28.3\" -DPACKAGE_STRING=\"mesos\ 0.28.3\" -DPACKAGE_BUGREPORT=\"\" -DPACKAGE_URL=\"\" -DPACKAGE=\"mesos\" -DVERSION=\"0.28.3\" -DSTDC_HEADERS=1 -DHAVE_SYS_TYPES_H=1 -DHAVE_SYS_STAT_H=1 -DHAVE_STDLIB_H=1 -DHAVE_STRING_H=1 -DHAVE_MEMORY_H=1 -DHAVE_STRINGS_H=1 -DHAVE_INTTYPES_H=1 -DHAVE_STDINT_H=1 -DHAVE_UNISTD_H=1 -DHAVE_DLFCN_H=1 -DLT_OBJDIR=\".libs/\" -DHAVE_PTHREAD_PRIO_INHERIT=1 -DHAVE_PTHREAD=1 -DHAVE_LIBZ=1 -DHAVE_LIBCURL=1 -DHAVE_APR_POOLS_H=1 -DHAVE_LIBAPR_1=1 -DHAVE_SVN_VERSION_H=1 -DHAVE_LIBSVN_SUBR_1=1 -DHAVE_SVN_DELTA_H=1 -DHAVE_LIBSVN_DELTA_1=1 -DHAVE_LIBSASL2=1 -DMESOS_HAS_JAVA=1 -DHAVE_PYTHON=\"2.7\" -DMESOS_HAS_PYTHON=1 -DHAVE_EVENT2_EVENT_H=1 -DHAVE_LIBEVENT=1 -DHAVE_EVENT2_THREAD_H=1 -DHAVE_LIBEVENT_PTHREADS=1 -DHAVE_OPENSSL_SSL_H=1 -DHAVE_LIBSSL=1 -DHAVE_LIBCRYPTO=1 -DHAVE_EVENT2_BUFFEREVENT_SSL_H=1 -DHAVE_LIBEVENT_OPENSSL=1 -DUSE_SSL_SOCKET=1 -I. -I../../src   -Wall -Werror -DLIBDIR=\"/mesos/mesos-0.28.3/_inst/lib\" -DPKGLIBEXECDIR=\"/mesos/mesos-0.28.3/_inst/libexec/mesos\" -DPKGDATADIR=\"/mesos/mesos-0.28.3/_inst/share/mesos\" -DPKGMODULEDIR=\"/mesos/mesos-0.28.3/_inst/lib/mesos/modules\" -I../../include -I../../3rdparty/libprocess/include -I../../3rdparty/libprocess/3rdparty/stout/include -I../include -I../include/mesos -isystem ../3rdparty/libprocess/3rdparty/boost-1.53.0 -I../3rdparty/libprocess/3rdparty/picojson-1.3.0 -DPICOJSON_USE_INT64 -D__STDC_FORMAT_MACROS -I../3rdparty/libprocess/3rdparty/protobuf-2.5.0/src -I../3rdparty/libprocess/3rdparty/glog-0.3.3/src -I../3rdparty/libprocess/3rdparty/glog-0.3.3/src -I../3rdparty/leveldb-1.4/include -I../3rdparty/zookeeper-3.4.5/src/c/include -I../3rdparty/zookeeper-3.4.5/src/c/generated -I../3rdparty/libprocess/3rdparty/protobuf-2.5.0/src -DSOURCE_DIR=\"/mesos/mesos-0.28.3/_build/..\" -DBUILD_DIR=\"/mesos/mesos-0.28.3/_build\" -I../3rdparty/libprocess/3rdparty/gmock-1.7.0/gtest/include -I../3rdparty/libprocess/3rdparty/gmock-1.7.0/include -DTESTLIBEXECDIR=\"/mesos/mesos-0.28.3/_inst/libexec/mesos/tests\" -DSBINDIR=\"/mesos/mesos-0.28.3/_inst/sbin\" -I/usr/lib/jvm/java-7-openjdk-amd64/include -I/usr/lib/jvm/java-7-openjdk-amd64/include/linux -DZOOKEEPER_VERSION=\"3.4.5\" -I/usr/include/subversion-1 -I/usr/include/apr-1 -I/usr/include/apr-1.0  -pthread -g1 -O0 -std=c++11 -MT tests/mesos_tests-metrics_tests.o -MD -MP -MF tests/.deps/mesos_tests-metrics_tests.Tpo -c -o tests/mesos_tests-metrics_tests.o `test -f 'tests/metrics_tests.cpp' || echo '../../src/'`tests/metrics_tests.cpp
../../src/tests/master_validation_tests.cpp:275:15: error: no matching function for call to 'validate'
  EXPECT_SOME(operation::validate(reserve, None()));
              ^~~~~~~~~~~~~~~~~~~
../../3rdparty/libprocess/3rdparty/stout/include/stout/gtest.hpp:125:35: note: expanded from macro 'EXPECT_SOME'
  EXPECT_PRED_FORMAT1(AssertSome, actual)
                                  ^
../3rdparty/libprocess/3rdparty/gmock-1.7.0/gtest/include/gtest/gtest_pred_impl.h:114:36: note: expanded from macro 'EXPECT_PRED_FORMAT1'
  GTEST_PRED_FORMAT1_(pred_format, v1, GTEST_NONFATAL_FAILURE_)
                                   ^
../3rdparty/libprocess/3rdparty/gmock-1.7.0/gtest/include/gtest/gtest_pred_impl.h:101:34: note: expanded from macro 'GTEST_PRED_FORMAT1_'
  GTEST_ASSERT_(pred_format(#v1, v1), \
                                 ^
../3rdparty/libprocess/3rdparty/gmock-1.7.0/gtest/include/gtest/gtest_pred_impl.h:77:52: note: expanded from macro 'GTEST_ASSERT_'
  if (const ::testing::AssertionResult gtest_ar = (expression)) \
                                                   ^
../../src/master/validation.hpp:118:15: note: candidate function not viable: no known conversion from 'Offer::Operation::Reserve' (aka 'mesos::Offer_Operation_Reserve') to 'const Offer::Operation::Create' (aka 'const mesos::Offer_Operation_Create') for 1st argument
Option<Error> validate(
              ^
../../src/master/validation.hpp:125:15: note: candidate function not viable: no known conversion from 'Offer::Operation::Reserve' (aka 'mesos::Offer_Operation_Reserve') to 'const Offer::Operation::Destroy' (aka 'const mesos::Offer_Operation_Destroy') for 1st argument
Option<Error> validate(
              ^
../../src/master/validation.hpp:106:15: note: candidate function not viable: requires 3 arguments, but 2 were provided
Option<Error> validate(
              ^
../../src/master/validation.hpp:113:15: note: candidate function not viable: requires single argument 'unreserve', but 2 arguments were provided
Option<Error> validate(const Offer::Operation::Unreserve& unreserve);
              ^
mv -f tests/.deps/mesos_tests-master_allocator_tests.Tpo tests/.deps/mesos_tests-master_allocator_tests.Po
clang++ -DPACKAGE_NAME=\"mesos\" -DPACKAGE_TARNAME=\"mesos\" -DPACKAGE_VERSION=\"0.28.3\" -DPACKAGE_STRING=\"mesos\ 0.28.3\" -DPACKAGE_BUGREPORT=\"\" -DPACKAGE_URL=\"\" -DPACKAGE=\"mesos\" -DVERSION=\"0.28.3\" -DSTDC_HEADERS=1 -DHAVE_SYS_TYPES_H=1 -DHAVE_SYS_STAT_H=1 -DHAVE_STDLIB_H=1 -DHAVE_STRING_H=1 -DHAVE_MEMORY_H=1 -DHAVE_STRINGS_H=1 -DHAVE_INTTYPES_H=1 -DHAVE_STDINT_H=1 -DHAVE_UNISTD_H=1 -DHAVE_DLFCN_H=1 -DLT_OBJDIR=\".libs/\" -DHAVE_PTHREAD_PRIO_INHERIT=1 -DHAVE_PTHREAD=1 -DHAVE_LIBZ=1 -DHAVE_LIBCURL=1 -DHAVE_APR_POOLS_H=1 -DHAVE_LIBAPR_1=1 -DHAVE_SVN_VERSION_H=1 -DHAVE_LIBSVN_SUBR_1=1 -DHAVE_SVN_DELTA_H=1 -DHAVE_LIBSVN_DELTA_1=1 -DHAVE_LIBSASL2=1 -DMESOS_HAS_JAVA=1 -DHAVE_PYTHON=\"2.7\" -DMESOS_HAS_PYTHON=1 -DHAVE_EVENT2_EVENT_H=1 -DHAVE_LIBEVENT=1 -DHAVE_EVENT2_THREAD_H=1 -DHAVE_LIBEVENT_PTHREADS=1 -DHAVE_OPENSSL_SSL_H=1 -DHAVE_LIBSSL=1 -DHAVE_LIBCRYPTO=1 -DHAVE_EVENT2_BUFFEREVENT_SSL_H=1 -DHAVE_LIBEVENT_OPENSSL=1 -DUSE_SSL_SOCKET=1 -I. -I../../src   -Wall -Werror -DLIBDIR=\"/mesos/mesos-0.28.3/_inst/lib\" -DPKGLIBEXECDIR=\"/mesos/mesos-0.28.3/_inst/libexec/mesos\" -DPKGDATADIR=\"/mesos/mesos-0.28.3/_inst/share/mesos\" -DPKGMODULEDIR=\"/mesos/mesos-0.28.3/_inst/lib/mesos/modules\" -I../../include -I../../3rdparty/libprocess/include -I../../3rdparty/libprocess/3rdparty/stout/include -I../include -I../include/mesos -isystem ../3rdparty/libprocess/3rdparty/boost-1.53.0 -I../3rdparty/libprocess/3rdparty/picojson-1.3.0 -DPICOJSON_USE_INT64 -D__STDC_FORMAT_MACROS -I../3rdparty/libprocess/3rdparty/protobuf-2.5.0/src -I../3rdparty/libprocess/3rdparty/glog-0.3.3/src -I../3rdparty/libprocess/3rdparty/glog-0.3.3/src -I../3rdparty/leveldb-1.4/include -I../3rdparty/zookeeper-3.4.5/src/c/include -I../3rdparty/zookeeper-3.4.5/src/c/generated -I../3rdparty/libprocess/3rdparty/protobuf-2.5.0/src -DSOURCE_DIR=\"/mesos/mesos-0.28.3/_build/..\" -DBUILD_DIR=\"/mesos/mesos-0.28.3/_build\" -I../3rdparty/libprocess/3rdparty/gmock-1.7.0/gtest/include -I../3rdparty/libprocess/3rdparty/gmock-1.7.0/include -DTESTLIBEXECDIR=\"/mesos/mesos-0.28.3/_inst/libexec/mesos/tests\" -DSBINDIR=\"/mesos/mesos-0.28.3/_inst/sbin\" -I/usr/lib/jvm/java-7-openjdk-amd64/include -I/usr/lib/jvm/java-7-openjdk-amd64/include/linux -DZOOKEEPER_VERSION=\"3.4.5\" -I/usr/include/subversion-1 -I/usr/include/apr-1 -I/usr/include/apr-1.0  -pthread -g1 -O0 -std=c++11 -MT tests/mesos_tests-module.o -MD -MP -MF tests/.deps/mesos_tests-module.Tpo -c -o tests/mesos_tests-module.o `test -f 'tests/module.cpp' || echo '../../src/'`tests/module.cpp
1 error generated.
make[4]: *** [tests/mesos_tests-master_validation_tests.o] Error 1
make[4]: *** Waiting for unfinished jobs....
mv -f tests/.deps/mesos_tests-master_maintenance_tests.Tpo tests/.deps/mesos_tests-master_maintenance_tests.Po
mv -f tests/.deps/mesos_tests-master_quota_tests.Tpo tests/.deps/mesos_tests-master_quota_tests.Po
mv -f tests/.deps/mesos_tests-master_slave_reconciliation_tests.Tpo tests/.deps/mesos_tests-master_slave_reconciliation_tests.Po
mv -f tests/.deps/mesos_tests-metrics_tests.Tpo tests/.deps/mesos_tests-metrics_tests.Po
mv -f tests/.deps/mesos_tests-module.Tpo tests/.deps/mesos_tests-module.Po
mv -f tests/.deps/mesos_tests-master_tests.Tpo tests/.deps/mesos_tests-master_tests.Po
mv -f tests/.deps/mesos_tests-mesos.Tpo tests/.deps/mesos_tests-mesos.Po
make[4]: Leaving directory `/mesos/mesos-0.28.3/_build/src'
make[3]: *** [check-am] Error 2
make[3]: Leaving directory `/mesos/mesos-0.28.3/_build/src'
make[2]: *** [check] Error 2
make[2]: Leaving directory `/mesos/mesos-0.28.3/_build/src'
make[1]: Leaving directory `/mesos/mesos-0.28.3/_build'
make[1]: *** [check-recursive] Error 1
make: *** [distcheck] Error 1
+ docker rmi mesos-1478647271-301
Untagged: mesos-1478647271-301:latest
Deleted: sha256:c9e06e248599051923f97a2a39127d392da9681954a21f83cffe263b7c1681f7
Deleted: sha256:098240f3abe4155d4333cffc2266f1ac84d940bec1708568dfd83502754baf09
Deleted: sha256:6ef142a719b6680326b176f93eed5cd7b16bde4113ce91cecad6497e2ce29bf0
Deleted: sha256:62f994b25de0ca14a1586d924a43d709531f9a81d40f62cd924c352ed1b2c1eb
Deleted: sha256:0e4787144709317400272710c526cc2c879f1f5511b0cefea79fec1bb59263f5
Deleted: sha256:2c5f98525b03c6164b997527d6ecbd8b45188c22b8be4158a7ea0d126342c448
Deleted: sha256:e9e5b08037afe9269f1b3cd43a0202264de7c3ac6078ce571a6aea6509b90e5f
Deleted: sha256:ebbc208252f6944126df51c4e3817bb3102de464d182ad9f1a5f6b3a5df07b59
Deleted: sha256:203eadd637a2503fcec88c68ddc2bcf1d3883e71b15adc79732814b9193005e7
Deleted: sha256:8df450ed700e3c01cb2e0dc6cd819a20b1aabd3752774b5ebaa3a44ae7b84194
Deleted: sha256:d206b3fb01b9fcaff216c964139c836a25298b687a8ab978761493b5cfcf33b2
Deleted: sha256:95af3cfce681a7d969c77b6dbf6811b8e1b83a3bdf45da9909a316283172eabc
Deleted: sha256:0b552bb668b7d46aa3077db4c5dadf5a844b4e0ec9bd113e36a8b5275ff2c86a
Deleted: sha256:0091890792000f53141f55ba66631132bb12bcd5c25b4d2bda3e7e66840f884e
Deleted: sha256:fbad082f200528b6e3ce1e0c8f66ad084c89021be2b13936f5c9de0dba3b774a
Deleted: sha256:cdaac4ce8bdc406ca6345637ad90cb064b1d284dfcf8ad35f5cbcded061805a9
Deleted: sha256:185cfefb41ec6080cf188939c0731681ea184f44d187ad28ead2ee803319dd36
Deleted: sha256:84d5307cd995eda03906bccff41f817eeb6ab52ef99d2d7c75e2c227a423063b
Deleted: sha256:942195a0d41d6766e5c933cc7a4c3262aaa07da3927c25c5aaa59e7da0699979
Deleted: sha256:6c72a82d458fe0e1e021d308c65a38a063ff10a793258939426899be6fc53354
Deleted: sha256:004c305a1944f6f47945f8ce20f78436ecc69f08192f0289aafe739a8752eb59
Deleted: sha256:4c347b0af73c03fdbdde08dd278b863b8dd5ec95817c72b07418d8cb82382a41
Deleted: sha256:525388b28f588f79f6956739191d7f68493d0d54fe309066d18bff80b5ec9104
Build step 'Execute shell' marked build as failure

Mime
View raw message