mesos-builds mailing list archives

Site index · List index
Message view « Date » · « Thread »
Top « Date » · « Thread »
From Apache Jenkins Server <jenk...@builds.apache.org>
Subject Build failed in Jenkins: Mesos » autotools,gcc,--verbose,GLOG_v=1 MESOS_VERBOSE=1,ubuntu:14.04,(docker||Hadoop)&&(!ubuntu-us1)&&(!ubuntu-6)&&(!ubuntu-eu2) #2927
Date Mon, 14 Nov 2016 15:15:04 GMT
See <https://builds.apache.org/job/Mesos/BUILDTOOL=autotools,COMPILER=gcc,CONFIGURATION=--verbose,ENVIRONMENT=GLOG_v=1%20MESOS_VERBOSE=1,OS=ubuntu%3A14.04,label_exp=(docker%7C%7CHadoop)&&(!ubuntu-us1)&&(!ubuntu-6)&&(!ubuntu-eu2)/2927/changes>

Changes:

[alexr] Added Stephen Hankinson to contributors list.

------------------------------------------
[...truncated 217950 lines...]
W1114 15:12:51.346067 29705 backend.cpp:76] Failed to create 'aufs' backend: AufsBackend requires
root privileges, but is running as user mesos
W1114 15:12:51.346251 29705 backend.cpp:76] Failed to create 'bind' backend: BindBackend requires
root privileges
I1114 15:12:51.349252 29725 slave.cpp:208] Mesos agent started on (644)@172.17.0.2:42526
I1114 15:12:51.349301 29725 slave.cpp:209] Flags at startup: --acls="" --appc_simple_discovery_uri_prefix="http://"
--appc_store_dir="/tmp/mesos/store/appc" --authenticate_http_readonly="true" --authenticate_http_readwrite="true"
--authenticatee="crammd5" --authentication_backoff_factor="1secs" --authorizer="local" --cgroups_cpu_enable_pids_and_tids_count="false"
--cgroups_enable_cfs="false" --cgroups_hierarchy="/sys/fs/cgroup" --cgroups_limit_swap="false"
--cgroups_root="mesos" --container_disk_watch_interval="15secs" --containerizers="mesos" --credential="/tmp/Endpoint_SlaveEndpointTest_AuthorizedRequest_1_GP9on5/credential"
--default_role="*" --disk_watch_interval="1mins" --docker="docker" --docker_kill_orphans="true"
--docker_registry="https://registry-1.docker.io" --docker_remove_delay="6hrs" --docker_socket="/var/run/docker.sock"
--docker_stop_timeout="0ns" --docker_store_dir="/tmp/mesos/store/docker" --docker_volume_checkpoint_dir="/var/run/mesos/isolators/docker/volume"
--enforce_container_disk_quota="false" --executor_registration_timeout="1mins" --executor_shutdown_grace_period="5secs"
--fetcher_cache_dir="/tmp/Endpoint_SlaveEndpointTest_AuthorizedRequest_1_GP9on5/fetch" --fetcher_cache_size="2GB"
--frameworks_home="" --gc_delay="1weeks" --gc_disk_headroom="0.1" --hadoop_home="" --help="false"
--hostname_lookup="true" --http_authenticators="basic" --http_command_executor="false" --http_credentials="/tmp/Endpoint_SlaveEndpointTest_AuthorizedRequest_1_GP9on5/http_credentials"
--image_provisioner_backend="copy" --initialize_driver_logging="true" --isolation="posix/cpu,posix/mem"
--launcher="posix" --launcher_dir="/mesos/mesos-1.2.0/_build/src" --logbufsecs="0" --logging_level="INFO"
--max_completed_executors_per_framework="150" --oversubscribed_resources_interval="15secs"
--perf_duration="10secs" --perf_interval="1mins" --qos_correction_interval_min="0ns" --quiet="false"
--recover="reconnect" --recovery_timeout="15mins" --registration_backoff_factor="10ms" --resources="cpus:2;gpus:0;mem:1024;disk:1024;ports:[31000-32000]"
--revocable_cpu_low_priority="true" --runtime_dir="/tmp/Endpoint_SlaveEndpointTest_AuthorizedRequest_1_GP9on5"
--sandbox_directory="/mnt/mesos/sandbox" --strict="true" --switch_user="true" --systemd_enable_support="true"
--systemd_runtime_directory="/run/systemd/system" --version="false" --work_dir="/tmp/Endpoint_SlaveEndpointTest_AuthorizedRequest_1_BKwNhG"
I1114 15:12:51.350101 29725 credentials.hpp:86] Loading credential for authentication from
'/tmp/Endpoint_SlaveEndpointTest_AuthorizedRequest_1_GP9on5/credential'
I1114 15:12:51.350287 29725 slave.cpp:346] Agent using credential for: test-principal
I1114 15:12:51.350318 29725 credentials.hpp:37] Loading credentials for authentication from
'/tmp/Endpoint_SlaveEndpointTest_AuthorizedRequest_1_GP9on5/http_credentials'
I1114 15:12:51.350646 29725 http.cpp:895] Using default 'basic' HTTP authenticator for realm
'mesos-agent-readonly'
I1114 15:12:51.350782 29725 http.cpp:895] Using default 'basic' HTTP authenticator for realm
'mesos-agent-readwrite'
I1114 15:12:51.351857 29725 slave.cpp:533] Agent resources: cpus(*):2; mem(*):1024; disk(*):1024;
ports(*):[31000-32000]
I1114 15:12:51.351932 29725 slave.cpp:541] Agent attributes: [  ]
I1114 15:12:51.351943 29725 slave.cpp:546] Agent hostname: 1d306c0eb601
I1114 15:12:51.353406 29731 state.cpp:57] Recovering state from '/tmp/Endpoint_SlaveEndpointTest_AuthorizedRequest_1_BKwNhG/meta'
I1114 15:12:51.353881 29733 status_update_manager.cpp:203] Recovering status update manager
I1114 15:12:51.354140 29726 containerizer.cpp:561] Recovering containerizer
I1114 15:12:51.355679 29738 provisioner.cpp:253] Provisioner recovery complete
I1114 15:12:51.356206 29737 slave.cpp:5411] Finished recovery
I1114 15:12:51.356756 29737 slave.cpp:5585] Querying resource estimator for oversubscribable
resources
I1114 15:12:51.357163 29736 slave.cpp:5599] Received oversubscribable resources {} from the
resource estimator
I1114 15:12:51.359403 29728 process.cpp:3570] Handling HTTP event for process 'slave(644)'
with path: '/slave(644)/monitor/statistics.json'
I1114 15:12:51.360512 29737 http.cpp:847] Authorizing principal 'test-principal' to GET the
'/monitor/statistics.json' endpoint
I1114 15:12:51.364368 29724 slave.cpp:787] Agent terminating
[       OK ] Endpoint/SlaveEndpointTest.AuthorizedRequest/1 (28 ms)
[ RUN      ] Endpoint/SlaveEndpointTest.AuthorizedRequest/2
I1114 15:12:51.376037 29705 containerizer.cpp:202] Using isolation: posix/cpu,posix/mem,filesystem/posix,network/cni
W1114 15:12:51.376600 29705 backend.cpp:76] Failed to create 'aufs' backend: AufsBackend requires
root privileges, but is running as user mesos
W1114 15:12:51.376729 29705 backend.cpp:76] Failed to create 'bind' backend: BindBackend requires
root privileges
I1114 15:12:51.379911 29728 slave.cpp:208] Mesos agent started on (645)@172.17.0.2:42526
I1114 15:12:51.379946 29728 slave.cpp:209] Flags at startup: --acls="" --appc_simple_discovery_uri_prefix="http://"
--appc_store_dir="/tmp/mesos/store/appc" --authenticate_http_readonly="true" --authenticate_http_readwrite="true"
--authenticatee="crammd5" --authentication_backoff_factor="1secs" --authorizer="local" --cgroups_cpu_enable_pids_and_tids_count="false"
--cgroups_enable_cfs="false" --cgroups_hierarchy="/sys/fs/cgroup" --cgroups_limit_swap="false"
--cgroups_root="mesos" --container_disk_watch_interval="15secs" --containerizers="mesos" --credential="/tmp/Endpoint_SlaveEndpointTest_AuthorizedRequest_2_qRXb0H/credential"
--default_role="*" --disk_watch_interval="1mins" --docker="docker" --docker_kill_orphans="true"
--docker_registry="https://registry-1.docker.io" --docker_remove_delay="6hrs" --docker_socket="/var/run/docker.sock"
--docker_stop_timeout="0ns" --docker_store_dir="/tmp/mesos/store/docker" --docker_volume_checkpoint_dir="/var/run/mesos/isolators/docker/volume"
--enforce_container_disk_quota="false" --executor_registration_timeout="1mins" --executor_shutdown_grace_period="5secs"
--fetcher_cache_dir="/tmp/Endpoint_SlaveEndpointTest_AuthorizedRequest_2_qRXb0H/fetch" --fetcher_cache_size="2GB"
--frameworks_home="" --gc_delay="1weeks" --gc_disk_headroom="0.1" --hadoop_home="" --help="false"
--hostname_lookup="true" --http_authenticators="basic" --http_command_executor="false" --http_credentials="/tmp/Endpoint_SlaveEndpointTest_AuthorizedRequest_2_qRXb0H/http_credentials"
--image_provisioner_backend="copy" --initialize_driver_logging="true" --isolation="posix/cpu,posix/mem"
--launcher="posix" --launcher_dir="/mesos/mesos-1.2.0/_build/src" --logbufsecs="0" --logging_level="INFO"
--max_completed_executors_per_framework="150" --oversubscribed_resources_interval="15secs"
--perf_duration="10secs" --perf_interval="1mins" --qos_correction_interval_min="0ns" --quiet="false"
--recover="reconnect" --recovery_timeout="15mins" --registration_backoff_factor="10ms" --resources="cpus:2;gpus:0;mem:1024;disk:1024;ports:[31000-32000]"
--revocable_cpu_low_priority="true" --runtime_dir="/tmp/Endpoint_SlaveEndpointTest_AuthorizedRequest_2_qRXb0H"
--sandbox_directory="/mnt/mesos/sandbox" --strict="true" --switch_user="true" --systemd_enable_support="true"
--systemd_runtime_directory="/run/systemd/system" --version="false" --work_dir="/tmp/Endpoint_SlaveEndpointTest_AuthorizedRequest_2_T8NHPi"
I1114 15:12:51.380668 29728 credentials.hpp:86] Loading credential for authentication from
'/tmp/Endpoint_SlaveEndpointTest_AuthorizedRequest_2_qRXb0H/credential'
I1114 15:12:51.380841 29728 slave.cpp:346] Agent using credential for: test-principal
I1114 15:12:51.380867 29728 credentials.hpp:37] Loading credentials for authentication from
'/tmp/Endpoint_SlaveEndpointTest_AuthorizedRequest_2_qRXb0H/http_credentials'
I1114 15:12:51.381151 29728 http.cpp:895] Using default 'basic' HTTP authenticator for realm
'mesos-agent-readonly'
I1114 15:12:51.381291 29728 http.cpp:895] Using default 'basic' HTTP authenticator for realm
'mesos-agent-readwrite'
I1114 15:12:51.382830 29728 slave.cpp:533] Agent resources: cpus(*):2; mem(*):1024; disk(*):1024;
ports(*):[31000-32000]
I1114 15:12:51.382933 29728 slave.cpp:541] Agent attributes: [  ]
I1114 15:12:51.382951 29728 slave.cpp:546] Agent hostname: 1d306c0eb601
I1114 15:12:51.384868 29739 state.cpp:57] Recovering state from '/tmp/Endpoint_SlaveEndpointTest_AuthorizedRequest_2_T8NHPi/meta'
I1114 15:12:51.385263 29731 status_update_manager.cpp:203] Recovering status update manager
I1114 15:12:51.385506 29733 containerizer.cpp:561] Recovering containerizer
I1114 15:12:51.387192 29733 provisioner.cpp:253] Provisioner recovery complete
I1114 15:12:51.387717 29728 slave.cpp:5411] Finished recovery
I1114 15:12:51.388376 29728 slave.cpp:5585] Querying resource estimator for oversubscribable
resources
I1114 15:12:51.388662 29726 slave.cpp:5599] Received oversubscribable resources {} from the
resource estimator
I1114 15:12:51.390681 29726 process.cpp:3570] Handling HTTP event for process 'slave(645)'
with path: '/slave(645)/containers'
I1114 15:12:51.391799 29729 http.cpp:847] Authorizing principal 'test-principal' to GET the
'/containers' endpoint
I1114 15:12:51.395887 29732 slave.cpp:787] Agent terminating
[       OK ] Endpoint/SlaveEndpointTest.AuthorizedRequest/2 (31 ms)
[ RUN      ] Endpoint/SlaveEndpointTest.UnauthorizedRequest/0
I1114 15:12:51.407119 29705 containerizer.cpp:202] Using isolation: posix/cpu,posix/mem,filesystem/posix,network/cni
W1114 15:12:51.407690 29705 backend.cpp:76] Failed to create 'aufs' backend: AufsBackend requires
root privileges, but is running as user mesos
W1114 15:12:51.407831 29705 backend.cpp:76] Failed to create 'bind' backend: BindBackend requires
root privileges
I1114 15:12:51.410600 29733 slave.cpp:208] Mesos agent started on (646)@172.17.0.2:42526
I1114 15:12:51.410619 29733 slave.cpp:209] Flags at startup: --acls="" --appc_simple_discovery_uri_prefix="http://"
--appc_store_dir="/tmp/mesos/store/appc" --authenticate_http_readonly="true" --authenticate_http_readwrite="true"
--authenticatee="crammd5" --authentication_backoff_factor="1secs" --authorizer="local" --cgroups_cpu_enable_pids_and_tids_count="false"
--cgroups_enable_cfs="false" --cgroups_hierarchy="/sys/fs/cgroup" --cgroups_limit_swap="false"
--cgroups_root="mesos" --container_disk_watch_interval="15secs" --containerizers="mesos" --credential="/tmp/Endpoint_SlaveEndpointTest_UnauthorizedRequest_0_OkIpXk/credential"
--default_role="*" --disk_watch_interval="1mins" --docker="docker" --docker_kill_orphans="true"
--docker_registry="https://registry-1.docker.io" --docker_remove_delay="6hrs" --docker_socket="/var/run/docker.sock"
--docker_stop_timeout="0ns" --docker_store_dir="/tmp/mesos/store/docker" --docker_volume_checkpoint_dir="/var/run/mesos/isolators/docker/volume"
--enforce_container_disk_quota="false" --executor_registration_timeout="1mins" --executor_shutdown_grace_period="5secs"
--fetcher_cache_dir="/tmp/Endpoint_SlaveEndpointTest_UnauthorizedRequest_0_OkIpXk/fetch" --fetcher_cache_size="2GB"
--frameworks_home="" --gc_delay="1weeks" --gc_disk_headroom="0.1" --hadoop_home="" --help="false"
--hostname_lookup="true" --http_authenticators="basic" --http_command_executor="false" --http_credentials="/tmp/Endpoint_SlaveEndpointTest_UnauthorizedRequest_0_OkIpXk/http_credentials"
--image_provisioner_backend="copy" --initialize_driver_logging="true" --isolation="posix/cpu,posix/mem"
--launcher="posix" --launcher_dir="/mesos/mesos-1.2.0/_build/src" --logbufsecs="0" --logging_level="INFO"
--max_completed_executors_per_framework="150" --oversubscribed_resources_interval="15secs"
--perf_duration="10secs" --perf_interval="1mins" --qos_correction_interval_min="0ns" --quiet="false"
--recover="reconnect" --recovery_timeout="15mins" --registration_backoff_factor="10ms" --resources="cpus:2;gpus:0;mem:1024;disk:1024;ports:[31000-32000]"
--revocable_cpu_low_priority="true" --runtime_dir="/tmp/Endpoint_SlaveEndpointTest_UnauthorizedRequest_0_OkIpXk"
--sandbox_directory="/mnt/mesos/sandbox" --strict="true" --switch_user="true" --systemd_enable_support="true"
--systemd_runtime_directory="/run/systemd/system" --version="false" --work_dir="/tmp/Endpoint_SlaveEndpointTest_UnauthorizedRequest_0_9i1PHV"
I1114 15:12:51.411185 29733 credentials.hpp:86] Loading credential for authentication from
'/tmp/Endpoint_SlaveEndpointTest_UnauthorizedRequest_0_OkIpXk/credential'
I1114 15:12:51.411401 29733 slave.cpp:346] Agent using credential for: test-principal
I1114 15:12:51.411428 29733 credentials.hpp:37] Loading credentials for authentication from
'/tmp/Endpoint_SlaveEndpointTest_UnauthorizedRequest_0_OkIpXk/http_credentials'
I1114 15:12:51.411721 29733 http.cpp:895] Using default 'basic' HTTP authenticator for realm
'mesos-agent-readonly'
I1114 15:12:51.411917 29733 http.cpp:895] Using default 'basic' HTTP authenticator for realm
'mesos-agent-readwrite'
I1114 15:12:51.413300 29733 slave.cpp:533] Agent resources: cpus(*):2; mem(*):1024; disk(*):1024;
ports(*):[31000-32000]
I1114 15:12:51.413403 29733 slave.cpp:541] Agent attributes: [  ]
I1114 15:12:51.413416 29733 slave.cpp:546] Agent hostname: 1d306c0eb601
I1114 15:12:51.414929 29732 state.cpp:57] Recovering state from '/tmp/Endpoint_SlaveEndpointTest_UnauthorizedRequest_0_9i1PHV/meta'
I1114 15:12:51.415264 29729 status_update_manager.cpp:203] Recovering status update manager
I1114 15:12:51.415499 29738 containerizer.cpp:561] Recovering containerizer
I1114 15:12:51.416995 29736 provisioner.cpp:253] Provisioner recovery complete
I1114 15:12:51.417529 29725 slave.cpp:5411] Finished recovery
I1114 15:12:51.418185 29725 slave.cpp:5585] Querying resource estimator for oversubscribable
resources
I1114 15:12:51.418486 29732 slave.cpp:5599] Received oversubscribable resources {} from the
resource estimator
I1114 15:12:51.420794 29739 process.cpp:3570] Handling HTTP event for process 'slave(646)'
with path: '/slave(646)/monitor/statistics'
I1114 15:12:51.422083 29731 http.cpp:847] Authorizing principal 'test-principal' to GET the
'/monitor/statistics' endpoint
I1114 15:12:51.425170 29737 slave.cpp:787] Agent terminating
[       OK ] Endpoint/SlaveEndpointTest.UnauthorizedRequest/0 (29 ms)
[ RUN      ] Endpoint/SlaveEndpointTest.UnauthorizedRequest/1
I1114 15:12:51.436842 29705 containerizer.cpp:202] Using isolation: posix/cpu,posix/mem,filesystem/posix,network/cni
W1114 15:12:51.437367 29705 backend.cpp:76] Failed to create 'aufs' backend: AufsBackend requires
root privileges, but is running as user mesos
W1114 15:12:51.437492 29705 backend.cpp:76] Failed to create 'bind' backend: BindBackend requires
root privileges
I1114 15:12:51.440127 29724 slave.cpp:208] Mesos agent started on (647)@172.17.0.2:42526
I1114 15:12:51.440158 29724 slave.cpp:209] Flags at startup: --acls="" --appc_simple_discovery_uri_prefix="http://"
--appc_store_dir="/tmp/mesos/store/appc" --authenticate_http_readonly="true" --authenticate_http_readwrite="true"
--authenticatee="crammd5" --authentication_backoff_factor="1secs" --authorizer="local" --cgroups_cpu_enable_pids_and_tids_count="false"
--cgroups_enable_cfs="false" --cgroups_hierarchy="/sys/fs/cgroup" --cgroups_limit_swap="false"
--cgroups_root="mesos" --container_disk_watch_interval="15secs" --containerizers="mesos" --credential="/tmp/Endpoint_SlaveEndpointTest_UnauthorizedRequest_1_Ci5WdY/credential"
--default_role="*" --disk_watch_interval="1mins" --docker="docker" --docker_kill_orphans="true"
--docker_registry="https://registry-1.docker.io" --docker_remove_delay="6hrs" --docker_socket="/var/run/docker.sock"
--docker_stop_timeout="0ns" --docker_store_dir="/tmp/mesos/store/docker" --docker_volume_checkpoint_dir="/var/run/mesos/isolators/docker/volume"
--enforce_container_disk_quota="false" --executor_registration_timeout="1mins" --executor_shutdown_grace_period="5secs"
--fetcher_cache_dir="/tmp/Endpoint_SlaveEndpointTest_UnauthorizedRequest_1_Ci5WdY/fetch" --fetcher_cache_size="2GB"
--frameworks_home="" --gc_delay="1weeks" --gc_disk_headroom="0.1" --hadoop_home="" --help="false"
--hostname_lookup="true" --http_authenticators="basic" --http_command_executor="false" --http_credentials="/tmp/Endpoint_SlaveEndpointTest_UnauthorizedRequest_1_Ci5WdY/http_credentials"
--image_provisioner_backend="copy" --initialize_driver_logging="true" --isolation="posix/cpu,posix/mem"
--launcher="posix" --launcher_dir="/mesos/mesos-1.2.0/_build/src" --logbufsecs="0" --logging_level="INFO"
--max_completed_executors_per_framework="150" --oversubscribed_resources_interval="15secs"
--perf_duration="10secs" --perf_interval="1mins" --qos_correction_interval_min="0ns" --quiet="false"
--recover="reconnect" --recovery_timeout="15mins" --registration_backoff_factor="10ms" --resources="cpus:2;gpus:0;mem:1024;disk:1024;ports:[31000-32000]"
--revocable_cpu_low_priority="true" --runtime_dir="/tmp/Endpoint_SlaveEndpointTest_UnauthorizedRequest_1_Ci5WdY"
--sandbox_directory="/mnt/mesos/sandbox" --strict="true" --switch_user="true" --systemd_enable_support="true"
--systemd_runtime_directory="/run/systemd/system" --version="false" --work_dir="/tmp/Endpoint_SlaveEndpointTest_UnauthorizedRequest_1_ZHryTy"
I1114 15:12:51.441185 29724 credentials.hpp:86] Loading credential for authentication from
'/tmp/Endpoint_SlaveEndpointTest_UnauthorizedRequest_1_Ci5WdY/credential'
I1114 15:12:51.441412 29724 slave.cpp:346] Agent using credential for: test-principal
I1114 15:12:51.441444 29724 credentials.hpp:37] Loading credentials for authentication from
'/tmp/Endpoint_SlaveEndpointTest_UnauthorizedRequest_1_Ci5WdY/http_credentials'
I1114 15:12:51.441818 29724 http.cpp:895] Using default 'basic' HTTP authenticator for realm
'mesos-agent-readonly'
I1114 15:12:51.442023 29724 http.cpp:895] Using default 'basic' HTTP authenticator for realm
'mesos-agent-readwrite'
I1114 15:12:51.443446 29724 slave.cpp:533] Agent resources: cpus(*):2; mem(*):1024; disk(*):1024;
ports(*):[31000-32000]
I1114 15:12:51.443549 29724 slave.cpp:541] Agent attributes: [  ]
I1114 15:12:51.443564 29724 slave.cpp:546] Agent hostname: 1d306c0eb601
I1114 15:12:51.445555 29730 state.cpp:57] Recovering state from '/tmp/Endpoint_SlaveEndpointTest_UnauthorizedRequest_1_ZHryTy/meta'
I1114 15:12:51.445811 29729 status_update_manager.cpp:203] Recovering status update manager
I1114 15:12:51.446082 29731 containerizer.cpp:561] Recovering containerizer
I1114 15:12:51.447515 29724 provisioner.cpp:253] Provisioner recovery complete
I1114 15:12:51.448045 29739 slave.cpp:5411] Finished recovery
I1114 15:12:51.448688 29739 slave.cpp:5585] Querying resource estimator for oversubscribable
resources
I1114 15:12:51.449041 29736 slave.cpp:5599] Received oversubscribable resources {} from the
resource estimator
I1114 15:12:51.450947 29731 process.cpp:3570] Handling HTTP event for process 'slave(647)'
with path: '/slave(647)/monitor/statistics.json'
I1114 15:12:51.451930 29730 http.cpp:847] Authorizing principal 'test-principal' to GET the
'/monitor/statistics.json' endpoint
I1114 15:12:51.454550 29730 slave.cpp:787] Agent terminating
[       OK ] Endpoint/SlaveEndpointTest.UnauthorizedRequest/1 (28 ms)
[ RUN      ] Endpoint/SlaveEndpointTest.UnauthorizedRequest/2
I1114 15:12:51.465896 29705 containerizer.cpp:202] Using isolation: posix/cpu,posix/mem,filesystem/posix,network/cni
W1114 15:12:51.466531 29705 backend.cpp:76] Failed to create 'aufs' backend: AufsBackend requires
root privileges, but is running as user mesos
W1114 15:12:51.466660 29705 backend.cpp:76] Failed to create 'bind' backend: BindBackend requires
root privileges
I1114 15:12:51.469564 29738 slave.cpp:208] Mesos agent started on (648)@172.17.0.2:42526
I1114 15:12:51.469595 29738 slave.cpp:209] Flags at startup: --acls="" --appc_simple_discovery_uri_prefix="http://"
--appc_store_dir="/tmp/mesos/store/appc" --authenticate_http_readonly="true" --authenticate_http_readwrite="true"
--authenticatee="crammd5" --authentication_backoff_factor="1secs" --authorizer="local" --cgroups_cpu_enable_pids_and_tids_count="false"
--cgroups_enable_cfs="false" --cgroups_hierarchy="/sys/fs/cgroup" --cgroups_limit_swap="false"
--cgroups_root="mesos" --container_disk_watch_interval="15secs" --containerizers="mesos" --credential="/tmp/Endpoint_SlaveEndpointTest_UnauthorizedRequest_2_KnMkNB/credential"
--default_role="*" --disk_watch_interval="1mins" --docker="docker" --docker_kill_orphans="true"
--docker_registry="https://registry-1.docker.io" --docker_remove_delay="6hrs" --docker_socket="/var/run/docker.sock"
--docker_stop_timeout="0ns" --docker_store_dir="/tmp/mesos/store/docker" --docker_volume_checkpoint_dir="/var/run/mesos/isolators/docker/volume"
--enforce_container_disk_quota="false" --executor_registration_timeout="1mins" --executor_shutdown_grace_period="5secs"
--fetcher_cache_dir="/tmp/Endpoint_SlaveEndpointTest_UnauthorizedRequest_2_KnMkNB/fetch" --fetcher_cache_size="2GB"
--frameworks_home="" --gc_delay="1weeks" --gc_disk_headroom="0.1" --hadoop_home="" --help="false"
--hostname_lookup="true" --http_authenticators="basic" --http_command_executor="false" --http_credentials="/tmp/Endpoint_SlaveEndpointTest_UnauthorizedRequest_2_KnMkNB/http_credentials"
--image_provisioner_backend="copy" --initialize_driver_logging="true" --isolation="posix/cpu,posix/mem"
--launcher="posix" --launcher_dir="/mesos/mesos-1.2.0/_build/src" --logbufsecs="0" --logging_level="INFO"
--max_completed_executors_per_framework="150" --oversubscribed_resources_interval="15secs"
--perf_duration="10secs" --perf_interval="1mins" --qos_correction_interval_min="0ns" --quiet="false"
--recover="reconnect" --recovery_timeout="15mins" --registration_backoff_factor="10ms" --resources="cpus:2;gpus:0;mem:1024;disk:1024;ports:[31000-32000]"
--revocable_cpu_low_priority="true" --runtime_dir="/tmp/Endpoint_SlaveEndpointTest_UnauthorizedRequest_2_KnMkNB"
--sandbox_directory="/mnt/mesos/sandbox" --strict="true" --switch_user="true" --systemd_enable_support="true"
--systemd_runtime_directory="/run/systemd/system" --version="false" --work_dir="/tmp/Endpoint_SlaveEndpointTest_UnauthorizedRequest_2_JSrjoc"
I1114 15:12:51.470584 29738 credentials.hpp:86] Loading credential for authentication from
'/tmp/Endpoint_SlaveEndpointTest_UnauthorizedRequest_2_KnMkNB/credential'
I1114 15:12:51.470806 29738 slave.cpp:346] Agent using credential for: test-principal
I1114 15:12:51.470839 29738 credentials.hpp:37] Loading credentials for authentication from
'/tmp/Endpoint_SlaveEndpointTest_UnauthorizedRequest_2_KnMkNB/http_credentials'
I1114 15:12:51.471241 29738 http.cpp:895] Using default 'basic' HTTP authenticator for realm
'mesos-agent-readonly'
I1114 15:12:51.471426 29738 http.cpp:895] Using default 'basic' HTTP authenticator for realm
'mesos-agent-readwrite'
I1114 15:12:51.472898 29738 slave.cpp:533] Agent resources: cpus(*):2; mem(*):1024; disk(*):1024;
ports(*):[31000-32000]
I1114 15:12:51.473021 29738 slave.cpp:541] Agent attributes: [  ]
I1114 15:12:51.473036 29738 slave.cpp:546] Agent hostname: 1d306c0eb601
I1114 15:12:51.474756 29728 state.cpp:57] Recovering state from '/tmp/Endpoint_SlaveEndpointTest_UnauthorizedRequest_2_JSrjoc/meta'
I1114 15:12:51.475993 29739 status_update_manager.cpp:203] Recovering status update manager
I1114 15:12:51.476284 29739 containerizer.cpp:561] Recovering containerizer
I1114 15:12:51.478229 29726 provisioner.cpp:253] Provisioner recovery complete
I1114 15:12:51.478608 29731 slave.cpp:5411] Finished recovery
I1114 15:12:51.479138 29731 slave.cpp:5585] Querying resource estimator for oversubscribable
resources
I1114 15:12:51.479364 29728 slave.cpp:5599] Received oversubscribable resources {} from the
resource estimator
I1114 15:12:51.481767 29724 process.cpp:3570] Handling HTTP event for process 'slave(648)'
with path: '/slave(648)/containers'
I1114 15:12:51.482781 29727 http.cpp:847] Authorizing principal 'test-principal' to GET the
'/containers' endpoint
I1114 15:12:51.485844 29734 slave.cpp:787] Agent terminating
[       OK ] Endpoint/SlaveEndpointTest.UnauthorizedRequest/2 (32 ms)
[ RUN      ] Endpoint/SlaveEndpointTest.NoAuthorizer/0
I1114 15:12:51.497767 29705 containerizer.cpp:202] Using isolation: posix/cpu,posix/mem,filesystem/posix,network/cni
W1114 15:12:51.498298 29705 backend.cpp:76] Failed to create 'aufs' backend: AufsBackend requires
root privileges, but is running as user mesos
W1114 15:12:51.498430 29705 backend.cpp:76] Failed to create 'bind' backend: BindBackend requires
root privileges
I1114 15:12:51.499615 29705 cluster.cpp:435] Creating default 'local' authorizer
I1114 15:12:51.501204 29726 slave.cpp:208] Mesos agent started on (649)@172.17.0.2:42526
I1114 15:12:51.501230 29726 slave.cpp:209] Flags at startup: --acls="" --appc_simple_discovery_uri_prefix="http://"
--appc_store_dir="/tmp/mesos/store/appc" --authenticate_http_readonly="true" --authenticate_http_readwrite="true"
--authenticatee="crammd5" --authentication_backoff_factor="1secs" --authorizer="local" --cgroups_cpu_enable_pids_and_tids_count="false"
--cgroups_enable_cfs="false" --cgroups_hierarchy="/sys/fs/cgroup" --cgroups_limit_swap="false"
--cgroups_root="mesos" --container_disk_watch_interval="15secs" --containerizers="mesos" --credential="/tmp/Endpoint_SlaveEndpointTest_NoAuthorizer_0_eDvrHf/credential"
--default_role="*" --disk_watch_interval="1mins" --docker="docker" --docker_kill_orphans="true"
--docker_registry="https://registry-1.docker.io" --docker_remove_delay="6hrs" --docker_socket="/var/run/docker.sock"
--docker_stop_timeout="0ns" --docker_store_dir="/tmp/mesos/store/docker" --docker_volume_checkpoint_dir="/var/run/mesos/isolators/docker/volume"
--enforce_container_disk_quota="false" --executor_registration_timeout="1mins" --executor_shutdown_grace_period="5secs"
--fetcher_cache_dir="/tmp/Endpoint_SlaveEndpointTest_NoAuthorizer_0_eDvrHf/fetch" --fetcher_cache_size="2GB"
--frameworks_home="" --gc_delay="1weeks" --gc_disk_headroom="0.1" --hadoop_home="" --help="false"
--hostname_lookup="true" --http_authenticators="basic" --http_command_executor="false" --http_credentials="/tmp/Endpoint_SlaveEndpointTest_NoAuthorizer_0_eDvrHf/http_credentials"
--image_provisioner_backend="copy" --initialize_driver_logging="true" --isolation="posix/cpu,posix/mem"
--launcher="posix" --launcher_dir="/mesos/mesos-1.2.0/_build/src" --logbufsecs="0" --logging_level="INFO"
--max_completed_executors_per_framework="150" --oversubscribed_resources_interval="15secs"
--perf_duration="10secs" --perf_interval="1mins" --qos_correction_interval_min="0ns" --quiet="false"
--recover="reconnect" --recovery_timeout="15mins" --registration_backoff_factor="10ms" --resources="cpus:2;gpus:0;mem:1024;disk:1024;ports:[31000-32000]"
--revocable_cpu_low_priority="true" --runtime_dir="/tmp/Endpoint_SlaveEndpointTest_NoAuthorizer_0_eDvrHf"
--sandbox_directory="/mnt/mesos/sandbox" --strict="true" --switch_user="true" --systemd_enable_support="true"
--systemd_runtime_directory="/run/systemd/system" --version="false" --work_dir="/tmp/Endpoint_SlaveEndpointTest_NoAuthorizer_0_14kadQ"
I1114 15:12:51.501816 29726 credentials.hpp:86] Loading credential for authentication from
'/tmp/Endpoint_SlaveEndpointTest_NoAuthorizer_0_eDvrHf/credential'
I1114 15:12:51.502039 29726 slave.cpp:346] Agent using credential for: test-principal
I1114 15:12:51.502064 29726 credentials.hpp:37] Loading credentials for authentication from
'/tmp/Endpoint_SlaveEndpointTest_NoAuthorizer_0_eDvrHf/http_credentials'
I1114 15:12:51.502338 29726 http.cpp:895] Using default 'basic' HTTP authenticator for realm
'mesos-agent-readonly'
I1114 15:12:51.502508 29726 http.cpp:895] Using default 'basic' HTTP authenticator for realm
'mesos-agent-readwrite'
I1114 15:12:51.504024 29726 slave.cpp:533] Agent resources: cpus(*):2; mem(*):1024; disk(*):1024;
ports(*):[31000-32000]
I1114 15:12:51.504124 29726 slave.cpp:541] Agent attributes: [  ]
I1114 15:12:51.504139 29726 slave.cpp:546] Agent hostname: 1d306c0eb601
I1114 15:12:51.505653 29737 state.cpp:57] Recovering state from '/tmp/Endpoint_SlaveEndpointTest_NoAuthorizer_0_14kadQ/meta'
I1114 15:12:51.506111 29731 status_update_manager.cpp:203] Recovering status update manager
I1114 15:12:51.506320 29730 containerizer.cpp:561] Recovering containerizer
I1114 15:12:51.507560 29739 provisioner.cpp:253] Provisioner recovery complete
I1114 15:12:51.508160 29724 slave.cpp:5411] Finished recovery
I1114 15:12:51.508672 29724 slave.cpp:5585] Querying resource estimator for oversubscribable
resources
I1114 15:12:51.509100 29736 slave.cpp:5599] Received oversubscribable resources {} from the
resource estimator
I1114 15:12:51.510992 29736 process.cpp:3570] Handling HTTP event for process 'slave(649)'
with path: '/slave(649)/monitor/statistics'
I1114 15:12:51.512222 29736 http.cpp:847] Authorizing principal 'test-principal' to GET the
'/monitor/statistics' endpoint
I1114 15:12:51.516209 29731 slave.cpp:787] Agent terminating
[       OK ] Endpoint/SlaveEndpointTest.NoAuthorizer/0 (29 ms)
[ RUN      ] Endpoint/SlaveEndpointTest.NoAuthorizer/1
I1114 15:12:51.527972 29705 containerizer.cpp:202] Using isolation: posix/cpu,posix/mem,filesystem/posix,network/cni
W1114 15:12:51.528625 29705 backend.cpp:76] Failed to create 'aufs' backend: AufsBackend requires
root privileges, but is running as user mesos
W1114 15:12:51.528787 29705 backend.cpp:76] Failed to create 'bind' backend: BindBackend requires
root privileges
I1114 15:12:51.530557 29705 cluster.cpp:435] Creating default 'local' authorizer
I1114 15:12:51.533093 29732 slave.cpp:208] Mesos agent started on (650)@172.17.0.2:42526
I1114 15:12:51.533119 29732 slave.cpp:209] Flags at startup: --acls="" --appc_simple_discovery_uri_prefix="http://"
--appc_store_dir="/tmp/mesos/store/appc" --authenticate_http_readonly="true" --authenticate_http_readwrite="true"
--authenticatee="crammd5" --authentication_backoff_factor="1secs" --authorizer="local" --cgroups_cpu_enable_pids_and_tids_count="false"
--cgroups_enable_cfs="false" --cgroups_hierarchy="/sys/fs/cgroup" --cgroups_limit_swap="false"
--cgroups_root="mesos" --container_disk_watch_interval="15secs" --containerizers="mesos" --credential="/tmp/Endpoint_SlaveEndpointTest_NoAuthorizer_1_gzqRUT/credential"
--default_role="*" --disk_watch_interval="1mins" --docker="docker" --docker_kill_orphans="true"
--docker_registry="https://registry-1.docker.io" --docker_remove_delay="6hrs" --docker_socket="/var/run/docker.sock"
--docker_stop_timeout="0ns" --docker_store_dir="/tmp/mesos/store/docker" --docker_volume_checkpoint_dir="/var/run/mesos/isolators/docker/volume"
--enforce_container_disk_quota="false" --executor_registration_timeout="1mins" --executor_shutdown_grace_period="5secs"
--fetcher_cache_dir="/tmp/Endpoint_SlaveEndpointTest_NoAuthorizer_1_gzqRUT/fetch" --fetcher_cache_size="2GB"
--frameworks_home="" --gc_delay="1weeks" --gc_disk_headroom="0.1" --hadoop_home="" --help="false"
--hostname_lookup="true" --http_authenticators="basic" --http_command_executor="false" --http_credentials="/tmp/Endpoint_SlaveEndpointTest_NoAuthorizer_1_gzqRUT/http_credentials"
--image_provisioner_backend="copy" --initialize_driver_logging="true" --isolation="posix/cpu,posix/mem"
--launcher="posix" --launcher_dir="/mesos/mesos-1.2.0/_build/src" --logbufsecs="0" --logging_level="INFO"
--max_completed_executors_per_framework="150" --oversubscribed_resources_interval="15secs"
--perf_duration="10secs" --perf_interval="1mins" --qos_correction_interval_min="0ns" --quiet="false"
--recover="reconnect" --recovery_timeout="15mins" --registration_backoff_factor="10ms" --resources="cpus:2;gpus:0;mem:1024;disk:1024;ports:[31000-32000]"
--revocable_cpu_low_priority="true" --runtime_dir="/tmp/Endpoint_SlaveEndpointTest_NoAuthorizer_1_gzqRUT"
--sandbox_directory="/mnt/mesos/sandbox" --strict="true" --switch_user="true" --systemd_enable_support="true"
--systemd_runtime_directory="/run/systemd/system" --version="false" --work_dir="/tmp/Endpoint_SlaveEndpointTest_NoAuthorizer_1_LJ7Jlu"
I1114 15:12:51.533787 29732 credentials.hpp:86] Loading credential for authentication from
'/tmp/Endpoint_SlaveEndpointTest_NoAuthorizer_1_gzqRUT/credential'
I1114 15:12:51.533990 29732 slave.cpp:346] Agent using credential for: test-principal
I1114 15:12:51.534018 29732 credentials.hpp:37] Loading credentials for authentication from
'/tmp/Endpoint_SlaveEndpointTest_NoAuthorizer_1_gzqRUT/http_credentials'
I1114 15:12:51.534306 29732 http.cpp:895] Using default 'basic' HTTP authenticator for realm
'mesos-agent-readonly'
I1114 15:12:51.534446 29732 http.cpp:895] Using default 'basic' HTTP authenticator for realm
'mesos-agent-readwrite'
I1114 15:12:51.536125 29732 slave.cpp:533] Agent resources: cpus(*):2; mem(*):1024; disk(*):1024;
ports(*):[31000-32000]
I1114 15:12:51.536204 29732 slave.cpp:541] Agent attributes: [  ]
I1114 15:12:51.536216 29732 slave.cpp:546] Agent hostname: 1d306c0eb601
I1114 15:12:51.537468 29737 state.cpp:57] Recovering state from '/tmp/Endpoint_SlaveEndpointTest_NoAuthorizer_1_LJ7Jlu/meta'
I1114 15:12:51.537744 29738 status_update_manager.cpp:203] Recovering status update manager
I1114 15:12:51.538195 29732 containerizer.cpp:561] Recovering containerizer
I1114 15:12:51.539793 29731 provisioner.cpp:253] Provisioner recovery complete
I1114 15:12:51.540279 29730 slave.cpp:5411] Finished recovery
I1114 15:12:51.542067 29730 slave.cpp:5585] Querying resource estimator for oversubscribable
resources
I1114 15:12:51.542404 29729 slave.cpp:5599] Received oversubscribable resources {} from the
resource estimator
I1114 15:12:51.544348 29733 process.cpp:3570] Handling HTTP event for process 'slave(650)'
with path: '/slave(650)/monitor/statistics.json'
I1114 15:12:51.545366 29729 http.cpp:847] Authorizing principal 'test-principal' to GET the
'/monitor/statistics.json' endpoint
I1114 15:12:51.549399 29729 slave.cpp:787] Agent terminating
[       OK ] Endpoint/SlaveEndpointTest.NoAuthorizer/1 (33 ms)
[ RUN      ] Endpoint/SlaveEndpointTest.NoAuthorizer/2
I1114 15:12:51.561784 29705 containerizer.cpp:202] Using isolation: posix/cpu,posix/mem,filesystem/posix,network/cni
W1114 15:12:51.562383 29705 backend.cpp:76] Failed to create 'aufs' backend: AufsBackend requires
root privileges, but is running as user mesos
W1114 15:12:51.562515 29705 backend.cpp:76] Failed to create 'bind' backend: BindBackend requires
root privileges
I1114 15:12:51.563681 29705 cluster.cpp:435] Creating default 'local' authorizer
I1114 15:12:51.565042 29735 slave.cpp:208] Mesos agent started on (651)@172.17.0.2:42526
I1114 15:12:51.565068 29735 slave.cpp:209] Flags at startup: --acls="" --appc_simple_discovery_uri_prefix="http://"
--appc_store_dir="/tmp/mesos/store/appc" --authenticate_http_readonly="true" --authenticate_http_readwrite="true"
--authenticatee="crammd5" --authentication_backoff_factor="1secs" --authorizer="local" --cgroups_cpu_enable_pids_and_tids_count="false"
--cgroups_enable_cfs="false" --cgroups_hierarchy="/sys/fs/cgroup" --cgroups_limit_swap="false"
--cgroups_root="mesos" --container_disk_watch_interval="15secs" --containerizers="mesos" --credential="/tmp/Endpoint_SlaveEndpointTest_NoAuthorizer_2_yBmWty/credential"
--default_role="*" --disk_watch_interval="1mins" --docker="docker" --docker_kill_orphans="true"
--docker_registry="https://registry-1.docker.io" --docker_remove_delay="6hrs" --docker_socket="/var/run/docker.sock"
--docker_stop_timeout="0ns" --docker_store_dir="/tmp/mesos/store/docker" --docker_volume_checkpoint_dir="/var/run/mesos/isolators/docker/volume"
--enforce_container_disk_quota="false" --executor_registration_timeout="1mins" --executor_shutdown_grace_period="5secs"
--fetcher_cache_dir="/tmp/Endpoint_SlaveEndpointTest_NoAuthorizer_2_yBmWty/fetch" --fetcher_cache_size="2GB"
--frameworks_home="" --gc_delay="1weeks" --gc_disk_headroom="0.1" --hadoop_home="" --help="false"
--hostname_lookup="true" --http_authenticators="basic" --http_command_executor="false" --http_credentials="/tmp/Endpoint_SlaveEndpointTest_NoAuthorizer_2_yBmWty/http_credentials"
--image_provisioner_backend="copy" --initialize_driver_logging="true" --isolation="posix/cpu,posix/mem"
--launcher="posix" --launcher_dir="/mesos/mesos-1.2.0/_build/src" --logbufsecs="0" --logging_level="INFO"
--max_completed_executors_per_framework="150" --oversubscribed_resources_interval="15secs"
--perf_duration="10secs" --perf_interval="1mins" --qos_correction_interval_min="0ns" --quiet="false"
--recover="reconnect" --recovery_timeout="15mins" --registration_backoff_factor="10ms" --resources="cpus:2;gpus:0;mem:1024;disk:1024;ports:[31000-32000]"
--revocable_cpu_low_priority="true" --runtime_dir="/tmp/Endpoint_SlaveEndpointTest_NoAuthorizer_2_yBmWty"
--sandbox_directory="/mnt/mesos/sandbox" --strict="true" --switch_user="true" --systemd_enable_support="true"
--systemd_runtime_directory="/run/systemd/system" --version="false" --work_dir="/tmp/Endpoint_SlaveEndpointTest_NoAuthorizer_2_HiXkP8"
I1114 15:12:51.565681 29735 credentials.hpp:86] Loading credential for authentication from
'/tmp/Endpoint_SlaveEndpointTest_NoAuthorizer_2_yBmWty/credential'
I1114 15:12:51.565820 29735 slave.cpp:346] Agent using credential for: test-principal
I1114 15:12:51.565840 29735 credentials.hpp:37] Loading credentials for authentication from
'/tmp/Endpoint_SlaveEndpointTest_NoAuthorizer_2_yBmWty/http_credentials'
I1114 15:12:51.566112 29735 http.cpp:895] Using default 'basic' HTTP authenticator for realm
'mesos-agent-readonly'
I1114 15:12:51.566252 29735 http.cpp:895] Using default 'basic' HTTP authenticator for realm
'mesos-agent-readwrite'
I1114 15:12:51.567350 29735 slave.cpp:533] Agent resources: cpus(*):2; mem(*):1024; disk(*):1024;
ports(*):[31000-32000]
I1114 15:12:51.567451 29735 slave.cpp:541] Agent attributes: [  ]
I1114 15:12:51.567464 29735 slave.cpp:546] Agent hostname: 1d306c0eb601
I1114 15:12:51.569007 29727 state.cpp:57] Recovering state from '/tmp/Endpoint_SlaveEndpointTest_NoAuthorizer_2_HiXkP8/meta'
I1114 15:12:51.569293 29733 status_update_manager.cpp:203] Recovering status update manager
I1114 15:12:51.569773 29738 containerizer.cpp:561] Recovering containerizer
I1114 15:12:51.571283 29728 provisioner.cpp:253] Provisioner recovery complete
I1114 15:12:51.571837 29727 slave.cpp:5411] Finished recovery
I1114 15:12:51.572481 29727 slave.cpp:5585] Querying resource estimator for oversubscribable
resources
I1114 15:12:51.572751 29724 slave.cpp:5599] Received oversubscribable resources {} from the
resource estimator
I1114 15:12:51.574558 29739 process.cpp:3570] Handling HTTP event for process 'slave(651)'
with path: '/slave(651)/containers'
I1114 15:12:51.575495 29734 http.cpp:847] Authorizing principal 'test-principal' to GET the
'/containers' endpoint
I1114 15:12:51.578737 29724 slave.cpp:787] Agent terminating
[       OK ] Endpoint/SlaveEndpointTest.NoAuthorizer/2 (28 ms)
[----------] 9 tests from Endpoint/SlaveEndpointTest (272 ms total)

[----------] Global test environment tear-down
[==========] 1378 tests from 156 test cases ran. (443527 ms total)
[  PASSED  ] 1376 tests.
[  FAILED  ] 2 tests, listed below:
[  FAILED  ] MasterTest.TaskLabels
[  FAILED  ] RegistrarTest.UpdateMaintenanceSchedule

 2 FAILED TESTS
  YOU HAVE 4 DISABLED TESTS

make[4]: *** [check-local] Error 1
make[4]: Leaving directory `/mesos/mesos-1.2.0/_build/src'
make[3]: *** [check-am] Error 2
make[3]: Leaving directory `/mesos/mesos-1.2.0/_build/src'
make[2]: *** [check] Error 2
make[2]: Leaving directory `/mesos/mesos-1.2.0/_build/src'
make[1]: *** [check-recursive] Error 1
make[1]: Leaving directory `/mesos/mesos-1.2.0/_build'
make: *** [distcheck] Error 1
+ docker rmi mesos-1479133834-14354
Untagged: mesos-1479133834-14354:latest
Deleted: sha256:de71adfff321c9e4b6a19f4dc2ffb20e4d281c552baf48df41661b02f8804119
Deleted: sha256:dd6644c88298cadeb7f4b190e119b733a496bf544717012add3979fe703cca1e
Deleted: sha256:d108cab9736be0502e87169a2fae58dfd7fdeb4ec17a9da5c1d47b1e57e7faf5
Deleted: sha256:231b3e78f7ad747e337f874bb3ee8351725d023d29a5ddb8db805c5cb8016c04
Deleted: sha256:43e3cff01339401482be827ba12ef80107270faa49b0ce6701831f5d695fd221
Deleted: sha256:1fec16952236cf1637e2218b28bd2b6da4e62ca9c97ecfafca43ef07f4cb28cb
Deleted: sha256:e10b4b5a4bab04f442d57a4c851503bdef902fde792b7b2db08abca1391aea97
Deleted: sha256:152e679fdbfef3d15d0b8baa898abe8e56505b8d1f6f55bb1b83e4c8efc1ab9f
Deleted: sha256:4e001c8c0f864ac87ceb5523b1a23247f7df48922c98ec654088ee0785a584e1
Deleted: sha256:c779fd15f623240a56ecbfbf519df6befdf0409679d20d409530ee1ce0995c76
Deleted: sha256:0075aa8779e276814278273aaa60e63d537b7874cc0e15541d07e83440808190
Deleted: sha256:e39d4dfef166d112ffa578e0e201b15f758c1e4cbf9c571b26e1d02de5dbea5d
Deleted: sha256:09493c702f822b7da85df44635db2497a36d2a9a4c665e906ab495bf2f2d1bab
Deleted: sha256:8512ac0f607d4409371816eabd93fdbf07554a6f2498f062739f62a58f0ca663
Deleted: sha256:b79158ac0fa0101ae27b72a41f86a979787d771b8597d6812bc13dabb5fd1e76
Deleted: sha256:f2a3b3d7f173c08d0d02283c9e50be148b9396f948559f6c8f1ede865dc62648
Deleted: sha256:13a1f60a52989548e6e0293dddfbcd214cf6de67b293603fc772acaab46ef227
Deleted: sha256:9fe87227fb9b546e4bc9e5d849966004a78059761ed0e2f84e3e9742f57ed820
Deleted: sha256:8ba5cad30f85016398063cbddc4fe410c54bda650eba7e2a346cfda28083ce4e
Deleted: sha256:f51540cba9b2c410b4887d275dead1b98e76135b5a804925b3edc2760ea95880
Deleted: sha256:f9c31dccee3ea8679a7d6e1080959a800693ef830edee9ae53d7bf45a6e49201
Deleted: sha256:097b3f68d43cde950b0890a5504209f169973ae465ab270d3226965fc5008095
Deleted: sha256:e5b95e2fcf52ea9f404facc5a8654a50ee40c26ebf4791b2ada040d4fc70d585
Deleted: sha256:25eb35ca8a8f4d165d52ae7f7633033381c43ae912bad24398303c2e91566433
Build step 'Execute shell' marked build as failure

Mime
View raw message