mesos-builds mailing list archives

Site index · List index
Message view « Date » · « Thread »
Top « Date » · « Thread »
From Apache Jenkins Server <jenk...@builds.apache.org>
Subject Build failed in Jenkins: Mesos » cmake,gcc,--verbose --enable-libevent --enable-ssl,GLOG_v=1 MESOS_VERBOSE=1,centos:7,(docker||Hadoop)&&(!ubuntu-us1)&&(!ubuntu-6)&&(!ubuntu-eu2) #2908
Date Tue, 08 Nov 2016 23:45:45 GMT
See <https://builds.apache.org/job/Mesos/BUILDTOOL=cmake,COMPILER=gcc,CONFIGURATION=--verbose%20--enable-libevent%20--enable-ssl,ENVIRONMENT=GLOG_v=1%20MESOS_VERBOSE=1,OS=centos%3A7,label_exp=(docker%7C%7CHadoop)&&(!ubuntu-us1)&&(!ubuntu-6)&&(!ubuntu-eu2)/2908/changes>

Changes:

[alexr] Improved the validation of RESERVE operations.

[alexr] Added MESOS-6142 to CHANGELOG for 0.28.3.

------------------------------------------
[...truncated 19120 lines...]
running bdist_wheel
running build
installing to build/bdist.linux-x86_64/wheel
running install
running install_lib
Skipping installation of build/bdist.linux-x86_64/wheel/mesos/__init__.py (namespace package)
copying mesos/interface/__init__.py -> build/bdist.linux-x86_64/wheel/mesos/interface
copying mesos/interface/containerizer_pb2.py -> build/bdist.linux-x86_64/wheel/mesos/interface
copying mesos/interface/mesos_pb2.py -> build/bdist.linux-x86_64/wheel/mesos/interface
running install_egg_info
Copying src/mesos.interface.egg-info to build/bdist.linux-x86_64/wheel/mesos.interface-0.28.3-py2.7.egg-info
Installing build/bdist.linux-x86_64/wheel/mesos.interface-0.28.3-py2.7-nspkg.pth
running install_scripts
creating build/bdist.linux-x86_64/wheel/mesos.interface-0.28.3.dist-info/WHEEL
byte-compiling build/bdist.linux-x86_64/egg/mesos/__init__.py to __init__.pyc
byte-compiling build/bdist.linux-x86_64/egg/mesos/native/__init__.py to __init__.pyc
creating stub loader for mesos/native/_mesos.so
byte-compiling build/bdist.linux-x86_64/egg/mesos/native/_mesos.py to _mesos.pyc
creating build/bdist.linux-x86_64/egg/EGG-INFO
copying src/mesos.native.egg-info/PKG-INFO -> build/bdist.linux-x86_64/egg/EGG-INFO
copying src/mesos.native.egg-info/SOURCES.txt -> build/bdist.linux-x86_64/egg/EGG-INFO
copying src/mesos.native.egg-info/dependency_links.txt -> build/bdist.linux-x86_64/egg/EGG-INFO
copying src/mesos.native.egg-info/namespace_packages.txt -> build/bdist.linux-x86_64/egg/EGG-INFO
copying src/mesos.native.egg-info/requires.txt -> build/bdist.linux-x86_64/egg/EGG-INFO
copying src/mesos.native.egg-info/top_level.txt -> build/bdist.linux-x86_64/egg/EGG-INFO
writing build/bdist.linux-x86_64/egg/EGG-INFO/native_libs.txt
zip_safe flag not set; analyzing archive contents...
mesos.__init__: module references __path__
creating '/mesos/mesos-0.28.3/_build/src/python/dist/mesos.native-0.28.3-py2.7-linux-x86_64.egg' and adding 'build/bdist.linux-x86_64/egg' to it
removing 'build/bdist.linux-x86_64/egg' (and everything under it)
running bdist_wheel
running build
installing to build/bdist.linux-x86_64/wheel
running install
running install_lib
Skipping installation of build/bdist.linux-x86_64/wheel/mesos/__init__.py (namespace package)
copying mesos/native/__init__.py -> build/bdist.linux-x86_64/wheel/mesos/native
copying mesos/native/_mesos.so -> build/bdist.linux-x86_64/wheel/mesos/native
running install_egg_info
Copying src/mesos.native.egg-info to build/bdist.linux-x86_64/wheel/mesos.native-0.28.3-py2.7.egg-info
Installing build/bdist.linux-x86_64/wheel/mesos.native-0.28.3-py2.7-nspkg.pth
running install_scripts
creating build/bdist.linux-x86_64/wheel/mesos.native-0.28.3.dist-info/WHEEL
make  test-http-framework test-framework test-executor test-http-executor long-lived-framework long-lived-executor no-executor-framework docker-no-executor-framework balloon-framework balloon-executor load-generator-framework persistent-volume-framework setns-test-helper memory-test-helper active-user-test-helper mesos-tests examples/java/test-executor examples/java/test-exception-framework examples/java/test-framework examples/java/test-log examples/java/test-multiple-executors-framework examples/python/test_containerizer.py examples/python/test-containerizer examples/python/test_executor.py examples/python/test-executor examples/python/test_framework.py examples/python/test-framework \
  tests/balloon_framework_test.sh tests/test_http_framework_test.sh tests/java_exception_test.sh tests/java_framework_test.sh tests/java_log_test.sh tests/no_executor_framework_test.sh tests/persistent_volume_framework_test.sh tests/python_framework_test.sh tests/test_framework_test.sh
make[4]: Entering directory `/mesos/mesos-0.28.3/_build/src'
g++ -DPACKAGE_NAME=\"mesos\" -DPACKAGE_TARNAME=\"mesos\" -DPACKAGE_VERSION=\"0.28.3\" -DPACKAGE_STRING=\"mesos\ 0.28.3\" -DPACKAGE_BUGREPORT=\"\" -DPACKAGE_URL=\"\" -DPACKAGE=\"mesos\" -DVERSION=\"0.28.3\" -DSTDC_HEADERS=1 -DHAVE_SYS_TYPES_H=1 -DHAVE_SYS_STAT_H=1 -DHAVE_STDLIB_H=1 -DHAVE_STRING_H=1 -DHAVE_MEMORY_H=1 -DHAVE_STRINGS_H=1 -DHAVE_INTTYPES_H=1 -DHAVE_STDINT_H=1 -DHAVE_UNISTD_H=1 -DHAVE_DLFCN_H=1 -DLT_OBJDIR=\".libs/\" -DHAVE_PTHREAD_PRIO_INHERIT=1 -DHAVE_PTHREAD=1 -DHAVE_LIBZ=1 -DHAVE_LIBCURL=1 -DHAVE_APR_POOLS_H=1 -DHAVE_LIBAPR_1=1 -DHAVE_SVN_VERSION_H=1 -DHAVE_LIBSVN_SUBR_1=1 -DHAVE_SVN_DELTA_H=1 -DHAVE_LIBSVN_DELTA_1=1 -DHAVE_LIBSASL2=1 -DMESOS_HAS_JAVA=1 -DHAVE_PYTHON=\"2.7\" -DMESOS_HAS_PYTHON=1 -DHAVE_EVENT2_EVENT_H=1 -DHAVE_LIBEVENT=1 -DHAVE_EVENT2_THREAD_H=1 -DHAVE_LIBEVENT_PTHREADS=1 -DHAVE_OPENSSL_SSL_H=1 -DHAVE_LIBSSL=1 -DHAVE_LIBCRYPTO=1 -DHAVE_EVENT2_BUFFEREVENT_SSL_H=1 -DHAVE_LIBEVENT_OPENSSL=1 -DUSE_SSL_SOCKET=1 -I. -I../../src   -Wall -Werror -DLIBDIR=\"/mesos/mesos-0.28.3/_inst/lib\" -DPKGLIBEXECDIR=\"/mesos/mesos-0.28.3/_inst/libexec/mesos\" -DPKGDATADIR=\"/mesos/mesos-0.28.3/_inst/share/mesos\" -DPKGMODULEDIR=\"/mesos/mesos-0.28.3/_inst/lib/mesos/modules\" -I../../include -I../../3rdparty/libprocess/include -I../../3rdparty/libprocess/3rdparty/stout/include -I../include -I../include/mesos -isystem ../3rdparty/libprocess/3rdparty/boost-1.53.0 -I../3rdparty/libprocess/3rdparty/picojson-1.3.0 -DPICOJSON_USE_INT64 -D__STDC_FORMAT_MACROS -I../3rdparty/libprocess/3rdparty/protobuf-2.5.0/src -I../3rdparty/libprocess/3rdparty/glog-0.3.3/src -I../3rdparty/libprocess/3rdparty/glog-0.3.3/src -I../3rdparty/leveldb-1.4/include -I../3rdparty/zookeeper-3.4.5/src/c/include -I../3rdparty/zookeeper-3.4.5/src/c/generated -I../3rdparty/libprocess/3rdparty/protobuf-2.5.0/src -I/usr/include/subversion-1 -I/usr/include/apr-1 -I/usr/include/apr-1.0  -pthread -g1 -O0 -Wno-unused-local-typedefs -std=c++11 -MT examples/test_http_framework-test_http_framework.o -MD -MP -MF examples/.deps/test_http_framework-test_http_framework.Tpo -c -o examples/test_http_framework-test_http_framework.o `test -f 'examples/test_http_framework.cpp' || echo '../../src/'`examples/test_http_framework.cpp
g++ -DPACKAGE_NAME=\"mesos\" -DPACKAGE_TARNAME=\"mesos\" -DPACKAGE_VERSION=\"0.28.3\" -DPACKAGE_STRING=\"mesos\ 0.28.3\" -DPACKAGE_BUGREPORT=\"\" -DPACKAGE_URL=\"\" -DPACKAGE=\"mesos\" -DVERSION=\"0.28.3\" -DSTDC_HEADERS=1 -DHAVE_SYS_TYPES_H=1 -DHAVE_SYS_STAT_H=1 -DHAVE_STDLIB_H=1 -DHAVE_STRING_H=1 -DHAVE_MEMORY_H=1 -DHAVE_STRINGS_H=1 -DHAVE_INTTYPES_H=1 -DHAVE_STDINT_H=1 -DHAVE_UNISTD_H=1 -DHAVE_DLFCN_H=1 -DLT_OBJDIR=\".libs/\" -DHAVE_PTHREAD_PRIO_INHERIT=1 -DHAVE_PTHREAD=1 -DHAVE_LIBZ=1 -DHAVE_LIBCURL=1 -DHAVE_APR_POOLS_H=1 -DHAVE_LIBAPR_1=1 -DHAVE_SVN_VERSION_H=1 -DHAVE_LIBSVN_SUBR_1=1 -DHAVE_SVN_DELTA_H=1 -DHAVE_LIBSVN_DELTA_1=1 -DHAVE_LIBSASL2=1 -DMESOS_HAS_JAVA=1 -DHAVE_PYTHON=\"2.7\" -DMESOS_HAS_PYTHON=1 -DHAVE_EVENT2_EVENT_H=1 -DHAVE_LIBEVENT=1 -DHAVE_EVENT2_THREAD_H=1 -DHAVE_LIBEVENT_PTHREADS=1 -DHAVE_OPENSSL_SSL_H=1 -DHAVE_LIBSSL=1 -DHAVE_LIBCRYPTO=1 -DHAVE_EVENT2_BUFFEREVENT_SSL_H=1 -DHAVE_LIBEVENT_OPENSSL=1 -DUSE_SSL_SOCKET=1 -I. -I../../src   -Wall -Werror -DLIBDIR=\"/mesos/mesos-0.28.3/_inst/lib\" -DPKGLIBEXECDIR=\"/mesos/mesos-0.28.3/_inst/libexec/mesos\" -DPKGDATADIR=\"/mesos/mesos-0.28.3/_inst/share/mesos\" -DPKGMODULEDIR=\"/mesos/mesos-0.28.3/_inst/lib/mesos/modules\" -I../../include -I../../3rdparty/libprocess/include -I../../3rdparty/libprocess/3rdparty/stout/include -I../include -I../include/mesos -isystem ../3rdparty/libprocess/3rdparty/boost-1.53.0 -I../3rdparty/libprocess/3rdparty/picojson-1.3.0 -DPICOJSON_USE_INT64 -D__STDC_FORMAT_MACROS -I../3rdparty/libprocess/3rdparty/protobuf-2.5.0/src -I../3rdparty/libprocess/3rdparty/glog-0.3.3/src -I../3rdparty/libprocess/3rdparty/glog-0.3.3/src -I../3rdparty/leveldb-1.4/include -I../3rdparty/zookeeper-3.4.5/src/c/include -I../3rdparty/zookeeper-3.4.5/src/c/generated -I../3rdparty/libprocess/3rdparty/protobuf-2.5.0/src -I/usr/include/subversion-1 -I/usr/include/apr-1 -I/usr/include/apr-1.0  -pthread -g1 -O0 -Wno-unused-local-typedefs -std=c++11 -MT examples/test_framework-test_framework.o -MD -MP -MF examples/.deps/test_framework-test_framework.Tpo -c -o examples/test_framework-test_framework.o `test -f 'examples/test_framework.cpp' || echo '../../src/'`examples/test_framework.cpp
g++ -DPACKAGE_NAME=\"mesos\" -DPACKAGE_TARNAME=\"mesos\" -DPACKAGE_VERSION=\"0.28.3\" -DPACKAGE_STRING=\"mesos\ 0.28.3\" -DPACKAGE_BUGREPORT=\"\" -DPACKAGE_URL=\"\" -DPACKAGE=\"mesos\" -DVERSION=\"0.28.3\" -DSTDC_HEADERS=1 -DHAVE_SYS_TYPES_H=1 -DHAVE_SYS_STAT_H=1 -DHAVE_STDLIB_H=1 -DHAVE_STRING_H=1 -DHAVE_MEMORY_H=1 -DHAVE_STRINGS_H=1 -DHAVE_INTTYPES_H=1 -DHAVE_STDINT_H=1 -DHAVE_UNISTD_H=1 -DHAVE_DLFCN_H=1 -DLT_OBJDIR=\".libs/\" -DHAVE_PTHREAD_PRIO_INHERIT=1 -DHAVE_PTHREAD=1 -DHAVE_LIBZ=1 -DHAVE_LIBCURL=1 -DHAVE_APR_POOLS_H=1 -DHAVE_LIBAPR_1=1 -DHAVE_SVN_VERSION_H=1 -DHAVE_LIBSVN_SUBR_1=1 -DHAVE_SVN_DELTA_H=1 -DHAVE_LIBSVN_DELTA_1=1 -DHAVE_LIBSASL2=1 -DMESOS_HAS_JAVA=1 -DHAVE_PYTHON=\"2.7\" -DMESOS_HAS_PYTHON=1 -DHAVE_EVENT2_EVENT_H=1 -DHAVE_LIBEVENT=1 -DHAVE_EVENT2_THREAD_H=1 -DHAVE_LIBEVENT_PTHREADS=1 -DHAVE_OPENSSL_SSL_H=1 -DHAVE_LIBSSL=1 -DHAVE_LIBCRYPTO=1 -DHAVE_EVENT2_BUFFEREVENT_SSL_H=1 -DHAVE_LIBEVENT_OPENSSL=1 -DUSE_SSL_SOCKET=1 -I. -I../../src   -Wall -Werror -DLIBDIR=\"/mesos/mesos-0.28.3/_inst/lib\" -DPKGLIBEXECDIR=\"/mesos/mesos-0.28.3/_inst/libexec/mesos\" -DPKGDATADIR=\"/mesos/mesos-0.28.3/_inst/share/mesos\" -DPKGMODULEDIR=\"/mesos/mesos-0.28.3/_inst/lib/mesos/modules\" -I../../include -I../../3rdparty/libprocess/include -I../../3rdparty/libprocess/3rdparty/stout/include -I../include -I../include/mesos -isystem ../3rdparty/libprocess/3rdparty/boost-1.53.0 -I../3rdparty/libprocess/3rdparty/picojson-1.3.0 -DPICOJSON_USE_INT64 -D__STDC_FORMAT_MACROS -I../3rdparty/libprocess/3rdparty/protobuf-2.5.0/src -I../3rdparty/libprocess/3rdparty/glog-0.3.3/src -I../3rdparty/libprocess/3rdparty/glog-0.3.3/src -I../3rdparty/leveldb-1.4/include -I../3rdparty/zookeeper-3.4.5/src/c/include -I../3rdparty/zookeeper-3.4.5/src/c/generated -I../3rdparty/libprocess/3rdparty/protobuf-2.5.0/src -I/usr/include/subversion-1 -I/usr/include/apr-1 -I/usr/include/apr-1.0  -pthread -g1 -O0 -Wno-unused-local-typedefs -std=c++11 -MT examples/test_executor-test_executor.o -MD -MP -MF examples/.deps/test_executor-test_executor.Tpo -c -o examples/test_executor-test_executor.o `test -f 'examples/test_executor.cpp' || echo '../../src/'`examples/test_executor.cpp
g++ -DPACKAGE_NAME=\"mesos\" -DPACKAGE_TARNAME=\"mesos\" -DPACKAGE_VERSION=\"0.28.3\" -DPACKAGE_STRING=\"mesos\ 0.28.3\" -DPACKAGE_BUGREPORT=\"\" -DPACKAGE_URL=\"\" -DPACKAGE=\"mesos\" -DVERSION=\"0.28.3\" -DSTDC_HEADERS=1 -DHAVE_SYS_TYPES_H=1 -DHAVE_SYS_STAT_H=1 -DHAVE_STDLIB_H=1 -DHAVE_STRING_H=1 -DHAVE_MEMORY_H=1 -DHAVE_STRINGS_H=1 -DHAVE_INTTYPES_H=1 -DHAVE_STDINT_H=1 -DHAVE_UNISTD_H=1 -DHAVE_DLFCN_H=1 -DLT_OBJDIR=\".libs/\" -DHAVE_PTHREAD_PRIO_INHERIT=1 -DHAVE_PTHREAD=1 -DHAVE_LIBZ=1 -DHAVE_LIBCURL=1 -DHAVE_APR_POOLS_H=1 -DHAVE_LIBAPR_1=1 -DHAVE_SVN_VERSION_H=1 -DHAVE_LIBSVN_SUBR_1=1 -DHAVE_SVN_DELTA_H=1 -DHAVE_LIBSVN_DELTA_1=1 -DHAVE_LIBSASL2=1 -DMESOS_HAS_JAVA=1 -DHAVE_PYTHON=\"2.7\" -DMESOS_HAS_PYTHON=1 -DHAVE_EVENT2_EVENT_H=1 -DHAVE_LIBEVENT=1 -DHAVE_EVENT2_THREAD_H=1 -DHAVE_LIBEVENT_PTHREADS=1 -DHAVE_OPENSSL_SSL_H=1 -DHAVE_LIBSSL=1 -DHAVE_LIBCRYPTO=1 -DHAVE_EVENT2_BUFFEREVENT_SSL_H=1 -DHAVE_LIBEVENT_OPENSSL=1 -DUSE_SSL_SOCKET=1 -I. -I../../src   -Wall -Werror -DLIBDIR=\"/mesos/mesos-0.28.3/_inst/lib\" -DPKGLIBEXECDIR=\"/mesos/mesos-0.28.3/_inst/libexec/mesos\" -DPKGDATADIR=\"/mesos/mesos-0.28.3/_inst/share/mesos\" -DPKGMODULEDIR=\"/mesos/mesos-0.28.3/_inst/lib/mesos/modules\" -I../../include -I../../3rdparty/libprocess/include -I../../3rdparty/libprocess/3rdparty/stout/include -I../include -I../include/mesos -isystem ../3rdparty/libprocess/3rdparty/boost-1.53.0 -I../3rdparty/libprocess/3rdparty/picojson-1.3.0 -DPICOJSON_USE_INT64 -D__STDC_FORMAT_MACROS -I../3rdparty/libprocess/3rdparty/protobuf-2.5.0/src -I../3rdparty/libprocess/3rdparty/glog-0.3.3/src -I../3rdparty/libprocess/3rdparty/glog-0.3.3/src -I../3rdparty/leveldb-1.4/include -I../3rdparty/zookeeper-3.4.5/src/c/include -I../3rdparty/zookeeper-3.4.5/src/c/generated -I../3rdparty/libprocess/3rdparty/protobuf-2.5.0/src -I/usr/include/subversion-1 -I/usr/include/apr-1 -I/usr/include/apr-1.0  -pthread -g1 -O0 -Wno-unused-local-typedefs -std=c++11 -MT examples/test_http_executor-test_http_executor.o -MD -MP -MF examples/.deps/test_http_executor-test_http_executor.Tpo -c -o examples/test_http_executor-test_http_executor.o `test -f 'examples/test_http_executor.cpp' || echo '../../src/'`examples/test_http_executor.cpp
g++ -DPACKAGE_NAME=\"mesos\" -DPACKAGE_TARNAME=\"mesos\" -DPACKAGE_VERSION=\"0.28.3\" -DPACKAGE_STRING=\"mesos\ 0.28.3\" -DPACKAGE_BUGREPORT=\"\" -DPACKAGE_URL=\"\" -DPACKAGE=\"mesos\" -DVERSION=\"0.28.3\" -DSTDC_HEADERS=1 -DHAVE_SYS_TYPES_H=1 -DHAVE_SYS_STAT_H=1 -DHAVE_STDLIB_H=1 -DHAVE_STRING_H=1 -DHAVE_MEMORY_H=1 -DHAVE_STRINGS_H=1 -DHAVE_INTTYPES_H=1 -DHAVE_STDINT_H=1 -DHAVE_UNISTD_H=1 -DHAVE_DLFCN_H=1 -DLT_OBJDIR=\".libs/\" -DHAVE_PTHREAD_PRIO_INHERIT=1 -DHAVE_PTHREAD=1 -DHAVE_LIBZ=1 -DHAVE_LIBCURL=1 -DHAVE_APR_POOLS_H=1 -DHAVE_LIBAPR_1=1 -DHAVE_SVN_VERSION_H=1 -DHAVE_LIBSVN_SUBR_1=1 -DHAVE_SVN_DELTA_H=1 -DHAVE_LIBSVN_DELTA_1=1 -DHAVE_LIBSASL2=1 -DMESOS_HAS_JAVA=1 -DHAVE_PYTHON=\"2.7\" -DMESOS_HAS_PYTHON=1 -DHAVE_EVENT2_EVENT_H=1 -DHAVE_LIBEVENT=1 -DHAVE_EVENT2_THREAD_H=1 -DHAVE_LIBEVENT_PTHREADS=1 -DHAVE_OPENSSL_SSL_H=1 -DHAVE_LIBSSL=1 -DHAVE_LIBCRYPTO=1 -DHAVE_EVENT2_BUFFEREVENT_SSL_H=1 -DHAVE_LIBEVENT_OPENSSL=1 -DUSE_SSL_SOCKET=1 -I. -I../../src   -Wall -Werror -DLIBDIR=\"/mesos/mesos-0.28.3/_inst/lib\" -DPKGLIBEXECDIR=\"/mesos/mesos-0.28.3/_inst/libexec/mesos\" -DPKGDATADIR=\"/mesos/mesos-0.28.3/_inst/share/mesos\" -DPKGMODULEDIR=\"/mesos/mesos-0.28.3/_inst/lib/mesos/modules\" -I../../include -I../../3rdparty/libprocess/include -I../../3rdparty/libprocess/3rdparty/stout/include -I../include -I../include/mesos -isystem ../3rdparty/libprocess/3rdparty/boost-1.53.0 -I../3rdparty/libprocess/3rdparty/picojson-1.3.0 -DPICOJSON_USE_INT64 -D__STDC_FORMAT_MACROS -I../3rdparty/libprocess/3rdparty/protobuf-2.5.0/src -I../3rdparty/libprocess/3rdparty/glog-0.3.3/src -I../3rdparty/libprocess/3rdparty/glog-0.3.3/src -I../3rdparty/leveldb-1.4/include -I../3rdparty/zookeeper-3.4.5/src/c/include -I../3rdparty/zookeeper-3.4.5/src/c/generated -I../3rdparty/libprocess/3rdparty/protobuf-2.5.0/src -I/usr/include/subversion-1 -I/usr/include/apr-1 -I/usr/include/apr-1.0  -pthread -g1 -O0 -Wno-unused-local-typedefs -std=c++11 -MT examples/long_lived_framework-long_lived_framework.o -MD -MP -MF examples/.deps/long_lived_framework-long_lived_framework.Tpo -c -o examples/long_lived_framework-long_lived_framework.o `test -f 'examples/long_lived_framework.cpp' || echo '../../src/'`examples/long_lived_framework.cpp
g++ -DPACKAGE_NAME=\"mesos\" -DPACKAGE_TARNAME=\"mesos\" -DPACKAGE_VERSION=\"0.28.3\" -DPACKAGE_STRING=\"mesos\ 0.28.3\" -DPACKAGE_BUGREPORT=\"\" -DPACKAGE_URL=\"\" -DPACKAGE=\"mesos\" -DVERSION=\"0.28.3\" -DSTDC_HEADERS=1 -DHAVE_SYS_TYPES_H=1 -DHAVE_SYS_STAT_H=1 -DHAVE_STDLIB_H=1 -DHAVE_STRING_H=1 -DHAVE_MEMORY_H=1 -DHAVE_STRINGS_H=1 -DHAVE_INTTYPES_H=1 -DHAVE_STDINT_H=1 -DHAVE_UNISTD_H=1 -DHAVE_DLFCN_H=1 -DLT_OBJDIR=\".libs/\" -DHAVE_PTHREAD_PRIO_INHERIT=1 -DHAVE_PTHREAD=1 -DHAVE_LIBZ=1 -DHAVE_LIBCURL=1 -DHAVE_APR_POOLS_H=1 -DHAVE_LIBAPR_1=1 -DHAVE_SVN_VERSION_H=1 -DHAVE_LIBSVN_SUBR_1=1 -DHAVE_SVN_DELTA_H=1 -DHAVE_LIBSVN_DELTA_1=1 -DHAVE_LIBSASL2=1 -DMESOS_HAS_JAVA=1 -DHAVE_PYTHON=\"2.7\" -DMESOS_HAS_PYTHON=1 -DHAVE_EVENT2_EVENT_H=1 -DHAVE_LIBEVENT=1 -DHAVE_EVENT2_THREAD_H=1 -DHAVE_LIBEVENT_PTHREADS=1 -DHAVE_OPENSSL_SSL_H=1 -DHAVE_LIBSSL=1 -DHAVE_LIBCRYPTO=1 -DHAVE_EVENT2_BUFFEREVENT_SSL_H=1 -DHAVE_LIBEVENT_OPENSSL=1 -DUSE_SSL_SOCKET=1 -I. -I../../src   -Wall -Werror -DLIBDIR=\"/mesos/mesos-0.28.3/_inst/lib\" -DPKGLIBEXECDIR=\"/mesos/mesos-0.28.3/_inst/libexec/mesos\" -DPKGDATADIR=\"/mesos/mesos-0.28.3/_inst/share/mesos\" -DPKGMODULEDIR=\"/mesos/mesos-0.28.3/_inst/lib/mesos/modules\" -I../../include -I../../3rdparty/libprocess/include -I../../3rdparty/libprocess/3rdparty/stout/include -I../include -I../include/mesos -isystem ../3rdparty/libprocess/3rdparty/boost-1.53.0 -I../3rdparty/libprocess/3rdparty/picojson-1.3.0 -DPICOJSON_USE_INT64 -D__STDC_FORMAT_MACROS -I../3rdparty/libprocess/3rdparty/protobuf-2.5.0/src -I../3rdparty/libprocess/3rdparty/glog-0.3.3/src -I../3rdparty/libprocess/3rdparty/glog-0.3.3/src -I../3rdparty/leveldb-1.4/include -I../3rdparty/zookeeper-3.4.5/src/c/include -I../3rdparty/zookeeper-3.4.5/src/c/generated -I../3rdparty/libprocess/3rdparty/protobuf-2.5.0/src -I/usr/include/subversion-1 -I/usr/include/apr-1 -I/usr/include/apr-1.0  -pthread -g1 -O0 -Wno-unused-local-typedefs -std=c++11 -MT examples/long_lived_executor-long_lived_executor.o -MD -MP -MF examples/.deps/long_lived_executor-long_lived_executor.Tpo -c -o examples/long_lived_executor-long_lived_executor.o `test -f 'examples/long_lived_executor.cpp' || echo '../../src/'`examples/long_lived_executor.cpp
g++ -DPACKAGE_NAME=\"mesos\" -DPACKAGE_TARNAME=\"mesos\" -DPACKAGE_VERSION=\"0.28.3\" -DPACKAGE_STRING=\"mesos\ 0.28.3\" -DPACKAGE_BUGREPORT=\"\" -DPACKAGE_URL=\"\" -DPACKAGE=\"mesos\" -DVERSION=\"0.28.3\" -DSTDC_HEADERS=1 -DHAVE_SYS_TYPES_H=1 -DHAVE_SYS_STAT_H=1 -DHAVE_STDLIB_H=1 -DHAVE_STRING_H=1 -DHAVE_MEMORY_H=1 -DHAVE_STRINGS_H=1 -DHAVE_INTTYPES_H=1 -DHAVE_STDINT_H=1 -DHAVE_UNISTD_H=1 -DHAVE_DLFCN_H=1 -DLT_OBJDIR=\".libs/\" -DHAVE_PTHREAD_PRIO_INHERIT=1 -DHAVE_PTHREAD=1 -DHAVE_LIBZ=1 -DHAVE_LIBCURL=1 -DHAVE_APR_POOLS_H=1 -DHAVE_LIBAPR_1=1 -DHAVE_SVN_VERSION_H=1 -DHAVE_LIBSVN_SUBR_1=1 -DHAVE_SVN_DELTA_H=1 -DHAVE_LIBSVN_DELTA_1=1 -DHAVE_LIBSASL2=1 -DMESOS_HAS_JAVA=1 -DHAVE_PYTHON=\"2.7\" -DMESOS_HAS_PYTHON=1 -DHAVE_EVENT2_EVENT_H=1 -DHAVE_LIBEVENT=1 -DHAVE_EVENT2_THREAD_H=1 -DHAVE_LIBEVENT_PTHREADS=1 -DHAVE_OPENSSL_SSL_H=1 -DHAVE_LIBSSL=1 -DHAVE_LIBCRYPTO=1 -DHAVE_EVENT2_BUFFEREVENT_SSL_H=1 -DHAVE_LIBEVENT_OPENSSL=1 -DUSE_SSL_SOCKET=1 -I. -I../../src   -Wall -Werror -DLIBDIR=\"/mesos/mesos-0.28.3/_inst/lib\" -DPKGLIBEXECDIR=\"/mesos/mesos-0.28.3/_inst/libexec/mesos\" -DPKGDATADIR=\"/mesos/mesos-0.28.3/_inst/share/mesos\" -DPKGMODULEDIR=\"/mesos/mesos-0.28.3/_inst/lib/mesos/modules\" -I../../include -I../../3rdparty/libprocess/include -I../../3rdparty/libprocess/3rdparty/stout/include -I../include -I../include/mesos -isystem ../3rdparty/libprocess/3rdparty/boost-1.53.0 -I../3rdparty/libprocess/3rdparty/picojson-1.3.0 -DPICOJSON_USE_INT64 -D__STDC_FORMAT_MACROS -I../3rdparty/libprocess/3rdparty/protobuf-2.5.0/src -I../3rdparty/libprocess/3rdparty/glog-0.3.3/src -I../3rdparty/libprocess/3rdparty/glog-0.3.3/src -I../3rdparty/leveldb-1.4/include -I../3rdparty/zookeeper-3.4.5/src/c/include -I../3rdparty/zookeeper-3.4.5/src/c/generated -I../3rdparty/libprocess/3rdparty/protobuf-2.5.0/src -I/usr/include/subversion-1 -I/usr/include/apr-1 -I/usr/include/apr-1.0  -pthread -g1 -O0 -Wno-unused-local-typedefs -std=c++11 -MT examples/no_executor_framework-no_executor_framework.o -MD -MP -MF examples/.deps/no_executor_framework-no_executor_framework.Tpo -c -o examples/no_executor_framework-no_executor_framework.o `test -f 'examples/no_executor_framework.cpp' || echo '../../src/'`examples/no_executor_framework.cpp
g++ -DPACKAGE_NAME=\"mesos\" -DPACKAGE_TARNAME=\"mesos\" -DPACKAGE_VERSION=\"0.28.3\" -DPACKAGE_STRING=\"mesos\ 0.28.3\" -DPACKAGE_BUGREPORT=\"\" -DPACKAGE_URL=\"\" -DPACKAGE=\"mesos\" -DVERSION=\"0.28.3\" -DSTDC_HEADERS=1 -DHAVE_SYS_TYPES_H=1 -DHAVE_SYS_STAT_H=1 -DHAVE_STDLIB_H=1 -DHAVE_STRING_H=1 -DHAVE_MEMORY_H=1 -DHAVE_STRINGS_H=1 -DHAVE_INTTYPES_H=1 -DHAVE_STDINT_H=1 -DHAVE_UNISTD_H=1 -DHAVE_DLFCN_H=1 -DLT_OBJDIR=\".libs/\" -DHAVE_PTHREAD_PRIO_INHERIT=1 -DHAVE_PTHREAD=1 -DHAVE_LIBZ=1 -DHAVE_LIBCURL=1 -DHAVE_APR_POOLS_H=1 -DHAVE_LIBAPR_1=1 -DHAVE_SVN_VERSION_H=1 -DHAVE_LIBSVN_SUBR_1=1 -DHAVE_SVN_DELTA_H=1 -DHAVE_LIBSVN_DELTA_1=1 -DHAVE_LIBSASL2=1 -DMESOS_HAS_JAVA=1 -DHAVE_PYTHON=\"2.7\" -DMESOS_HAS_PYTHON=1 -DHAVE_EVENT2_EVENT_H=1 -DHAVE_LIBEVENT=1 -DHAVE_EVENT2_THREAD_H=1 -DHAVE_LIBEVENT_PTHREADS=1 -DHAVE_OPENSSL_SSL_H=1 -DHAVE_LIBSSL=1 -DHAVE_LIBCRYPTO=1 -DHAVE_EVENT2_BUFFEREVENT_SSL_H=1 -DHAVE_LIBEVENT_OPENSSL=1 -DUSE_SSL_SOCKET=1 -I. -I../../src   -Wall -Werror -DLIBDIR=\"/mesos/mesos-0.28.3/_inst/lib\" -DPKGLIBEXECDIR=\"/mesos/mesos-0.28.3/_inst/libexec/mesos\" -DPKGDATADIR=\"/mesos/mesos-0.28.3/_inst/share/mesos\" -DPKGMODULEDIR=\"/mesos/mesos-0.28.3/_inst/lib/mesos/modules\" -I../../include -I../../3rdparty/libprocess/include -I../../3rdparty/libprocess/3rdparty/stout/include -I../include -I../include/mesos -isystem ../3rdparty/libprocess/3rdparty/boost-1.53.0 -I../3rdparty/libprocess/3rdparty/picojson-1.3.0 -DPICOJSON_USE_INT64 -D__STDC_FORMAT_MACROS -I../3rdparty/libprocess/3rdparty/protobuf-2.5.0/src -I../3rdparty/libprocess/3rdparty/glog-0.3.3/src -I../3rdparty/libprocess/3rdparty/glog-0.3.3/src -I../3rdparty/leveldb-1.4/include -I../3rdparty/zookeeper-3.4.5/src/c/include -I../3rdparty/zookeeper-3.4.5/src/c/generated -I../3rdparty/libprocess/3rdparty/protobuf-2.5.0/src -I/usr/include/subversion-1 -I/usr/include/apr-1 -I/usr/include/apr-1.0  -pthread -g1 -O0 -Wno-unused-local-typedefs -std=c++11 -MT examples/docker_no_executor_framework-docker_no_executor_framework.o -MD -MP -MF examples/.deps/docker_no_executor_framework-docker_no_executor_framework.Tpo -c -o examples/docker_no_executor_framework-docker_no_executor_framework.o `test -f 'examples/docker_no_executor_framework.cpp' || echo '../../src/'`examples/docker_no_executor_framework.cpp
mv -f examples/.deps/test_executor-test_executor.Tpo examples/.deps/test_executor-test_executor.Po
g++ -DPACKAGE_NAME=\"mesos\" -DPACKAGE_TARNAME=\"mesos\" -DPACKAGE_VERSION=\"0.28.3\" -DPACKAGE_STRING=\"mesos\ 0.28.3\" -DPACKAGE_BUGREPORT=\"\" -DPACKAGE_URL=\"\" -DPACKAGE=\"mesos\" -DVERSION=\"0.28.3\" -DSTDC_HEADERS=1 -DHAVE_SYS_TYPES_H=1 -DHAVE_SYS_STAT_H=1 -DHAVE_STDLIB_H=1 -DHAVE_STRING_H=1 -DHAVE_MEMORY_H=1 -DHAVE_STRINGS_H=1 -DHAVE_INTTYPES_H=1 -DHAVE_STDINT_H=1 -DHAVE_UNISTD_H=1 -DHAVE_DLFCN_H=1 -DLT_OBJDIR=\".libs/\" -DHAVE_PTHREAD_PRIO_INHERIT=1 -DHAVE_PTHREAD=1 -DHAVE_LIBZ=1 -DHAVE_LIBCURL=1 -DHAVE_APR_POOLS_H=1 -DHAVE_LIBAPR_1=1 -DHAVE_SVN_VERSION_H=1 -DHAVE_LIBSVN_SUBR_1=1 -DHAVE_SVN_DELTA_H=1 -DHAVE_LIBSVN_DELTA_1=1 -DHAVE_LIBSASL2=1 -DMESOS_HAS_JAVA=1 -DHAVE_PYTHON=\"2.7\" -DMESOS_HAS_PYTHON=1 -DHAVE_EVENT2_EVENT_H=1 -DHAVE_LIBEVENT=1 -DHAVE_EVENT2_THREAD_H=1 -DHAVE_LIBEVENT_PTHREADS=1 -DHAVE_OPENSSL_SSL_H=1 -DHAVE_LIBSSL=1 -DHAVE_LIBCRYPTO=1 -DHAVE_EVENT2_BUFFEREVENT_SSL_H=1 -DHAVE_LIBEVENT_OPENSSL=1 -DUSE_SSL_SOCKET=1 -I. -I../../src   -Wall -Werror -DLIBDIR=\"/mesos/mesos-0.28.3/_inst/lib\" -DPKGLIBEXECDIR=\"/mesos/mesos-0.28.3/_inst/libexec/mesos\" -DPKGDATADIR=\"/mesos/mesos-0.28.3/_inst/share/mesos\" -DPKGMODULEDIR=\"/mesos/mesos-0.28.3/_inst/lib/mesos/modules\" -I../../include -I../../3rdparty/libprocess/include -I../../3rdparty/libprocess/3rdparty/stout/include -I../include -I../include/mesos -isystem ../3rdparty/libprocess/3rdparty/boost-1.53.0 -I../3rdparty/libprocess/3rdparty/picojson-1.3.0 -DPICOJSON_USE_INT64 -D__STDC_FORMAT_MACROS -I../3rdparty/libprocess/3rdparty/protobuf-2.5.0/src -I../3rdparty/libprocess/3rdparty/glog-0.3.3/src -I../3rdparty/libprocess/3rdparty/glog-0.3.3/src -I../3rdparty/leveldb-1.4/include -I../3rdparty/zookeeper-3.4.5/src/c/include -I../3rdparty/zookeeper-3.4.5/src/c/generated -I../3rdparty/libprocess/3rdparty/protobuf-2.5.0/src -I/usr/include/subversion-1 -I/usr/include/apr-1 -I/usr/include/apr-1.0  -pthread -g1 -O0 -Wno-unused-local-typedefs -std=c++11 -MT examples/balloon_framework-balloon_framework.o -MD -MP -MF examples/.deps/balloon_framework-balloon_framework.Tpo -c -o examples/balloon_framework-balloon_framework.o `test -f 'examples/balloon_framework.cpp' || echo '../../src/'`examples/balloon_framework.cpp
mv -f examples/.deps/long_lived_executor-long_lived_executor.Tpo examples/.deps/long_lived_executor-long_lived_executor.Po
g++ -DPACKAGE_NAME=\"mesos\" -DPACKAGE_TARNAME=\"mesos\" -DPACKAGE_VERSION=\"0.28.3\" -DPACKAGE_STRING=\"mesos\ 0.28.3\" -DPACKAGE_BUGREPORT=\"\" -DPACKAGE_URL=\"\" -DPACKAGE=\"mesos\" -DVERSION=\"0.28.3\" -DSTDC_HEADERS=1 -DHAVE_SYS_TYPES_H=1 -DHAVE_SYS_STAT_H=1 -DHAVE_STDLIB_H=1 -DHAVE_STRING_H=1 -DHAVE_MEMORY_H=1 -DHAVE_STRINGS_H=1 -DHAVE_INTTYPES_H=1 -DHAVE_STDINT_H=1 -DHAVE_UNISTD_H=1 -DHAVE_DLFCN_H=1 -DLT_OBJDIR=\".libs/\" -DHAVE_PTHREAD_PRIO_INHERIT=1 -DHAVE_PTHREAD=1 -DHAVE_LIBZ=1 -DHAVE_LIBCURL=1 -DHAVE_APR_POOLS_H=1 -DHAVE_LIBAPR_1=1 -DHAVE_SVN_VERSION_H=1 -DHAVE_LIBSVN_SUBR_1=1 -DHAVE_SVN_DELTA_H=1 -DHAVE_LIBSVN_DELTA_1=1 -DHAVE_LIBSASL2=1 -DMESOS_HAS_JAVA=1 -DHAVE_PYTHON=\"2.7\" -DMESOS_HAS_PYTHON=1 -DHAVE_EVENT2_EVENT_H=1 -DHAVE_LIBEVENT=1 -DHAVE_EVENT2_THREAD_H=1 -DHAVE_LIBEVENT_PTHREADS=1 -DHAVE_OPENSSL_SSL_H=1 -DHAVE_LIBSSL=1 -DHAVE_LIBCRYPTO=1 -DHAVE_EVENT2_BUFFEREVENT_SSL_H=1 -DHAVE_LIBEVENT_OPENSSL=1 -DUSE_SSL_SOCKET=1 -I. -I../../src   -Wall -Werror -DLIBDIR=\"/mesos/mesos-0.28.3/_inst/lib\" -DPKGLIBEXECDIR=\"/mesos/mesos-0.28.3/_inst/libexec/mesos\" -DPKGDATADIR=\"/mesos/mesos-0.28.3/_inst/share/mesos\" -DPKGMODULEDIR=\"/mesos/mesos-0.28.3/_inst/lib/mesos/modules\" -I../../include -I../../3rdparty/libprocess/include -I../../3rdparty/libprocess/3rdparty/stout/include -I../include -I../include/mesos -isystem ../3rdparty/libprocess/3rdparty/boost-1.53.0 -I../3rdparty/libprocess/3rdparty/picojson-1.3.0 -DPICOJSON_USE_INT64 -D__STDC_FORMAT_MACROS -I../3rdparty/libprocess/3rdparty/protobuf-2.5.0/src -I../3rdparty/libprocess/3rdparty/glog-0.3.3/src -I../3rdparty/libprocess/3rdparty/glog-0.3.3/src -I../3rdparty/leveldb-1.4/include -I../3rdparty/zookeeper-3.4.5/src/c/include -I../3rdparty/zookeeper-3.4.5/src/c/generated -I../3rdparty/libprocess/3rdparty/protobuf-2.5.0/src -I/usr/include/subversion-1 -I/usr/include/apr-1 -I/usr/include/apr-1.0  -pthread -g1 -O0 -Wno-unused-local-typedefs -std=c++11 -MT examples/balloon_executor-balloon_executor.o -MD -MP -MF examples/.deps/balloon_executor-balloon_executor.Tpo -c -o examples/balloon_executor-balloon_executor.o `test -f 'examples/balloon_executor.cpp' || echo '../../src/'`examples/balloon_executor.cpp
mv -f examples/.deps/docker_no_executor_framework-docker_no_executor_framework.Tpo examples/.deps/docker_no_executor_framework-docker_no_executor_framework.Po
g++ -DPACKAGE_NAME=\"mesos\" -DPACKAGE_TARNAME=\"mesos\" -DPACKAGE_VERSION=\"0.28.3\" -DPACKAGE_STRING=\"mesos\ 0.28.3\" -DPACKAGE_BUGREPORT=\"\" -DPACKAGE_URL=\"\" -DPACKAGE=\"mesos\" -DVERSION=\"0.28.3\" -DSTDC_HEADERS=1 -DHAVE_SYS_TYPES_H=1 -DHAVE_SYS_STAT_H=1 -DHAVE_STDLIB_H=1 -DHAVE_STRING_H=1 -DHAVE_MEMORY_H=1 -DHAVE_STRINGS_H=1 -DHAVE_INTTYPES_H=1 -DHAVE_STDINT_H=1 -DHAVE_UNISTD_H=1 -DHAVE_DLFCN_H=1 -DLT_OBJDIR=\".libs/\" -DHAVE_PTHREAD_PRIO_INHERIT=1 -DHAVE_PTHREAD=1 -DHAVE_LIBZ=1 -DHAVE_LIBCURL=1 -DHAVE_APR_POOLS_H=1 -DHAVE_LIBAPR_1=1 -DHAVE_SVN_VERSION_H=1 -DHAVE_LIBSVN_SUBR_1=1 -DHAVE_SVN_DELTA_H=1 -DHAVE_LIBSVN_DELTA_1=1 -DHAVE_LIBSASL2=1 -DMESOS_HAS_JAVA=1 -DHAVE_PYTHON=\"2.7\" -DMESOS_HAS_PYTHON=1 -DHAVE_EVENT2_EVENT_H=1 -DHAVE_LIBEVENT=1 -DHAVE_EVENT2_THREAD_H=1 -DHAVE_LIBEVENT_PTHREADS=1 -DHAVE_OPENSSL_SSL_H=1 -DHAVE_LIBSSL=1 -DHAVE_LIBCRYPTO=1 -DHAVE_EVENT2_BUFFEREVENT_SSL_H=1 -DHAVE_LIBEVENT_OPENSSL=1 -DUSE_SSL_SOCKET=1 -I. -I../../src   -Wall -Werror -DLIBDIR=\"/mesos/mesos-0.28.3/_inst/lib\" -DPKGLIBEXECDIR=\"/mesos/mesos-0.28.3/_inst/libexec/mesos\" -DPKGDATADIR=\"/mesos/mesos-0.28.3/_inst/share/mesos\" -DPKGMODULEDIR=\"/mesos/mesos-0.28.3/_inst/lib/mesos/modules\" -I../../include -I../../3rdparty/libprocess/include -I../../3rdparty/libprocess/3rdparty/stout/include -I../include -I../include/mesos -isystem ../3rdparty/libprocess/3rdparty/boost-1.53.0 -I../3rdparty/libprocess/3rdparty/picojson-1.3.0 -DPICOJSON_USE_INT64 -D__STDC_FORMAT_MACROS -I../3rdparty/libprocess/3rdparty/protobuf-2.5.0/src -I../3rdparty/libprocess/3rdparty/glog-0.3.3/src -I../3rdparty/libprocess/3rdparty/glog-0.3.3/src -I../3rdparty/leveldb-1.4/include -I../3rdparty/zookeeper-3.4.5/src/c/include -I../3rdparty/zookeeper-3.4.5/src/c/generated -I../3rdparty/libprocess/3rdparty/protobuf-2.5.0/src -I/usr/include/subversion-1 -I/usr/include/apr-1 -I/usr/include/apr-1.0  -pthread -g1 -O0 -Wno-unused-local-typedefs -std=c++11 -MT examples/load_generator_framework-load_generator_framework.o -MD -MP -MF examples/.deps/load_generator_framework-load_generator_framework.Tpo -c -o examples/load_generator_framework-load_generator_framework.o `test -f 'examples/load_generator_framework.cpp' || echo '../../src/'`examples/load_generator_framework.cpp
mv -f examples/.deps/long_lived_framework-long_lived_framework.Tpo examples/.deps/long_lived_framework-long_lived_framework.Po
g++ -DPACKAGE_NAME=\"mesos\" -DPACKAGE_TARNAME=\"mesos\" -DPACKAGE_VERSION=\"0.28.3\" -DPACKAGE_STRING=\"mesos\ 0.28.3\" -DPACKAGE_BUGREPORT=\"\" -DPACKAGE_URL=\"\" -DPACKAGE=\"mesos\" -DVERSION=\"0.28.3\" -DSTDC_HEADERS=1 -DHAVE_SYS_TYPES_H=1 -DHAVE_SYS_STAT_H=1 -DHAVE_STDLIB_H=1 -DHAVE_STRING_H=1 -DHAVE_MEMORY_H=1 -DHAVE_STRINGS_H=1 -DHAVE_INTTYPES_H=1 -DHAVE_STDINT_H=1 -DHAVE_UNISTD_H=1 -DHAVE_DLFCN_H=1 -DLT_OBJDIR=\".libs/\" -DHAVE_PTHREAD_PRIO_INHERIT=1 -DHAVE_PTHREAD=1 -DHAVE_LIBZ=1 -DHAVE_LIBCURL=1 -DHAVE_APR_POOLS_H=1 -DHAVE_LIBAPR_1=1 -DHAVE_SVN_VERSION_H=1 -DHAVE_LIBSVN_SUBR_1=1 -DHAVE_SVN_DELTA_H=1 -DHAVE_LIBSVN_DELTA_1=1 -DHAVE_LIBSASL2=1 -DMESOS_HAS_JAVA=1 -DHAVE_PYTHON=\"2.7\" -DMESOS_HAS_PYTHON=1 -DHAVE_EVENT2_EVENT_H=1 -DHAVE_LIBEVENT=1 -DHAVE_EVENT2_THREAD_H=1 -DHAVE_LIBEVENT_PTHREADS=1 -DHAVE_OPENSSL_SSL_H=1 -DHAVE_LIBSSL=1 -DHAVE_LIBCRYPTO=1 -DHAVE_EVENT2_BUFFEREVENT_SSL_H=1 -DHAVE_LIBEVENT_OPENSSL=1 -DUSE_SSL_SOCKET=1 -I. -I../../src   -Wall -Werror -DLIBDIR=\"/mesos/mesos-0.28.3/_inst/lib\" -DPKGLIBEXECDIR=\"/mesos/mesos-0.28.3/_inst/libexec/mesos\" -DPKGDATADIR=\"/mesos/mesos-0.28.3/_inst/share/mesos\" -DPKGMODULEDIR=\"/mesos/mesos-0.28.3/_inst/lib/mesos/modules\" -I../../include -I../../3rdparty/libprocess/include -I../../3rdparty/libprocess/3rdparty/stout/include -I../include -I../include/mesos -isystem ../3rdparty/libprocess/3rdparty/boost-1.53.0 -I../3rdparty/libprocess/3rdparty/picojson-1.3.0 -DPICOJSON_USE_INT64 -D__STDC_FORMAT_MACROS -I../3rdparty/libprocess/3rdparty/protobuf-2.5.0/src -I../3rdparty/libprocess/3rdparty/glog-0.3.3/src -I../3rdparty/libprocess/3rdparty/glog-0.3.3/src -I../3rdparty/leveldb-1.4/include -I../3rdparty/zookeeper-3.4.5/src/c/include -I../3rdparty/zookeeper-3.4.5/src/c/generated -I../3rdparty/libprocess/3rdparty/protobuf-2.5.0/src -I/usr/include/subversion-1 -I/usr/include/apr-1 -I/usr/include/apr-1.0  -pthread -g1 -O0 -Wno-unused-local-typedefs -std=c++11 -MT examples/persistent_volume_framework-persistent_volume_framework.o -MD -MP -MF examples/.deps/persistent_volume_framework-persistent_volume_framework.Tpo -c -o examples/persistent_volume_framework-persistent_volume_framework.o `test -f 'examples/persistent_volume_framework.cpp' || echo '../../src/'`examples/persistent_volume_framework.cpp
mv -f examples/.deps/test_framework-test_framework.Tpo examples/.deps/test_framework-test_framework.Po
g++ -DPACKAGE_NAME=\"mesos\" -DPACKAGE_TARNAME=\"mesos\" -DPACKAGE_VERSION=\"0.28.3\" -DPACKAGE_STRING=\"mesos\ 0.28.3\" -DPACKAGE_BUGREPORT=\"\" -DPACKAGE_URL=\"\" -DPACKAGE=\"mesos\" -DVERSION=\"0.28.3\" -DSTDC_HEADERS=1 -DHAVE_SYS_TYPES_H=1 -DHAVE_SYS_STAT_H=1 -DHAVE_STDLIB_H=1 -DHAVE_STRING_H=1 -DHAVE_MEMORY_H=1 -DHAVE_STRINGS_H=1 -DHAVE_INTTYPES_H=1 -DHAVE_STDINT_H=1 -DHAVE_UNISTD_H=1 -DHAVE_DLFCN_H=1 -DLT_OBJDIR=\".libs/\" -DHAVE_PTHREAD_PRIO_INHERIT=1 -DHAVE_PTHREAD=1 -DHAVE_LIBZ=1 -DHAVE_LIBCURL=1 -DHAVE_APR_POOLS_H=1 -DHAVE_LIBAPR_1=1 -DHAVE_SVN_VERSION_H=1 -DHAVE_LIBSVN_SUBR_1=1 -DHAVE_SVN_DELTA_H=1 -DHAVE_LIBSVN_DELTA_1=1 -DHAVE_LIBSASL2=1 -DMESOS_HAS_JAVA=1 -DHAVE_PYTHON=\"2.7\" -DMESOS_HAS_PYTHON=1 -DHAVE_EVENT2_EVENT_H=1 -DHAVE_LIBEVENT=1 -DHAVE_EVENT2_THREAD_H=1 -DHAVE_LIBEVENT_PTHREADS=1 -DHAVE_OPENSSL_SSL_H=1 -DHAVE_LIBSSL=1 -DHAVE_LIBCRYPTO=1 -DHAVE_EVENT2_BUFFEREVENT_SSL_H=1 -DHAVE_LIBEVENT_OPENSSL=1 -DUSE_SSL_SOCKET=1 -I. -I../../src   -Wall -Werror -DLIBDIR=\"/mesos/mesos-0.28.3/_inst/lib\" -DPKGLIBEXECDIR=\"/mesos/mesos-0.28.3/_inst/libexec/mesos\" -DPKGDATADIR=\"/mesos/mesos-0.28.3/_inst/share/mesos\" -DPKGMODULEDIR=\"/mesos/mesos-0.28.3/_inst/lib/mesos/modules\" -I../../include -I../../3rdparty/libprocess/include -I../../3rdparty/libprocess/3rdparty/stout/include -I../include -I../include/mesos -isystem ../3rdparty/libprocess/3rdparty/boost-1.53.0 -I../3rdparty/libprocess/3rdparty/picojson-1.3.0 -DPICOJSON_USE_INT64 -D__STDC_FORMAT_MACROS -I../3rdparty/libprocess/3rdparty/protobuf-2.5.0/src -I../3rdparty/libprocess/3rdparty/glog-0.3.3/src -I../3rdparty/libprocess/3rdparty/glog-0.3.3/src -I../3rdparty/leveldb-1.4/include -I../3rdparty/zookeeper-3.4.5/src/c/include -I../3rdparty/zookeeper-3.4.5/src/c/generated -I../3rdparty/libprocess/3rdparty/protobuf-2.5.0/src -DSOURCE_DIR=\"/mesos/mesos-0.28.3/_build/..\" -DBUILD_DIR=\"/mesos/mesos-0.28.3/_build\" -I../3rdparty/libprocess/3rdparty/gmock-1.7.0/gtest/include -I../3rdparty/libprocess/3rdparty/gmock-1.7.0/include -DTESTLIBEXECDIR=\"/mesos/mesos-0.28.3/_inst/libexec/mesos/tests\" -DSBINDIR=\"/mesos/mesos-0.28.3/_inst/sbin\" -I/usr/lib/jvm/java-1.8.0-openjdk-1.8.0.111-1.b15.el7_2.x86_64/include -I/usr/lib/jvm/java-1.8.0-openjdk-1.8.0.111-1.b15.el7_2.x86_64/include/linux -DZOOKEEPER_VERSION=\"3.4.5\" -I/usr/include/subversion-1 -I/usr/include/apr-1 -I/usr/include/apr-1.0  -pthread -g1 -O0 -Wno-unused-local-typedefs -std=c++11 -MT tests/containerizer/memory_test_helper-memory_test_helper_main.o -MD -MP -MF tests/containerizer/.deps/memory_test_helper-memory_test_helper_main.Tpo -c -o tests/containerizer/memory_test_helper-memory_test_helper_main.o `test -f 'tests/containerizer/memory_test_helper_main.cpp' || echo '../../src/'`tests/containerizer/memory_test_helper_main.cpp
mv -f examples/.deps/test_http_executor-test_http_executor.Tpo examples/.deps/test_http_executor-test_http_executor.Po
g++ -DPACKAGE_NAME=\"mesos\" -DPACKAGE_TARNAME=\"mesos\" -DPACKAGE_VERSION=\"0.28.3\" -DPACKAGE_STRING=\"mesos\ 0.28.3\" -DPACKAGE_BUGREPORT=\"\" -DPACKAGE_URL=\"\" -DPACKAGE=\"mesos\" -DVERSION=\"0.28.3\" -DSTDC_HEADERS=1 -DHAVE_SYS_TYPES_H=1 -DHAVE_SYS_STAT_H=1 -DHAVE_STDLIB_H=1 -DHAVE_STRING_H=1 -DHAVE_MEMORY_H=1 -DHAVE_STRINGS_H=1 -DHAVE_INTTYPES_H=1 -DHAVE_STDINT_H=1 -DHAVE_UNISTD_H=1 -DHAVE_DLFCN_H=1 -DLT_OBJDIR=\".libs/\" -DHAVE_PTHREAD_PRIO_INHERIT=1 -DHAVE_PTHREAD=1 -DHAVE_LIBZ=1 -DHAVE_LIBCURL=1 -DHAVE_APR_POOLS_H=1 -DHAVE_LIBAPR_1=1 -DHAVE_SVN_VERSION_H=1 -DHAVE_LIBSVN_SUBR_1=1 -DHAVE_SVN_DELTA_H=1 -DHAVE_LIBSVN_DELTA_1=1 -DHAVE_LIBSASL2=1 -DMESOS_HAS_JAVA=1 -DHAVE_PYTHON=\"2.7\" -DMESOS_HAS_PYTHON=1 -DHAVE_EVENT2_EVENT_H=1 -DHAVE_LIBEVENT=1 -DHAVE_EVENT2_THREAD_H=1 -DHAVE_LIBEVENT_PTHREADS=1 -DHAVE_OPENSSL_SSL_H=1 -DHAVE_LIBSSL=1 -DHAVE_LIBCRYPTO=1 -DHAVE_EVENT2_BUFFEREVENT_SSL_H=1 -DHAVE_LIBEVENT_OPENSSL=1 -DUSE_SSL_SOCKET=1 -I. -I../../src   -Wall -Werror -DLIBDIR=\"/mesos/mesos-0.28.3/_inst/lib\" -DPKGLIBEXECDIR=\"/mesos/mesos-0.28.3/_inst/libexec/mesos\" -DPKGDATADIR=\"/mesos/mesos-0.28.3/_inst/share/mesos\" -DPKGMODULEDIR=\"/mesos/mesos-0.28.3/_inst/lib/mesos/modules\" -I../../include -I../../3rdparty/libprocess/include -I../../3rdparty/libprocess/3rdparty/stout/include -I../include -I../include/mesos -isystem ../3rdparty/libprocess/3rdparty/boost-1.53.0 -I../3rdparty/libprocess/3rdparty/picojson-1.3.0 -DPICOJSON_USE_INT64 -D__STDC_FORMAT_MACROS -I../3rdparty/libprocess/3rdparty/protobuf-2.5.0/src -I../3rdparty/libprocess/3rdparty/glog-0.3.3/src -I../3rdparty/libprocess/3rdparty/glog-0.3.3/src -I../3rdparty/leveldb-1.4/include -I../3rdparty/zookeeper-3.4.5/src/c/include -I../3rdparty/zookeeper-3.4.5/src/c/generated -I../3rdparty/libprocess/3rdparty/protobuf-2.5.0/src -DSOURCE_DIR=\"/mesos/mesos-0.28.3/_build/..\" -DBUILD_DIR=\"/mesos/mesos-0.28.3/_build\" -I../3rdparty/libprocess/3rdparty/gmock-1.7.0/gtest/include -I../3rdparty/libprocess/3rdparty/gmock-1.7.0/include -DTESTLIBEXECDIR=\"/mesos/mesos-0.28.3/_inst/libexec/mesos/tests\" -DSBINDIR=\"/mesos/mesos-0.28.3/_inst/sbin\" -I/usr/lib/jvm/java-1.8.0-openjdk-1.8.0.111-1.b15.el7_2.x86_64/include -I/usr/lib/jvm/java-1.8.0-openjdk-1.8.0.111-1.b15.el7_2.x86_64/include/linux -DZOOKEEPER_VERSION=\"3.4.5\" -I/usr/include/subversion-1 -I/usr/include/apr-1 -I/usr/include/apr-1.0  -pthread -g1 -O0 -Wno-unused-local-typedefs -std=c++11 -MT tests/containerizer/memory_test_helper-memory_test_helper.o -MD -MP -MF tests/containerizer/.deps/memory_test_helper-memory_test_helper.Tpo -c -o tests/containerizer/memory_test_helper-memory_test_helper.o `test -f 'tests/containerizer/memory_test_helper.cpp' || echo '../../src/'`tests/containerizer/memory_test_helper.cpp
mv -f examples/.deps/balloon_executor-balloon_executor.Tpo examples/.deps/balloon_executor-balloon_executor.Po
g++ -DPACKAGE_NAME=\"mesos\" -DPACKAGE_TARNAME=\"mesos\" -DPACKAGE_VERSION=\"0.28.3\" -DPACKAGE_STRING=\"mesos\ 0.28.3\" -DPACKAGE_BUGREPORT=\"\" -DPACKAGE_URL=\"\" -DPACKAGE=\"mesos\" -DVERSION=\"0.28.3\" -DSTDC_HEADERS=1 -DHAVE_SYS_TYPES_H=1 -DHAVE_SYS_STAT_H=1 -DHAVE_STDLIB_H=1 -DHAVE_STRING_H=1 -DHAVE_MEMORY_H=1 -DHAVE_STRINGS_H=1 -DHAVE_INTTYPES_H=1 -DHAVE_STDINT_H=1 -DHAVE_UNISTD_H=1 -DHAVE_DLFCN_H=1 -DLT_OBJDIR=\".libs/\" -DHAVE_PTHREAD_PRIO_INHERIT=1 -DHAVE_PTHREAD=1 -DHAVE_LIBZ=1 -DHAVE_LIBCURL=1 -DHAVE_APR_POOLS_H=1 -DHAVE_LIBAPR_1=1 -DHAVE_SVN_VERSION_H=1 -DHAVE_LIBSVN_SUBR_1=1 -DHAVE_SVN_DELTA_H=1 -DHAVE_LIBSVN_DELTA_1=1 -DHAVE_LIBSASL2=1 -DMESOS_HAS_JAVA=1 -DHAVE_PYTHON=\"2.7\" -DMESOS_HAS_PYTHON=1 -DHAVE_EVENT2_EVENT_H=1 -DHAVE_LIBEVENT=1 -DHAVE_EVENT2_THREAD_H=1 -DHAVE_LIBEVENT_PTHREADS=1 -DHAVE_OPENSSL_SSL_H=1 -DHAVE_LIBSSL=1 -DHAVE_LIBCRYPTO=1 -DHAVE_EVENT2_BUFFEREVENT_SSL_H=1 -DHAVE_LIBEVENT_OPENSSL=1 -DUSE_SSL_SOCKET=1 -I. -I../../src   -Wall -Werror -DLIBDIR=\"/mesos/mesos-0.28.3/_inst/lib\" -DPKGLIBEXECDIR=\"/mesos/mesos-0.28.3/_inst/libexec/mesos\" -DPKGDATADIR=\"/mesos/mesos-0.28.3/_inst/share/mesos\" -DPKGMODULEDIR=\"/mesos/mesos-0.28.3/_inst/lib/mesos/modules\" -I../../include -I../../3rdparty/libprocess/include -I../../3rdparty/libprocess/3rdparty/stout/include -I../include -I../include/mesos -isystem ../3rdparty/libprocess/3rdparty/boost-1.53.0 -I../3rdparty/libprocess/3rdparty/picojson-1.3.0 -DPICOJSON_USE_INT64 -D__STDC_FORMAT_MACROS -I../3rdparty/libprocess/3rdparty/protobuf-2.5.0/src -I../3rdparty/libprocess/3rdparty/glog-0.3.3/src -I../3rdparty/libprocess/3rdparty/glog-0.3.3/src -I../3rdparty/leveldb-1.4/include -I../3rdparty/zookeeper-3.4.5/src/c/include -I../3rdparty/zookeeper-3.4.5/src/c/generated -I../3rdparty/libprocess/3rdparty/protobuf-2.5.0/src -I/usr/include/subversion-1 -I/usr/include/apr-1 -I/usr/include/apr-1.0  -pthread -g1 -O0 -Wno-unused-local-typedefs -std=c++11 -MT tests/active_user_test_helper-active_user_test_helper.o -MD -MP -MF tests/.deps/active_user_test_helper-active_user_test_helper.Tpo -c -o tests/active_user_test_helper-active_user_test_helper.o `test -f 'tests/active_user_test_helper.cpp' || echo '../../src/'`tests/active_user_test_helper.cpp
mv -f examples/.deps/test_http_framework-test_http_framework.Tpo examples/.deps/test_http_framework-test_http_framework.Po
g++ -DPACKAGE_NAME=\"mesos\" -DPACKAGE_TARNAME=\"mesos\" -DPACKAGE_VERSION=\"0.28.3\" -DPACKAGE_STRING=\"mesos\ 0.28.3\" -DPACKAGE_BUGREPORT=\"\" -DPACKAGE_URL=\"\" -DPACKAGE=\"mesos\" -DVERSION=\"0.28.3\" -DSTDC_HEADERS=1 -DHAVE_SYS_TYPES_H=1 -DHAVE_SYS_STAT_H=1 -DHAVE_STDLIB_H=1 -DHAVE_STRING_H=1 -DHAVE_MEMORY_H=1 -DHAVE_STRINGS_H=1 -DHAVE_INTTYPES_H=1 -DHAVE_STDINT_H=1 -DHAVE_UNISTD_H=1 -DHAVE_DLFCN_H=1 -DLT_OBJDIR=\".libs/\" -DHAVE_PTHREAD_PRIO_INHERIT=1 -DHAVE_PTHREAD=1 -DHAVE_LIBZ=1 -DHAVE_LIBCURL=1 -DHAVE_APR_POOLS_H=1 -DHAVE_LIBAPR_1=1 -DHAVE_SVN_VERSION_H=1 -DHAVE_LIBSVN_SUBR_1=1 -DHAVE_SVN_DELTA_H=1 -DHAVE_LIBSVN_DELTA_1=1 -DHAVE_LIBSASL2=1 -DMESOS_HAS_JAVA=1 -DHAVE_PYTHON=\"2.7\" -DMESOS_HAS_PYTHON=1 -DHAVE_EVENT2_EVENT_H=1 -DHAVE_LIBEVENT=1 -DHAVE_EVENT2_THREAD_H=1 -DHAVE_LIBEVENT_PTHREADS=1 -DHAVE_OPENSSL_SSL_H=1 -DHAVE_LIBSSL=1 -DHAVE_LIBCRYPTO=1 -DHAVE_EVENT2_BUFFEREVENT_SSL_H=1 -DHAVE_LIBEVENT_OPENSSL=1 -DUSE_SSL_SOCKET=1 -I. -I../../src   -Wall -Werror -DLIBDIR=\"/mesos/mesos-0.28.3/_inst/lib\" -DPKGLIBEXECDIR=\"/mesos/mesos-0.28.3/_inst/libexec/mesos\" -DPKGDATADIR=\"/mesos/mesos-0.28.3/_inst/share/mesos\" -DPKGMODULEDIR=\"/mesos/mesos-0.28.3/_inst/lib/mesos/modules\" -I../../include -I../../3rdparty/libprocess/include -I../../3rdparty/libprocess/3rdparty/stout/include -I../include -I../include/mesos -isystem ../3rdparty/libprocess/3rdparty/boost-1.53.0 -I../3rdparty/libprocess/3rdparty/picojson-1.3.0 -DPICOJSON_USE_INT64 -D__STDC_FORMAT_MACROS -I../3rdparty/libprocess/3rdparty/protobuf-2.5.0/src -I../3rdparty/libprocess/3rdparty/glog-0.3.3/src -I../3rdparty/libprocess/3rdparty/glog-0.3.3/src -I../3rdparty/leveldb-1.4/include -I../3rdparty/zookeeper-3.4.5/src/c/include -I../3rdparty/zookeeper-3.4.5/src/c/generated -I../3rdparty/libprocess/3rdparty/protobuf-2.5.0/src -DSOURCE_DIR=\"/mesos/mesos-0.28.3/_build/..\" -DBUILD_DIR=\"/mesos/mesos-0.28.3/_build\" -I../3rdparty/libprocess/3rdparty/gmock-1.7.0/gtest/include -I../3rdparty/libprocess/3rdparty/gmock-1.7.0/include -DTESTLIBEXECDIR=\"/mesos/mesos-0.28.3/_inst/libexec/mesos/tests\" -DSBINDIR=\"/mesos/mesos-0.28.3/_inst/sbin\" -I/usr/lib/jvm/java-1.8.0-openjdk-1.8.0.111-1.b15.el7_2.x86_64/include -I/usr/lib/jvm/java-1.8.0-openjdk-1.8.0.111-1.b15.el7_2.x86_64/include/linux -DZOOKEEPER_VERSION=\"3.4.5\" -I/usr/include/subversion-1 -I/usr/include/apr-1 -I/usr/include/apr-1.0  -pthread -g1 -O0 -Wno-unused-local-typedefs -std=c++11 -MT slave/qos_controllers/mesos_tests-load.o -MD -MP -MF slave/qos_controllers/.deps/mesos_tests-load.Tpo -c -o slave/qos_controllers/mesos_tests-load.o `test -f 'slave/qos_controllers/load.cpp' || echo '../../src/'`slave/qos_controllers/load.cpp
mv -f examples/.deps/no_executor_framework-no_executor_framework.Tpo examples/.deps/no_executor_framework-no_executor_framework.Po
g++ -DPACKAGE_NAME=\"mesos\" -DPACKAGE_TARNAME=\"mesos\" -DPACKAGE_VERSION=\"0.28.3\" -DPACKAGE_STRING=\"mesos\ 0.28.3\" -DPACKAGE_BUGREPORT=\"\" -DPACKAGE_URL=\"\" -DPACKAGE=\"mesos\" -DVERSION=\"0.28.3\" -DSTDC_HEADERS=1 -DHAVE_SYS_TYPES_H=1 -DHAVE_SYS_STAT_H=1 -DHAVE_STDLIB_H=1 -DHAVE_STRING_H=1 -DHAVE_MEMORY_H=1 -DHAVE_STRINGS_H=1 -DHAVE_INTTYPES_H=1 -DHAVE_STDINT_H=1 -DHAVE_UNISTD_H=1 -DHAVE_DLFCN_H=1 -DLT_OBJDIR=\".libs/\" -DHAVE_PTHREAD_PRIO_INHERIT=1 -DHAVE_PTHREAD=1 -DHAVE_LIBZ=1 -DHAVE_LIBCURL=1 -DHAVE_APR_POOLS_H=1 -DHAVE_LIBAPR_1=1 -DHAVE_SVN_VERSION_H=1 -DHAVE_LIBSVN_SUBR_1=1 -DHAVE_SVN_DELTA_H=1 -DHAVE_LIBSVN_DELTA_1=1 -DHAVE_LIBSASL2=1 -DMESOS_HAS_JAVA=1 -DHAVE_PYTHON=\"2.7\" -DMESOS_HAS_PYTHON=1 -DHAVE_EVENT2_EVENT_H=1 -DHAVE_LIBEVENT=1 -DHAVE_EVENT2_THREAD_H=1 -DHAVE_LIBEVENT_PTHREADS=1 -DHAVE_OPENSSL_SSL_H=1 -DHAVE_LIBSSL=1 -DHAVE_LIBCRYPTO=1 -DHAVE_EVENT2_BUFFEREVENT_SSL_H=1 -DHAVE_LIBEVENT_OPENSSL=1 -DUSE_SSL_SOCKET=1 -I. -I../../src   -Wall -Werror -DLIBDIR=\"/mesos/mesos-0.28.3/_inst/lib\" -DPKGLIBEXECDIR=\"/mesos/mesos-0.28.3/_inst/libexec/mesos\" -DPKGDATADIR=\"/mesos/mesos-0.28.3/_inst/share/mesos\" -DPKGMODULEDIR=\"/mesos/mesos-0.28.3/_inst/lib/mesos/modules\" -I../../include -I../../3rdparty/libprocess/include -I../../3rdparty/libprocess/3rdparty/stout/include -I../include -I../include/mesos -isystem ../3rdparty/libprocess/3rdparty/boost-1.53.0 -I../3rdparty/libprocess/3rdparty/picojson-1.3.0 -DPICOJSON_USE_INT64 -D__STDC_FORMAT_MACROS -I../3rdparty/libprocess/3rdparty/protobuf-2.5.0/src -I../3rdparty/libprocess/3rdparty/glog-0.3.3/src -I../3rdparty/libprocess/3rdparty/glog-0.3.3/src -I../3rdparty/leveldb-1.4/include -I../3rdparty/zookeeper-3.4.5/src/c/include -I../3rdparty/zookeeper-3.4.5/src/c/generated -I../3rdparty/libprocess/3rdparty/protobuf-2.5.0/src -DSOURCE_DIR=\"/mesos/mesos-0.28.3/_build/..\" -DBUILD_DIR=\"/mesos/mesos-0.28.3/_build\" -I../3rdparty/libprocess/3rdparty/gmock-1.7.0/gtest/include -I../3rdparty/libprocess/3rdparty/gmock-1.7.0/include -DTESTLIBEXECDIR=\"/mesos/mesos-0.28.3/_inst/libexec/mesos/tests\" -DSBINDIR=\"/mesos/mesos-0.28.3/_inst/sbin\" -I/usr/lib/jvm/java-1.8.0-openjdk-1.8.0.111-1.b15.el7_2.x86_64/include -I/usr/lib/jvm/java-1.8.0-openjdk-1.8.0.111-1.b15.el7_2.x86_64/include/linux -DZOOKEEPER_VERSION=\"3.4.5\" -I/usr/include/subversion-1 -I/usr/include/apr-1 -I/usr/include/apr-1.0  -pthread -g1 -O0 -Wno-unused-local-typedefs -std=c++11 -MT tests/mesos_tests-anonymous_tests.o -MD -MP -MF tests/.deps/mesos_tests-anonymous_tests.Tpo -c -o tests/mesos_tests-anonymous_tests.o `test -f 'tests/anonymous_tests.cpp' || echo '../../src/'`tests/anonymous_tests.cpp
mv -f tests/.deps/active_user_test_helper-active_user_test_helper.Tpo tests/.deps/active_user_test_helper-active_user_test_helper.Po
g++ -DPACKAGE_NAME=\"mesos\" -DPACKAGE_TARNAME=\"mesos\" -DPACKAGE_VERSION=\"0.28.3\" -DPACKAGE_STRING=\"mesos\ 0.28.3\" -DPACKAGE_BUGREPORT=\"\" -DPACKAGE_URL=\"\" -DPACKAGE=\"mesos\" -DVERSION=\"0.28.3\" -DSTDC_HEADERS=1 -DHAVE_SYS_TYPES_H=1 -DHAVE_SYS_STAT_H=1 -DHAVE_STDLIB_H=1 -DHAVE_STRING_H=1 -DHAVE_MEMORY_H=1 -DHAVE_STRINGS_H=1 -DHAVE_INTTYPES_H=1 -DHAVE_STDINT_H=1 -DHAVE_UNISTD_H=1 -DHAVE_DLFCN_H=1 -DLT_OBJDIR=\".libs/\" -DHAVE_PTHREAD_PRIO_INHERIT=1 -DHAVE_PTHREAD=1 -DHAVE_LIBZ=1 -DHAVE_LIBCURL=1 -DHAVE_APR_POOLS_H=1 -DHAVE_LIBAPR_1=1 -DHAVE_SVN_VERSION_H=1 -DHAVE_LIBSVN_SUBR_1=1 -DHAVE_SVN_DELTA_H=1 -DHAVE_LIBSVN_DELTA_1=1 -DHAVE_LIBSASL2=1 -DMESOS_HAS_JAVA=1 -DHAVE_PYTHON=\"2.7\" -DMESOS_HAS_PYTHON=1 -DHAVE_EVENT2_EVENT_H=1 -DHAVE_LIBEVENT=1 -DHAVE_EVENT2_THREAD_H=1 -DHAVE_LIBEVENT_PTHREADS=1 -DHAVE_OPENSSL_SSL_H=1 -DHAVE_LIBSSL=1 -DHAVE_LIBCRYPTO=1 -DHAVE_EVENT2_BUFFEREVENT_SSL_H=1 -DHAVE_LIBEVENT_OPENSSL=1 -DUSE_SSL_SOCKET=1 -I. -I../../src   -Wall -Werror -DLIBDIR=\"/mesos/mesos-0.28.3/_inst/lib\" -DPKGLIBEXECDIR=\"/mesos/mesos-0.28.3/_inst/libexec/mesos\" -DPKGDATADIR=\"/mesos/mesos-0.28.3/_inst/share/mesos\" -DPKGMODULEDIR=\"/mesos/mesos-0.28.3/_inst/lib/mesos/modules\" -I../../include -I../../3rdparty/libprocess/include -I../../3rdparty/libprocess/3rdparty/stout/include -I../include -I../include/mesos -isystem ../3rdparty/libprocess/3rdparty/boost-1.53.0 -I../3rdparty/libprocess/3rdparty/picojson-1.3.0 -DPICOJSON_USE_INT64 -D__STDC_FORMAT_MACROS -I../3rdparty/libprocess/3rdparty/protobuf-2.5.0/src -I../3rdparty/libprocess/3rdparty/glog-0.3.3/src -I../3rdparty/libprocess/3rdparty/glog-0.3.3/src -I../3rdparty/leveldb-1.4/include -I../3rdparty/zookeeper-3.4.5/src/c/include -I../3rdparty/zookeeper-3.4.5/src/c/generated -I../3rdparty/libprocess/3rdparty/protobuf-2.5.0/src -DSOURCE_DIR=\"/mesos/mesos-0.28.3/_build/..\" -DBUILD_DIR=\"/mesos/mesos-0.28.3/_build\" -I../3rdparty/libprocess/3rdparty/gmock-1.7.0/gtest/include -I../3rdparty/libprocess/3rdparty/gmock-1.7.0/include -DTESTLIBEXECDIR=\"/mesos/mesos-0.28.3/_inst/libexec/mesos/tests\" -DSBINDIR=\"/mesos/mesos-0.28.3/_inst/sbin\" -I/usr/lib/jvm/java-1.8.0-openjdk-1.8.0.111-1.b15.el7_2.x86_64/include -I/usr/lib/jvm/java-1.8.0-openjdk-1.8.0.111-1.b15.el7_2.x86_64/include/linux -DZOOKEEPER_VERSION=\"3.4.5\" -I/usr/include/subversion-1 -I/usr/include/apr-1 -I/usr/include/apr-1.0  -pthread -g1 -O0 -Wno-unused-local-typedefs -std=c++11 -MT tests/mesos_tests-attributes_tests.o -MD -MP -MF tests/.deps/mesos_tests-attributes_tests.Tpo -c -o tests/mesos_tests-attributes_tests.o `test -f 'tests/attributes_tests.cpp' || echo '../../src/'`tests/attributes_tests.cpp
mv -f examples/.deps/balloon_framework-balloon_framework.Tpo examples/.deps/balloon_framework-balloon_framework.Po
g++ -DPACKAGE_NAME=\"mesos\" -DPACKAGE_TARNAME=\"mesos\" -DPACKAGE_VERSION=\"0.28.3\" -DPACKAGE_STRING=\"mesos\ 0.28.3\" -DPACKAGE_BUGREPORT=\"\" -DPACKAGE_URL=\"\" -DPACKAGE=\"mesos\" -DVERSION=\"0.28.3\" -DSTDC_HEADERS=1 -DHAVE_SYS_TYPES_H=1 -DHAVE_SYS_STAT_H=1 -DHAVE_STDLIB_H=1 -DHAVE_STRING_H=1 -DHAVE_MEMORY_H=1 -DHAVE_STRINGS_H=1 -DHAVE_INTTYPES_H=1 -DHAVE_STDINT_H=1 -DHAVE_UNISTD_H=1 -DHAVE_DLFCN_H=1 -DLT_OBJDIR=\".libs/\" -DHAVE_PTHREAD_PRIO_INHERIT=1 -DHAVE_PTHREAD=1 -DHAVE_LIBZ=1 -DHAVE_LIBCURL=1 -DHAVE_APR_POOLS_H=1 -DHAVE_LIBAPR_1=1 -DHAVE_SVN_VERSION_H=1 -DHAVE_LIBSVN_SUBR_1=1 -DHAVE_SVN_DELTA_H=1 -DHAVE_LIBSVN_DELTA_1=1 -DHAVE_LIBSASL2=1 -DMESOS_HAS_JAVA=1 -DHAVE_PYTHON=\"2.7\" -DMESOS_HAS_PYTHON=1 -DHAVE_EVENT2_EVENT_H=1 -DHAVE_LIBEVENT=1 -DHAVE_EVENT2_THREAD_H=1 -DHAVE_LIBEVENT_PTHREADS=1 -DHAVE_OPENSSL_SSL_H=1 -DHAVE_LIBSSL=1 -DHAVE_LIBCRYPTO=1 -DHAVE_EVENT2_BUFFEREVENT_SSL_H=1 -DHAVE_LIBEVENT_OPENSSL=1 -DUSE_SSL_SOCKET=1 -I. -I../../src   -Wall -Werror -DLIBDIR=\"/mesos/mesos-0.28.3/_inst/lib\" -DPKGLIBEXECDIR=\"/mesos/mesos-0.28.3/_inst/libexec/mesos\" -DPKGDATADIR=\"/mesos/mesos-0.28.3/_inst/share/mesos\" -DPKGMODULEDIR=\"/mesos/mesos-0.28.3/_inst/lib/mesos/modules\" -I../../include -I../../3rdparty/libprocess/include -I../../3rdparty/libprocess/3rdparty/stout/include -I../include -I../include/mesos -isystem ../3rdparty/libprocess/3rdparty/boost-1.53.0 -I../3rdparty/libprocess/3rdparty/picojson-1.3.0 -DPICOJSON_USE_INT64 -D__STDC_FORMAT_MACROS -I../3rdparty/libprocess/3rdparty/protobuf-2.5.0/src -I../3rdparty/libprocess/3rdparty/glog-0.3.3/src -I../3rdparty/libprocess/3rdparty/glog-0.3.3/src -I../3rdparty/leveldb-1.4/include -I../3rdparty/zookeeper-3.4.5/src/c/include -I../3rdparty/zookeeper-3.4.5/src/c/generated -I../3rdparty/libprocess/3rdparty/protobuf-2.5.0/src -DSOURCE_DIR=\"/mesos/mesos-0.28.3/_build/..\" -DBUILD_DIR=\"/mesos/mesos-0.28.3/_build\" -I../3rdparty/libprocess/3rdparty/gmock-1.7.0/gtest/include -I../3rdparty/libprocess/3rdparty/gmock-1.7.0/include -DTESTLIBEXECDIR=\"/mesos/mesos-0.28.3/_inst/libexec/mesos/tests\" -DSBINDIR=\"/mesos/mesos-0.28.3/_inst/sbin\" -I/usr/lib/jvm/java-1.8.0-openjdk-1.8.0.111-1.b15.el7_2.x86_64/include -I/usr/lib/jvm/java-1.8.0-openjdk-1.8.0.111-1.b15.el7_2.x86_64/include/linux -DZOOKEEPER_VERSION=\"3.4.5\" -I/usr/include/subversion-1 -I/usr/include/apr-1 -I/usr/include/apr-1.0  -pthread -g1 -O0 -Wno-unused-local-typedefs -std=c++11 -MT tests/mesos_tests-authentication_tests.o -MD -MP -MF tests/.deps/mesos_tests-authentication_tests.Tpo -c -o tests/mesos_tests-authentication_tests.o `test -f 'tests/authentication_tests.cpp' || echo '../../src/'`tests/authentication_tests.cpp
mv -f tests/containerizer/.deps/memory_test_helper-memory_test_helper_main.Tpo tests/containerizer/.deps/memory_test_helper-memory_test_helper_main.Po
g++ -DPACKAGE_NAME=\"mesos\" -DPACKAGE_TARNAME=\"mesos\" -DPACKAGE_VERSION=\"0.28.3\" -DPACKAGE_STRING=\"mesos\ 0.28.3\" -DPACKAGE_BUGREPORT=\"\" -DPACKAGE_URL=\"\" -DPACKAGE=\"mesos\" -DVERSION=\"0.28.3\" -DSTDC_HEADERS=1 -DHAVE_SYS_TYPES_H=1 -DHAVE_SYS_STAT_H=1 -DHAVE_STDLIB_H=1 -DHAVE_STRING_H=1 -DHAVE_MEMORY_H=1 -DHAVE_STRINGS_H=1 -DHAVE_INTTYPES_H=1 -DHAVE_STDINT_H=1 -DHAVE_UNISTD_H=1 -DHAVE_DLFCN_H=1 -DLT_OBJDIR=\".libs/\" -DHAVE_PTHREAD_PRIO_INHERIT=1 -DHAVE_PTHREAD=1 -DHAVE_LIBZ=1 -DHAVE_LIBCURL=1 -DHAVE_APR_POOLS_H=1 -DHAVE_LIBAPR_1=1 -DHAVE_SVN_VERSION_H=1 -DHAVE_LIBSVN_SUBR_1=1 -DHAVE_SVN_DELTA_H=1 -DHAVE_LIBSVN_DELTA_1=1 -DHAVE_LIBSASL2=1 -DMESOS_HAS_JAVA=1 -DHAVE_PYTHON=\"2.7\" -DMESOS_HAS_PYTHON=1 -DHAVE_EVENT2_EVENT_H=1 -DHAVE_LIBEVENT=1 -DHAVE_EVENT2_THREAD_H=1 -DHAVE_LIBEVENT_PTHREADS=1 -DHAVE_OPENSSL_SSL_H=1 -DHAVE_LIBSSL=1 -DHAVE_LIBCRYPTO=1 -DHAVE_EVENT2_BUFFEREVENT_SSL_H=1 -DHAVE_LIBEVENT_OPENSSL=1 -DUSE_SSL_SOCKET=1 -I. -I../../src   -Wall -Werror -DLIBDIR=\"/mesos/mesos-0.28.3/_inst/lib\" -DPKGLIBEXECDIR=\"/mesos/mesos-0.28.3/_inst/libexec/mesos\" -DPKGDATADIR=\"/mesos/mesos-0.28.3/_inst/share/mesos\" -DPKGMODULEDIR=\"/mesos/mesos-0.28.3/_inst/lib/mesos/modules\" -I../../include -I../../3rdparty/libprocess/include -I../../3rdparty/libprocess/3rdparty/stout/include -I../include -I../include/mesos -isystem ../3rdparty/libprocess/3rdparty/boost-1.53.0 -I../3rdparty/libprocess/3rdparty/picojson-1.3.0 -DPICOJSON_USE_INT64 -D__STDC_FORMAT_MACROS -I../3rdparty/libprocess/3rdparty/protobuf-2.5.0/src -I../3rdparty/libprocess/3rdparty/glog-0.3.3/src -I../3rdparty/libprocess/3rdparty/glog-0.3.3/src -I../3rdparty/leveldb-1.4/include -I../3rdparty/zookeeper-3.4.5/src/c/include -I../3rdparty/zookeeper-3.4.5/src/c/generated -I../3rdparty/libprocess/3rdparty/protobuf-2.5.0/src -DSOURCE_DIR=\"/mesos/mesos-0.28.3/_build/..\" -DBUILD_DIR=\"/mesos/mesos-0.28.3/_build\" -I../3rdparty/libprocess/3rdparty/gmock-1.7.0/gtest/include -I../3rdparty/libprocess/3rdparty/gmock-1.7.0/include -DTESTLIBEXECDIR=\"/mesos/mesos-0.28.3/_inst/libexec/mesos/tests\" -DSBINDIR=\"/mesos/mesos-0.28.3/_inst/sbin\" -I/usr/lib/jvm/java-1.8.0-openjdk-1.8.0.111-1.b15.el7_2.x86_64/include -I/usr/lib/jvm/java-1.8.0-openjdk-1.8.0.111-1.b15.el7_2.x86_64/include/linux -DZOOKEEPER_VERSION=\"3.4.5\" -I/usr/include/subversion-1 -I/usr/include/apr-1 -I/usr/include/apr-1.0  -pthread -g1 -O0 -Wno-unused-local-typedefs -std=c++11 -MT tests/mesos_tests-authorization_tests.o -MD -MP -MF tests/.deps/mesos_tests-authorization_tests.Tpo -c -o tests/mesos_tests-authorization_tests.o `test -f 'tests/authorization_tests.cpp' || echo '../../src/'`tests/authorization_tests.cpp
mv -f tests/.deps/mesos_tests-attributes_tests.Tpo tests/.deps/mesos_tests-attributes_tests.Po
g++ -DPACKAGE_NAME=\"mesos\" -DPACKAGE_TARNAME=\"mesos\" -DPACKAGE_VERSION=\"0.28.3\" -DPACKAGE_STRING=\"mesos\ 0.28.3\" -DPACKAGE_BUGREPORT=\"\" -DPACKAGE_URL=\"\" -DPACKAGE=\"mesos\" -DVERSION=\"0.28.3\" -DSTDC_HEADERS=1 -DHAVE_SYS_TYPES_H=1 -DHAVE_SYS_STAT_H=1 -DHAVE_STDLIB_H=1 -DHAVE_STRING_H=1 -DHAVE_MEMORY_H=1 -DHAVE_STRINGS_H=1 -DHAVE_INTTYPES_H=1 -DHAVE_STDINT_H=1 -DHAVE_UNISTD_H=1 -DHAVE_DLFCN_H=1 -DLT_OBJDIR=\".libs/\" -DHAVE_PTHREAD_PRIO_INHERIT=1 -DHAVE_PTHREAD=1 -DHAVE_LIBZ=1 -DHAVE_LIBCURL=1 -DHAVE_APR_POOLS_H=1 -DHAVE_LIBAPR_1=1 -DHAVE_SVN_VERSION_H=1 -DHAVE_LIBSVN_SUBR_1=1 -DHAVE_SVN_DELTA_H=1 -DHAVE_LIBSVN_DELTA_1=1 -DHAVE_LIBSASL2=1 -DMESOS_HAS_JAVA=1 -DHAVE_PYTHON=\"2.7\" -DMESOS_HAS_PYTHON=1 -DHAVE_EVENT2_EVENT_H=1 -DHAVE_LIBEVENT=1 -DHAVE_EVENT2_THREAD_H=1 -DHAVE_LIBEVENT_PTHREADS=1 -DHAVE_OPENSSL_SSL_H=1 -DHAVE_LIBSSL=1 -DHAVE_LIBCRYPTO=1 -DHAVE_EVENT2_BUFFEREVENT_SSL_H=1 -DHAVE_LIBEVENT_OPENSSL=1 -DUSE_SSL_SOCKET=1 -I. -I../../src   -Wall -Werror -DLIBDIR=\"/mesos/mesos-0.28.3/_inst/lib\" -DPKGLIBEXECDIR=\"/mesos/mesos-0.28.3/_inst/libexec/mesos\" -DPKGDATADIR=\"/mesos/mesos-0.28.3/_inst/share/mesos\" -DPKGMODULEDIR=\"/mesos/mesos-0.28.3/_inst/lib/mesos/modules\" -I../../include -I../../3rdparty/libprocess/include -I../../3rdparty/libprocess/3rdparty/stout/include -I../include -I../include/mesos -isystem ../3rdparty/libprocess/3rdparty/boost-1.53.0 -I../3rdparty/libprocess/3rdparty/picojson-1.3.0 -DPICOJSON_USE_INT64 -D__STDC_FORMAT_MACROS -I../3rdparty/libprocess/3rdparty/protobuf-2.5.0/src -I../3rdparty/libprocess/3rdparty/glog-0.3.3/src -I../3rdparty/libprocess/3rdparty/glog-0.3.3/src -I../3rdparty/leveldb-1.4/include -I../3rdparty/zookeeper-3.4.5/src/c/include -I../3rdparty/zookeeper-3.4.5/src/c/generated -I../3rdparty/libprocess/3rdparty/protobuf-2.5.0/src -DSOURCE_DIR=\"/mesos/mesos-0.28.3/_build/..\" -DBUILD_DIR=\"/mesos/mesos-0.28.3/_build\" -I../3rdparty/libprocess/3rdparty/gmock-1.7.0/gtest/include -I../3rdparty/libprocess/3rdparty/gmock-1.7.0/include -DTESTLIBEXECDIR=\"/mesos/mesos-0.28.3/_inst/libexec/mesos/tests\" -DSBINDIR=\"/mesos/mesos-0.28.3/_inst/sbin\" -I/usr/lib/jvm/java-1.8.0-openjdk-1.8.0.111-1.b15.el7_2.x86_64/include -I/usr/lib/jvm/java-1.8.0-openjdk-1.8.0.111-1.b15.el7_2.x86_64/include/linux -DZOOKEEPER_VERSION=\"3.4.5\" -I/usr/include/subversion-1 -I/usr/include/apr-1 -I/usr/include/apr-1.0  -pthread -g1 -O0 -Wno-unused-local-typedefs -std=c++11 -MT tests/mesos_tests-cluster.o -MD -MP -MF tests/.deps/mesos_tests-cluster.Tpo -c -o tests/mesos_tests-cluster.o `test -f 'tests/cluster.cpp' || echo '../../src/'`tests/cluster.cpp
mv -f examples/.deps/load_generator_framework-load_generator_framework.Tpo examples/.deps/load_generator_framework-load_generator_framework.Po
g++ -DPACKAGE_NAME=\"mesos\" -DPACKAGE_TARNAME=\"mesos\" -DPACKAGE_VERSION=\"0.28.3\" -DPACKAGE_STRING=\"mesos\ 0.28.3\" -DPACKAGE_BUGREPORT=\"\" -DPACKAGE_URL=\"\" -DPACKAGE=\"mesos\" -DVERSION=\"0.28.3\" -DSTDC_HEADERS=1 -DHAVE_SYS_TYPES_H=1 -DHAVE_SYS_STAT_H=1 -DHAVE_STDLIB_H=1 -DHAVE_STRING_H=1 -DHAVE_MEMORY_H=1 -DHAVE_STRINGS_H=1 -DHAVE_INTTYPES_H=1 -DHAVE_STDINT_H=1 -DHAVE_UNISTD_H=1 -DHAVE_DLFCN_H=1 -DLT_OBJDIR=\".libs/\" -DHAVE_PTHREAD_PRIO_INHERIT=1 -DHAVE_PTHREAD=1 -DHAVE_LIBZ=1 -DHAVE_LIBCURL=1 -DHAVE_APR_POOLS_H=1 -DHAVE_LIBAPR_1=1 -DHAVE_SVN_VERSION_H=1 -DHAVE_LIBSVN_SUBR_1=1 -DHAVE_SVN_DELTA_H=1 -DHAVE_LIBSVN_DELTA_1=1 -DHAVE_LIBSASL2=1 -DMESOS_HAS_JAVA=1 -DHAVE_PYTHON=\"2.7\" -DMESOS_HAS_PYTHON=1 -DHAVE_EVENT2_EVENT_H=1 -DHAVE_LIBEVENT=1 -DHAVE_EVENT2_THREAD_H=1 -DHAVE_LIBEVENT_PTHREADS=1 -DHAVE_OPENSSL_SSL_H=1 -DHAVE_LIBSSL=1 -DHAVE_LIBCRYPTO=1 -DHAVE_EVENT2_BUFFEREVENT_SSL_H=1 -DHAVE_LIBEVENT_OPENSSL=1 -DUSE_SSL_SOCKET=1 -I. -I../../src   -Wall -Werror -DLIBDIR=\"/mesos/mesos-0.28.3/_inst/lib\" -DPKGLIBEXECDIR=\"/mesos/mesos-0.28.3/_inst/libexec/mesos\" -DPKGDATADIR=\"/mesos/mesos-0.28.3/_inst/share/mesos\" -DPKGMODULEDIR=\"/mesos/mesos-0.28.3/_inst/lib/mesos/modules\" -I../../include -I../../3rdparty/libprocess/include -I../../3rdparty/libprocess/3rdparty/stout/include -I../include -I../include/mesos -isystem ../3rdparty/libprocess/3rdparty/boost-1.53.0 -I../3rdparty/libprocess/3rdparty/picojson-1.3.0 -DPICOJSON_USE_INT64 -D__STDC_FORMAT_MACROS -I../3rdparty/libprocess/3rdparty/protobuf-2.5.0/src -I../3rdparty/libprocess/3rdparty/glog-0.3.3/src -I../3rdparty/libprocess/3rdparty/glog-0.3.3/src -I../3rdparty/leveldb-1.4/include -I../3rdparty/zookeeper-3.4.5/src/c/include -I../3rdparty/zookeeper-3.4.5/src/c/generated -I../3rdparty/libprocess/3rdparty/protobuf-2.5.0/src -DSOURCE_DIR=\"/mesos/mesos-0.28.3/_build/..\" -DBUILD_DIR=\"/mesos/mesos-0.28.3/_build\" -I../3rdparty/libprocess/3rdparty/gmock-1.7.0/gtest/include -I../3rdparty/libprocess/3rdparty/gmock-1.7.0/include -DTESTLIBEXECDIR=\"/mesos/mesos-0.28.3/_inst/libexec/mesos/tests\" -DSBINDIR=\"/mesos/mesos-0.28.3/_inst/sbin\" -I/usr/lib/jvm/java-1.8.0-openjdk-1.8.0.111-1.b15.el7_2.x86_64/include -I/usr/lib/jvm/java-1.8.0-openjdk-1.8.0.111-1.b15.el7_2.x86_64/include/linux -DZOOKEEPER_VERSION=\"3.4.5\" -I/usr/include/subversion-1 -I/usr/include/apr-1 -I/usr/include/apr-1.0  -pthread -g1 -O0 -Wno-unused-local-typedefs -std=c++11 -MT tests/mesos_tests-command_executor_tests.o -MD -MP -MF tests/.deps/mesos_tests-command_executor_tests.Tpo -c -o tests/mesos_tests-command_executor_tests.o `test -f 'tests/command_executor_tests.cpp' || echo '../../src/'`tests/command_executor_tests.cpp
mv -f examples/.deps/persistent_volume_framework-persistent_volume_framework.Tpo examples/.deps/persistent_volume_framework-persistent_volume_framework.Po
g++ -DPACKAGE_NAME=\"mesos\" -DPACKAGE_TARNAME=\"mesos\" -DPACKAGE_VERSION=\"0.28.3\" -DPACKAGE_STRING=\"mesos\ 0.28.3\" -DPACKAGE_BUGREPORT=\"\" -DPACKAGE_URL=\"\" -DPACKAGE=\"mesos\" -DVERSION=\"0.28.3\" -DSTDC_HEADERS=1 -DHAVE_SYS_TYPES_H=1 -DHAVE_SYS_STAT_H=1 -DHAVE_STDLIB_H=1 -DHAVE_STRING_H=1 -DHAVE_MEMORY_H=1 -DHAVE_STRINGS_H=1 -DHAVE_INTTYPES_H=1 -DHAVE_STDINT_H=1 -DHAVE_UNISTD_H=1 -DHAVE_DLFCN_H=1 -DLT_OBJDIR=\".libs/\" -DHAVE_PTHREAD_PRIO_INHERIT=1 -DHAVE_PTHREAD=1 -DHAVE_LIBZ=1 -DHAVE_LIBCURL=1 -DHAVE_APR_POOLS_H=1 -DHAVE_LIBAPR_1=1 -DHAVE_SVN_VERSION_H=1 -DHAVE_LIBSVN_SUBR_1=1 -DHAVE_SVN_DELTA_H=1 -DHAVE_LIBSVN_DELTA_1=1 -DHAVE_LIBSASL2=1 -DMESOS_HAS_JAVA=1 -DHAVE_PYTHON=\"2.7\" -DMESOS_HAS_PYTHON=1 -DHAVE_EVENT2_EVENT_H=1 -DHAVE_LIBEVENT=1 -DHAVE_EVENT2_THREAD_H=1 -DHAVE_LIBEVENT_PTHREADS=1 -DHAVE_OPENSSL_SSL_H=1 -DHAVE_LIBSSL=1 -DHAVE_LIBCRYPTO=1 -DHAVE_EVENT2_BUFFEREVENT_SSL_H=1 -DHAVE_LIBEVENT_OPENSSL=1 -DUSE_SSL_SOCKET=1 -I. -I../../src   -Wall -Werror -DLIBDIR=\"/mesos/mesos-0.28.3/_inst/lib\" -DPKGLIBEXECDIR=\"/mesos/mesos-0.28.3/_inst/libexec/mesos\" -DPKGDATADIR=\"/mesos/mesos-0.28.3/_inst/share/mesos\" -DPKGMODULEDIR=\"/mesos/mesos-0.28.3/_inst/lib/mesos/modules\" -I../../include -I../../3rdparty/libprocess/include -I../../3rdparty/libprocess/3rdparty/stout/include -I../include -I../include/mesos -isystem ../3rdparty/libprocess/3rdparty/boost-1.53.0 -I../3rdparty/libprocess/3rdparty/picojson-1.3.0 -DPICOJSON_USE_INT64 -D__STDC_FORMAT_MACROS -I../3rdparty/libprocess/3rdparty/protobuf-2.5.0/src -I../3rdparty/libprocess/3rdparty/glog-0.3.3/src -I../3rdparty/libprocess/3rdparty/glog-0.3.3/src -I../3rdparty/leveldb-1.4/include -I../3rdparty/zookeeper-3.4.5/src/c/include -I../3rdparty/zookeeper-3.4.5/src/c/generated -I../3rdparty/libprocess/3rdparty/protobuf-2.5.0/src -DSOURCE_DIR=\"/mesos/mesos-0.28.3/_build/..\" -DBUILD_DIR=\"/mesos/mesos-0.28.3/_build\" -I../3rdparty/libprocess/3rdparty/gmock-1.7.0/gtest/include -I../3rdparty/libprocess/3rdparty/gmock-1.7.0/include -DTESTLIBEXECDIR=\"/mesos/mesos-0.28.3/_inst/libexec/mesos/tests\" -DSBINDIR=\"/mesos/mesos-0.28.3/_inst/sbin\" -I/usr/lib/jvm/java-1.8.0-openjdk-1.8.0.111-1.b15.el7_2.x86_64/include -I/usr/lib/jvm/java-1.8.0-openjdk-1.8.0.111-1.b15.el7_2.x86_64/include/linux -DZOOKEEPER_VERSION=\"3.4.5\" -I/usr/include/subversion-1 -I/usr/include/apr-1 -I/usr/include/apr-1.0  -pthread -g1 -O0 -Wno-unused-local-typedefs -std=c++11 -MT tests/mesos_tests-container_logger_tests.o -MD -MP -MF tests/.deps/mesos_tests-container_logger_tests.Tpo -c -o tests/mesos_tests-container_logger_tests.o `test -f 'tests/container_logger_tests.cpp' || echo '../../src/'`tests/container_logger_tests.cpp
mv -f tests/containerizer/.deps/memory_test_helper-memory_test_helper.Tpo tests/containerizer/.deps/memory_test_helper-memory_test_helper.Po
g++ -DPACKAGE_NAME=\"mesos\" -DPACKAGE_TARNAME=\"mesos\" -DPACKAGE_VERSION=\"0.28.3\" -DPACKAGE_STRING=\"mesos\ 0.28.3\" -DPACKAGE_BUGREPORT=\"\" -DPACKAGE_URL=\"\" -DPACKAGE=\"mesos\" -DVERSION=\"0.28.3\" -DSTDC_HEADERS=1 -DHAVE_SYS_TYPES_H=1 -DHAVE_SYS_STAT_H=1 -DHAVE_STDLIB_H=1 -DHAVE_STRING_H=1 -DHAVE_MEMORY_H=1 -DHAVE_STRINGS_H=1 -DHAVE_INTTYPES_H=1 -DHAVE_STDINT_H=1 -DHAVE_UNISTD_H=1 -DHAVE_DLFCN_H=1 -DLT_OBJDIR=\".libs/\" -DHAVE_PTHREAD_PRIO_INHERIT=1 -DHAVE_PTHREAD=1 -DHAVE_LIBZ=1 -DHAVE_LIBCURL=1 -DHAVE_APR_POOLS_H=1 -DHAVE_LIBAPR_1=1 -DHAVE_SVN_VERSION_H=1 -DHAVE_LIBSVN_SUBR_1=1 -DHAVE_SVN_DELTA_H=1 -DHAVE_LIBSVN_DELTA_1=1 -DHAVE_LIBSASL2=1 -DMESOS_HAS_JAVA=1 -DHAVE_PYTHON=\"2.7\" -DMESOS_HAS_PYTHON=1 -DHAVE_EVENT2_EVENT_H=1 -DHAVE_LIBEVENT=1 -DHAVE_EVENT2_THREAD_H=1 -DHAVE_LIBEVENT_PTHREADS=1 -DHAVE_OPENSSL_SSL_H=1 -DHAVE_LIBSSL=1 -DHAVE_LIBCRYPTO=1 -DHAVE_EVENT2_BUFFEREVENT_SSL_H=1 -DHAVE_LIBEVENT_OPENSSL=1 -DUSE_SSL_SOCKET=1 -I. -I../../src   -Wall -Werror -DLIBDIR=\"/mesos/mesos-0.28.3/_inst/lib\" -DPKGLIBEXECDIR=\"/mesos/mesos-0.28.3/_inst/libexec/mesos\" -DPKGDATADIR=\"/mesos/mesos-0.28.3/_inst/share/mesos\" -DPKGMODULEDIR=\"/mesos/mesos-0.28.3/_inst/lib/mesos/modules\" -I../../include -I../../3rdparty/libprocess/include -I../../3rdparty/libprocess/3rdparty/stout/include -I../include -I../include/mesos -isystem ../3rdparty/libprocess/3rdparty/boost-1.53.0 -I../3rdparty/libprocess/3rdparty/picojson-1.3.0 -DPICOJSON_USE_INT64 -D__STDC_FORMAT_MACROS -I../3rdparty/libprocess/3rdparty/protobuf-2.5.0/src -I../3rdparty/libprocess/3rdparty/glog-0.3.3/src -I../3rdparty/libprocess/3rdparty/glog-0.3.3/src -I../3rdparty/leveldb-1.4/include -I../3rdparty/zookeeper-3.4.5/src/c/include -I../3rdparty/zookeeper-3.4.5/src/c/generated -I../3rdparty/libprocess/3rdparty/protobuf-2.5.0/src -DSOURCE_DIR=\"/mesos/mesos-0.28.3/_build/..\" -DBUILD_DIR=\"/mesos/mesos-0.28.3/_build\" -I../3rdparty/libprocess/3rdparty/gmock-1.7.0/gtest/include -I../3rdparty/libprocess/3rdparty/gmock-1.7.0/include -DTESTLIBEXECDIR=\"/mesos/mesos-0.28.3/_inst/libexec/mesos/tests\" -DSBINDIR=\"/mesos/mesos-0.28.3/_inst/sbin\" -I/usr/lib/jvm/java-1.8.0-openjdk-1.8.0.111-1.b15.el7_2.x86_64/include -I/usr/lib/jvm/java-1.8.0-openjdk-1.8.0.111-1.b15.el7_2.x86_64/include/linux -DZOOKEEPER_VERSION=\"3.4.5\" -I/usr/include/subversion-1 -I/usr/include/apr-1 -I/usr/include/apr-1.0  -pthread -g1 -O0 -Wno-unused-local-typedefs -std=c++11 -MT tests/mesos_tests-containerizer.o -MD -MP -MF tests/.deps/mesos_tests-containerizer.Tpo -c -o tests/mesos_tests-containerizer.o `test -f 'tests/containerizer.cpp' || echo '../../src/'`tests/containerizer.cpp
mv -f slave/qos_controllers/.deps/mesos_tests-load.Tpo slave/qos_controllers/.deps/mesos_tests-load.Po
g++ -DPACKAGE_NAME=\"mesos\" -DPACKAGE_TARNAME=\"mesos\" -DPACKAGE_VERSION=\"0.28.3\" -DPACKAGE_STRING=\"mesos\ 0.28.3\" -DPACKAGE_BUGREPORT=\"\" -DPACKAGE_URL=\"\" -DPACKAGE=\"mesos\" -DVERSION=\"0.28.3\" -DSTDC_HEADERS=1 -DHAVE_SYS_TYPES_H=1 -DHAVE_SYS_STAT_H=1 -DHAVE_STDLIB_H=1 -DHAVE_STRING_H=1 -DHAVE_MEMORY_H=1 -DHAVE_STRINGS_H=1 -DHAVE_INTTYPES_H=1 -DHAVE_STDINT_H=1 -DHAVE_UNISTD_H=1 -DHAVE_DLFCN_H=1 -DLT_OBJDIR=\".libs/\" -DHAVE_PTHREAD_PRIO_INHERIT=1 -DHAVE_PTHREAD=1 -DHAVE_LIBZ=1 -DHAVE_LIBCURL=1 -DHAVE_APR_POOLS_H=1 -DHAVE_LIBAPR_1=1 -DHAVE_SVN_VERSION_H=1 -DHAVE_LIBSVN_SUBR_1=1 -DHAVE_SVN_DELTA_H=1 -DHAVE_LIBSVN_DELTA_1=1 -DHAVE_LIBSASL2=1 -DMESOS_HAS_JAVA=1 -DHAVE_PYTHON=\"2.7\" -DMESOS_HAS_PYTHON=1 -DHAVE_EVENT2_EVENT_H=1 -DHAVE_LIBEVENT=1 -DHAVE_EVENT2_THREAD_H=1 -DHAVE_LIBEVENT_PTHREADS=1 -DHAVE_OPENSSL_SSL_H=1 -DHAVE_LIBSSL=1 -DHAVE_LIBCRYPTO=1 -DHAVE_EVENT2_BUFFEREVENT_SSL_H=1 -DHAVE_LIBEVENT_OPENSSL=1 -DUSE_SSL_SOCKET=1 -I. -I../../src   -Wall -Werror -DLIBDIR=\"/mesos/mesos-0.28.3/_inst/lib\" -DPKGLIBEXECDIR=\"/mesos/mesos-0.28.3/_inst/libexec/mesos\" -DPKGDATADIR=\"/mesos/mesos-0.28.3/_inst/share/mesos\" -DPKGMODULEDIR=\"/mesos/mesos-0.28.3/_inst/lib/mesos/modules\" -I../../include -I../../3rdparty/libprocess/include -I../../3rdparty/libprocess/3rdparty/stout/include -I../include -I../include/mesos -isystem ../3rdparty/libprocess/3rdparty/boost-1.53.0 -I../3rdparty/libprocess/3rdparty/picojson-1.3.0 -DPICOJSON_USE_INT64 -D__STDC_FORMAT_MACROS -I../3rdparty/libprocess/3rdparty/protobuf-2.5.0/src -I../3rdparty/libprocess/3rdparty/glog-0.3.3/src -I../3rdparty/libprocess/3rdparty/glog-0.3.3/src -I../3rdparty/leveldb-1.4/include -I../3rdparty/zookeeper-3.4.5/src/c/include -I../3rdparty/zookeeper-3.4.5/src/c/generated -I../3rdparty/libprocess/3rdparty/protobuf-2.5.0/src -DSOURCE_DIR=\"/mesos/mesos-0.28.3/_build/..\" -DBUILD_DIR=\"/mesos/mesos-0.28.3/_build\" -I../3rdparty/libprocess/3rdparty/gmock-1.7.0/gtest/include -I../3rdparty/libprocess/3rdparty/gmock-1.7.0/include -DTESTLIBEXECDIR=\"/mesos/mesos-0.28.3/_inst/libexec/mesos/tests\" -DSBINDIR=\"/mesos/mesos-0.28.3/_inst/sbin\" -I/usr/lib/jvm/java-1.8.0-openjdk-1.8.0.111-1.b15.el7_2.x86_64/include -I/usr/lib/jvm/java-1.8.0-openjdk-1.8.0.111-1.b15.el7_2.x86_64/include/linux -DZOOKEEPER_VERSION=\"3.4.5\" -I/usr/include/subversion-1 -I/usr/include/apr-1 -I/usr/include/apr-1.0  -pthread -g1 -O0 -Wno-unused-local-typedefs -std=c++11 -MT tests/mesos_tests-cram_md5_authentication_tests.o -MD -MP -MF tests/.deps/mesos_tests-cram_md5_authentication_tests.Tpo -c -o tests/mesos_tests-cram_md5_authentication_tests.o `test -f 'tests/cram_md5_authentication_tests.cpp' || echo '../../src/'`tests/cram_md5_authentication_tests.cpp
mv -f tests/.deps/mesos_tests-anonymous_tests.Tpo tests/.deps/mesos_tests-anonymous_tests.Po
g++ -DPACKAGE_NAME=\"mesos\" -DPACKAGE_TARNAME=\"mesos\" -DPACKAGE_VERSION=\"0.28.3\" -DPACKAGE_STRING=\"mesos\ 0.28.3\" -DPACKAGE_BUGREPORT=\"\" -DPACKAGE_URL=\"\" -DPACKAGE=\"mesos\" -DVERSION=\"0.28.3\" -DSTDC_HEADERS=1 -DHAVE_SYS_TYPES_H=1 -DHAVE_SYS_STAT_H=1 -DHAVE_STDLIB_H=1 -DHAVE_STRING_H=1 -DHAVE_MEMORY_H=1 -DHAVE_STRINGS_H=1 -DHAVE_INTTYPES_H=1 -DHAVE_STDINT_H=1 -DHAVE_UNISTD_H=1 -DHAVE_DLFCN_H=1 -DLT_OBJDIR=\".libs/\" -DHAVE_PTHREAD_PRIO_INHERIT=1 -DHAVE_PTHREAD=1 -DHAVE_LIBZ=1 -DHAVE_LIBCURL=1 -DHAVE_APR_POOLS_H=1 -DHAVE_LIBAPR_1=1 -DHAVE_SVN_VERSION_H=1 -DHAVE_LIBSVN_SUBR_1=1 -DHAVE_SVN_DELTA_H=1 -DHAVE_LIBSVN_DELTA_1=1 -DHAVE_LIBSASL2=1 -DMESOS_HAS_JAVA=1 -DHAVE_PYTHON=\"2.7\" -DMESOS_HAS_PYTHON=1 -DHAVE_EVENT2_EVENT_H=1 -DHAVE_LIBEVENT=1 -DHAVE_EVENT2_THREAD_H=1 -DHAVE_LIBEVENT_PTHREADS=1 -DHAVE_OPENSSL_SSL_H=1 -DHAVE_LIBSSL=1 -DHAVE_LIBCRYPTO=1 -DHAVE_EVENT2_BUFFEREVENT_SSL_H=1 -DHAVE_LIBEVENT_OPENSSL=1 -DUSE_SSL_SOCKET=1 -I. -I../../src   -Wall -Werror -DLIBDIR=\"/mesos/mesos-0.28.3/_inst/lib\" -DPKGLIBEXECDIR=\"/mesos/mesos-0.28.3/_inst/libexec/mesos\" -DPKGDATADIR=\"/mesos/mesos-0.28.3/_inst/share/mesos\" -DPKGMODULEDIR=\"/mesos/mesos-0.28.3/_inst/lib/mesos/modules\" -I../../include -I../../3rdparty/libprocess/include -I../../3rdparty/libprocess/3rdparty/stout/include -I../include -I../include/mesos -isystem ../3rdparty/libprocess/3rdparty/boost-1.53.0 -I../3rdparty/libprocess/3rdparty/picojson-1.3.0 -DPICOJSON_USE_INT64 -D__STDC_FORMAT_MACROS -I../3rdparty/libprocess/3rdparty/protobuf-2.5.0/src -I../3rdparty/libprocess/3rdparty/glog-0.3.3/src -I../3rdparty/libprocess/3rdparty/glog-0.3.3/src -I../3rdparty/leveldb-1.4/include -I../3rdparty/zookeeper-3.4.5/src/c/include -I../3rdparty/zookeeper-3.4.5/src/c/generated -I../3rdparty/libprocess/3rdparty/protobuf-2.5.0/src -DSOURCE_DIR=\"/mesos/mesos-0.28.3/_build/..\" -DBUILD_DIR=\"/mesos/mesos-0.28.3/_build\" -I../3rdparty/libprocess/3rdparty/gmock-1.7.0/gtest/include -I../3rdparty/libprocess/3rdparty/gmock-1.7.0/include -DTESTLIBEXECDIR=\"/mesos/mesos-0.28.3/_inst/libexec/mesos/tests\" -DSBINDIR=\"/mesos/mesos-0.28.3/_inst/sbin\" -I/usr/lib/jvm/java-1.8.0-openjdk-1.8.0.111-1.b15.el7_2.x86_64/include -I/usr/lib/jvm/java-1.8.0-openjdk-1.8.0.111-1.b15.el7_2.x86_64/include/linux -DZOOKEEPER_VERSION=\"3.4.5\" -I/usr/include/subversion-1 -I/usr/include/apr-1 -I/usr/include/apr-1.0  -pthread -g1 -O0 -Wno-unused-local-typedefs -std=c++11 -MT tests/mesos_tests-credentials_tests.o -MD -MP -MF tests/.deps/mesos_tests-credentials_tests.Tpo -c -o tests/mesos_tests-credentials_tests.o `test -f 'tests/credentials_tests.cpp' || echo '../../src/'`tests/credentials_tests.cpp
mv -f tests/.deps/mesos_tests-authorization_tests.Tpo tests/.deps/mesos_tests-authorization_tests.Po
g++ -DPACKAGE_NAME=\"mesos\" -DPACKAGE_TARNAME=\"mesos\" -DPACKAGE_VERSION=\"0.28.3\" -DPACKAGE_STRING=\"mesos\ 0.28.3\" -DPACKAGE_BUGREPORT=\"\" -DPACKAGE_URL=\"\" -DPACKAGE=\"mesos\" -DVERSION=\"0.28.3\" -DSTDC_HEADERS=1 -DHAVE_SYS_TYPES_H=1 -DHAVE_SYS_STAT_H=1 -DHAVE_STDLIB_H=1 -DHAVE_STRING_H=1 -DHAVE_MEMORY_H=1 -DHAVE_STRINGS_H=1 -DHAVE_INTTYPES_H=1 -DHAVE_STDINT_H=1 -DHAVE_UNISTD_H=1 -DHAVE_DLFCN_H=1 -DLT_OBJDIR=\".libs/\" -DHAVE_PTHREAD_PRIO_INHERIT=1 -DHAVE_PTHREAD=1 -DHAVE_LIBZ=1 -DHAVE_LIBCURL=1 -DHAVE_APR_POOLS_H=1 -DHAVE_LIBAPR_1=1 -DHAVE_SVN_VERSION_H=1 -DHAVE_LIBSVN_SUBR_1=1 -DHAVE_SVN_DELTA_H=1 -DHAVE_LIBSVN_DELTA_1=1 -DHAVE_LIBSASL2=1 -DMESOS_HAS_JAVA=1 -DHAVE_PYTHON=\"2.7\" -DMESOS_HAS_PYTHON=1 -DHAVE_EVENT2_EVENT_H=1 -DHAVE_LIBEVENT=1 -DHAVE_EVENT2_THREAD_H=1 -DHAVE_LIBEVENT_PTHREADS=1 -DHAVE_OPENSSL_SSL_H=1 -DHAVE_LIBSSL=1 -DHAVE_LIBCRYPTO=1 -DHAVE_EVENT2_BUFFEREVENT_SSL_H=1 -DHAVE_LIBEVENT_OPENSSL=1 -DUSE_SSL_SOCKET=1 -I. -I../../src   -Wall -Werror -DLIBDIR=\"/mesos/mesos-0.28.3/_inst/lib\" -DPKGLIBEXECDIR=\"/mesos/mesos-0.28.3/_inst/libexec/mesos\" -DPKGDATADIR=\"/mesos/mesos-0.28.3/_inst/share/mesos\" -DPKGMODULEDIR=\"/mesos/mesos-0.28.3/_inst/lib/mesos/modules\" -I../../include -I../../3rdparty/libprocess/include -I../../3rdparty/libprocess/3rdparty/stout/include -I../include -I../include/mesos -isystem ../3rdparty/libprocess/3rdparty/boost-1.53.0 -I../3rdparty/libprocess/3rdparty/picojson-1.3.0 -DPICOJSON_USE_INT64 -D__STDC_FORMAT_MACROS -I../3rdparty/libprocess/3rdparty/protobuf-2.5.0/src -I../3rdparty/libprocess/3rdparty/glog-0.3.3/src -I../3rdparty/libprocess/3rdparty/glog-0.3.3/src -I../3rdparty/leveldb-1.4/include -I../3rdparty/zookeeper-3.4.5/src/c/include -I../3rdparty/zookeeper-3.4.5/src/c/generated -I../3rdparty/libprocess/3rdparty/protobuf-2.5.0/src -DSOURCE_DIR=\"/mesos/mesos-0.28.3/_build/..\" -DBUILD_DIR=\"/mesos/mesos-0.28.3/_build\" -I../3rdparty/libprocess/3rdparty/gmock-1.7.0/gtest/include -I../3rdparty/libprocess/3rdparty/gmock-1.7.0/include -DTESTLIBEXECDIR=\"/mesos/mesos-0.28.3/_inst/libexec/mesos/tests\" -DSBINDIR=\"/mesos/mesos-0.28.3/_inst/sbin\" -I/usr/lib/jvm/java-1.8.0-openjdk-1.8.0.111-1.b15.el7_2.x86_64/include -I/usr/lib/jvm/java-1.8.0-openjdk-1.8.0.111-1.b15.el7_2.x86_64/include/linux -DZOOKEEPER_VERSION=\"3.4.5\" -I/usr/include/subversion-1 -I/usr/include/apr-1 -I/usr/include/apr-1.0  -pthread -g1 -O0 -Wno-unused-local-typedefs -std=c++11 -MT tests/mesos_tests-disk_quota_tests.o -MD -MP -MF tests/.deps/mesos_tests-disk_quota_tests.Tpo -c -o tests/mesos_tests-disk_quota_tests.o `test -f 'tests/disk_quota_tests.cpp' || echo '../../src/'`tests/disk_quota_tests.cpp
mv -f tests/.deps/mesos_tests-cluster.Tpo tests/.deps/mesos_tests-cluster.Po
g++ -DPACKAGE_NAME=\"mesos\" -DPACKAGE_TARNAME=\"mesos\" -DPACKAGE_VERSION=\"0.28.3\" -DPACKAGE_STRING=\"mesos\ 0.28.3\" -DPACKAGE_BUGREPORT=\"\" -DPACKAGE_URL=\"\" -DPACKAGE=\"mesos\" -DVERSION=\"0.28.3\" -DSTDC_HEADERS=1 -DHAVE_SYS_TYPES_H=1 -DHAVE_SYS_STAT_H=1 -DHAVE_STDLIB_H=1 -DHAVE_STRING_H=1 -DHAVE_MEMORY_H=1 -DHAVE_STRINGS_H=1 -DHAVE_INTTYPES_H=1 -DHAVE_STDINT_H=1 -DHAVE_UNISTD_H=1 -DHAVE_DLFCN_H=1 -DLT_OBJDIR=\".libs/\" -DHAVE_PTHREAD_PRIO_INHERIT=1 -DHAVE_PTHREAD=1 -DHAVE_LIBZ=1 -DHAVE_LIBCURL=1 -DHAVE_APR_POOLS_H=1 -DHAVE_LIBAPR_1=1 -DHAVE_SVN_VERSION_H=1 -DHAVE_LIBSVN_SUBR_1=1 -DHAVE_SVN_DELTA_H=1 -DHAVE_LIBSVN_DELTA_1=1 -DHAVE_LIBSASL2=1 -DMESOS_HAS_JAVA=1 -DHAVE_PYTHON=\"2.7\" -DMESOS_HAS_PYTHON=1 -DHAVE_EVENT2_EVENT_H=1 -DHAVE_LIBEVENT=1 -DHAVE_EVENT2_THREAD_H=1 -DHAVE_LIBEVENT_PTHREADS=1 -DHAVE_OPENSSL_SSL_H=1 -DHAVE_LIBSSL=1 -DHAVE_LIBCRYPTO=1 -DHAVE_EVENT2_BUFFEREVENT_SSL_H=1 -DHAVE_LIBEVENT_OPENSSL=1 -DUSE_SSL_SOCKET=1 -I. -I../../src   -Wall -Werror -DLIBDIR=\"/mesos/mesos-0.28.3/_inst/lib\" -DPKGLIBEXECDIR=\"/mesos/mesos-0.28.3/_inst/libexec/mesos\" -DPKGDATADIR=\"/mesos/mesos-0.28.3/_inst/share/mesos\" -DPKGMODULEDIR=\"/mesos/mesos-0.28.3/_inst/lib/mesos/modules\" -I../../include -I../../3rdparty/libprocess/include -I../../3rdparty/libprocess/3rdparty/stout/include -I../include -I../include/mesos -isystem ../3rdparty/libprocess/3rdparty/boost-1.53.0 -I../3rdparty/libprocess/3rdparty/picojson-1.3.0 -DPICOJSON_USE_INT64 -D__STDC_FORMAT_MACROS -I../3rdparty/libprocess/3rdparty/protobuf-2.5.0/src -I../3rdparty/libprocess/3rdparty/glog-0.3.3/src -I../3rdparty/libprocess/3rdparty/glog-0.3.3/src -I../3rdparty/leveldb-1.4/include -I../3rdparty/zookeeper-3.4.5/src/c/include -I../3rdparty/zookeeper-3.4.5/src/c/generated -I../3rdparty/libprocess/3rdparty/protobuf-2.5.0/src -DSOURCE_DIR=\"/mesos/mesos-0.28.3/_build/..\" -DBUILD_DIR=\"/mesos/mesos-0.28.3/_build\" -I../3rdparty/libprocess/3rdparty/gmock-1.7.0/gtest/include -I../3rdparty/libprocess/3rdparty/gmock-1.7.0/include -DTESTLIBEXECDIR=\"/mesos/mesos-0.28.3/_inst/libexec/mesos/tests\" -DSBINDIR=\"/mesos/mesos-0.28.3/_inst/sbin\" -I/usr/lib/jvm/java-1.8.0-openjdk-1.8.0.111-1.b15.el7_2.x86_64/include -I/usr/lib/jvm/java-1.8.0-openjdk-1.8.0.111-1.b15.el7_2.x86_64/include/linux -DZOOKEEPER_VERSION=\"3.4.5\" -I/usr/include/subversion-1 -I/usr/include/apr-1 -I/usr/include/apr-1.0  -pthread -g1 -O0 -Wno-unused-local-typedefs -std=c++11 -MT tests/mesos_tests-environment.o -MD -MP -MF tests/.deps/mesos_tests-environment.Tpo -c -o tests/mesos_tests-environment.o `test -f 'tests/environment.cpp' || echo '../../src/'`tests/environment.cpp
mv -f tests/.deps/mesos_tests-command_executor_tests.Tpo tests/.deps/mesos_tests-command_executor_tests.Po
g++ -DPACKAGE_NAME=\"mesos\" -DPACKAGE_TARNAME=\"mesos\" -DPACKAGE_VERSION=\"0.28.3\" -DPACKAGE_STRING=\"mesos\ 0.28.3\" -DPACKAGE_BUGREPORT=\"\" -DPACKAGE_URL=\"\" -DPACKAGE=\"mesos\" -DVERSION=\"0.28.3\" -DSTDC_HEADERS=1 -DHAVE_SYS_TYPES_H=1 -DHAVE_SYS_STAT_H=1 -DHAVE_STDLIB_H=1 -DHAVE_STRING_H=1 -DHAVE_MEMORY_H=1 -DHAVE_STRINGS_H=1 -DHAVE_INTTYPES_H=1 -DHAVE_STDINT_H=1 -DHAVE_UNISTD_H=1 -DHAVE_DLFCN_H=1 -DLT_OBJDIR=\".libs/\" -DHAVE_PTHREAD_PRIO_INHERIT=1 -DHAVE_PTHREAD=1 -DHAVE_LIBZ=1 -DHAVE_LIBCURL=1 -DHAVE_APR_POOLS_H=1 -DHAVE_LIBAPR_1=1 -DHAVE_SVN_VERSION_H=1 -DHAVE_LIBSVN_SUBR_1=1 -DHAVE_SVN_DELTA_H=1 -DHAVE_LIBSVN_DELTA_1=1 -DHAVE_LIBSASL2=1 -DMESOS_HAS_JAVA=1 -DHAVE_PYTHON=\"2.7\" -DMESOS_HAS_PYTHON=1 -DHAVE_EVENT2_EVENT_H=1 -DHAVE_LIBEVENT=1 -DHAVE_EVENT2_THREAD_H=1 -DHAVE_LIBEVENT_PTHREADS=1 -DHAVE_OPENSSL_SSL_H=1 -DHAVE_LIBSSL=1 -DHAVE_LIBCRYPTO=1 -DHAVE_EVENT2_BUFFEREVENT_SSL_H=1 -DHAVE_LIBEVENT_OPENSSL=1 -DUSE_SSL_SOCKET=1 -I. -I../../src   -Wall -Werror -DLIBDIR=\"/mesos/mesos-0.28.3/_inst/lib\" -DPKGLIBEXECDIR=\"/mesos/mesos-0.28.3/_inst/libexec/mesos\" -DPKGDATADIR=\"/mesos/mesos-0.28.3/_inst/share/mesos\" -DPKGMODULEDIR=\"/mesos/mesos-0.28.3/_inst/lib/mesos/modules\" -I../../include -I../../3rdparty/libprocess/include -I../../3rdparty/libprocess/3rdparty/stout/include -I../include -I../include/mesos -isystem ../3rdparty/libprocess/3rdparty/boost-1.53.0 -I../3rdparty/libprocess/3rdparty/picojson-1.3.0 -DPICOJSON_USE_INT64 -D__STDC_FORMAT_MACROS -I../3rdparty/libprocess/3rdparty/protobuf-2.5.0/src -I../3rdparty/libprocess/3rdparty/glog-0.3.3/src -I../3rdparty/libprocess/3rdparty/glog-0.3.3/src -I../3rdparty/leveldb-1.4/include -I../3rdparty/zookeeper-3.4.5/src/c/include -I../3rdparty/zookeeper-3.4.5/src/c/generated -I../3rdparty/libprocess/3rdparty/protobuf-2.5.0/src -DSOURCE_DIR=\"/mesos/mesos-0.28.3/_build/..\" -DBUILD_DIR=\"/mesos/mesos-0.28.3/_build\" -I../3rdparty/libprocess/3rdparty/gmock-1.7.0/gtest/include -I../3rdparty/libprocess/3rdparty/gmock-1.7.0/include -DTESTLIBEXECDIR=\"/mesos/mesos-0.28.3/_inst/libexec/mesos/tests\" -DSBINDIR=\"/mesos/mesos-0.28.3/_inst/sbin\" -I/usr/lib/jvm/java-1.8.0-openjdk-1.8.0.111-1.b15.el7_2.x86_64/include -I/usr/lib/jvm/java-1.8.0-openjdk-1.8.0.111-1.b15.el7_2.x86_64/include/linux -DZOOKEEPER_VERSION=\"3.4.5\" -I/usr/include/subversion-1 -I/usr/include/apr-1 -I/usr/include/apr-1.0  -pthread -g1 -O0 -Wno-unused-local-typedefs -std=c++11 -MT tests/mesos_tests-examples_tests.o -MD -MP -MF tests/.deps/mesos_tests-examples_tests.Tpo -c -o tests/mesos_tests-examples_tests.o `test -f 'tests/examples_tests.cpp' || echo '../../src/'`tests/examples_tests.cpp
mv -f tests/.deps/mesos_tests-examples_tests.Tpo tests/.deps/mesos_tests-examples_tests.Po
g++ -DPACKAGE_NAME=\"mesos\" -DPACKAGE_TARNAME=\"mesos\" -DPACKAGE_VERSION=\"0.28.3\" -DPACKAGE_STRING=\"mesos\ 0.28.3\" -DPACKAGE_BUGREPORT=\"\" -DPACKAGE_URL=\"\" -DPACKAGE=\"mesos\" -DVERSION=\"0.28.3\" -DSTDC_HEADERS=1 -DHAVE_SYS_TYPES_H=1 -DHAVE_SYS_STAT_H=1 -DHAVE_STDLIB_H=1 -DHAVE_STRING_H=1 -DHAVE_MEMORY_H=1 -DHAVE_STRINGS_H=1 -DHAVE_INTTYPES_H=1 -DHAVE_STDINT_H=1 -DHAVE_UNISTD_H=1 -DHAVE_DLFCN_H=1 -DLT_OBJDIR=\".libs/\" -DHAVE_PTHREAD_PRIO_INHERIT=1 -DHAVE_PTHREAD=1 -DHAVE_LIBZ=1 -DHAVE_LIBCURL=1 -DHAVE_APR_POOLS_H=1 -DHAVE_LIBAPR_1=1 -DHAVE_SVN_VERSION_H=1 -DHAVE_LIBSVN_SUBR_1=1 -DHAVE_SVN_DELTA_H=1 -DHAVE_LIBSVN_DELTA_1=1 -DHAVE_LIBSASL2=1 -DMESOS_HAS_JAVA=1 -DHAVE_PYTHON=\"2.7\" -DMESOS_HAS_PYTHON=1 -DHAVE_EVENT2_EVENT_H=1 -DHAVE_LIBEVENT=1 -DHAVE_EVENT2_THREAD_H=1 -DHAVE_LIBEVENT_PTHREADS=1 -DHAVE_OPENSSL_SSL_H=1 -DHAVE_LIBSSL=1 -DHAVE_LIBCRYPTO=1 -DHAVE_EVENT2_BUFFEREVENT_SSL_H=1 -DHAVE_LIBEVENT_OPENSSL=1 -DUSE_SSL_SOCKET=1 -I. -I../../src   -Wall -Werror -DLIBDIR=\"/mesos/mesos-0.28.3/_inst/lib\" -DPKGLIBEXECDIR=\"/mesos/mesos-0.28.3/_inst/libexec/mesos\" -DPKGDATADIR=\"/mesos/mesos-0.28.3/_inst/share/mesos\" -DPKGMODULEDIR=\"/mesos/mesos-0.28.3/_inst/lib/mesos/modules\" -I../../include -I../../3rdparty/libprocess/include -I../../3rdparty/libprocess/3rdparty/stout/include -I../include -I../include/mesos -isystem ../3rdparty/libprocess/3rdparty/boost-1.53.0 -I../3rdparty/libprocess/3rdparty/picojson-1.3.0 -DPICOJSON_USE_INT64 -D__STDC_FORMAT_MACROS -I../3rdparty/libprocess/3rdparty/protobuf-2.5.0/src -I../3rdparty/libprocess/3rdparty/glog-0.3.3/src -I../3rdparty/libprocess/3rdparty/glog-0.3.3/src -I../3rdparty/leveldb-1.4/include -I../3rdparty/zookeeper-3.4.5/src/c/include -I../3rdparty/zookeeper-3.4.5/src/c/generated -I../3rdparty/libprocess/3rdparty/protobuf-2.5.0/src -DSOURCE_DIR=\"/mesos/mesos-0.28.3/_build/..\" -DBUILD_DIR=\"/mesos/mesos-0.28.3/_build\" -I../3rdparty/libprocess/3rdparty/gmock-1.7.0/gtest/include -I../3rdparty/libprocess/3rdparty/gmock-1.7.0/include -DTESTLIBEXECDIR=\"/mesos/mesos-0.28.3/_inst/libexec/mesos/tests\" -DSBINDIR=\"/mesos/mesos-0.28.3/_inst/sbin\" -I/usr/lib/jvm/java-1.8.0-openjdk-1.8.0.111-1.b15.el7_2.x86_64/include -I/usr/lib/jvm/java-1.8.0-openjdk-1.8.0.111-1.b15.el7_2.x86_64/include/linux -DZOOKEEPER_VERSION=\"3.4.5\" -I/usr/include/subversion-1 -I/usr/include/apr-1 -I/usr/include/apr-1.0  -pthread -g1 -O0 -Wno-unused-local-typedefs -std=c++11 -MT tests/mesos_tests-exception_tests.o -MD -MP -MF tests/.deps/mesos_tests-exception_tests.Tpo -c -o tests/mesos_tests-exception_tests.o `test -f 'tests/exception_tests.cpp' || echo '../../src/'`tests/exception_tests.cpp
mv -f tests/.deps/mesos_tests-authentication_tests.Tpo tests/.deps/mesos_tests-authentication_tests.Po
g++ -DPACKAGE_NAME=\"mesos\" -DPACKAGE_TARNAME=\"mesos\" -DPACKAGE_VERSION=\"0.28.3\" -DPACKAGE_STRING=\"mesos\ 0.28.3\" -DPACKAGE_BUGREPORT=\"\" -DPACKAGE_URL=\"\" -DPACKAGE=\"mesos\" -DVERSION=\"0.28.3\" -DSTDC_HEADERS=1 -DHAVE_SYS_TYPES_H=1 -DHAVE_SYS_STAT_H=1 -DHAVE_STDLIB_H=1 -DHAVE_STRING_H=1 -DHAVE_MEMORY_H=1 -DHAVE_STRINGS_H=1 -DHAVE_INTTYPES_H=1 -DHAVE_STDINT_H=1 -DHAVE_UNISTD_H=1 -DHAVE_DLFCN_H=1 -DLT_OBJDIR=\".libs/\" -DHAVE_PTHREAD_PRIO_INHERIT=1 -DHAVE_PTHREAD=1 -DHAVE_LIBZ=1 -DHAVE_LIBCURL=1 -DHAVE_APR_POOLS_H=1 -DHAVE_LIBAPR_1=1 -DHAVE_SVN_VERSION_H=1 -DHAVE_LIBSVN_SUBR_1=1 -DHAVE_SVN_DELTA_H=1 -DHAVE_LIBSVN_DELTA_1=1 -DHAVE_LIBSASL2=1 -DMESOS_HAS_JAVA=1 -DHAVE_PYTHON=\"2.7\" -DMESOS_HAS_PYTHON=1 -DHAVE_EVENT2_EVENT_H=1 -DHAVE_LIBEVENT=1 -DHAVE_EVENT2_THREAD_H=1 -DHAVE_LIBEVENT_PTHREADS=1 -DHAVE_OPENSSL_SSL_H=1 -DHAVE_LIBSSL=1 -DHAVE_LIBCRYPTO=1 -DHAVE_EVENT2_BUFFEREVENT_SSL_H=1 -DHAVE_LIBEVENT_OPENSSL=1 -DUSE_SSL_SOCKET=1 -I. -I../../src   -Wall -Werror -DLIBDIR=\"/mesos/mesos-0.28.3/_inst/lib\" -DPKGLIBEXECDIR=\"/mesos/mesos-0.28.3/_inst/libexec/mesos\" -DPKGDATADIR=\"/mesos/mesos-0.28.3/_inst/share/mesos\" -DPKGMODULEDIR=\"/mesos/mesos-0.28.3/_inst/lib/mesos/modules\" -I../../include -I../../3rdparty/libprocess/include -I../../3rdparty/libprocess/3rdparty/stout/include -I../include -I../include/mesos -isystem ../3rdparty/libprocess/3rdparty/boost-1.53.0 -I../3rdparty/libprocess/3rdparty/picojson-1.3.0 -DPICOJSON_USE_INT64 -D__STDC_FORMAT_MACROS -I../3rdparty/libprocess/3rdparty/protobuf-2.5.0/src -I../3rdparty/libprocess/3rdparty/glog-0.3.3/src -I../3rdparty/libprocess/3rdparty/glog-0.3.3/src -I../3rdparty/leveldb-1.4/include -I../3rdparty/zookeeper-3.4.5/src/c/include -I../3rdparty/zookeeper-3.4.5/src/c/generated -I../3rdparty/libprocess/3rdparty/protobuf-2.5.0/src -DSOURCE_DIR=\"/mesos/mesos-0.28.3/_build/..\" -DBUILD_DIR=\"/mesos/mesos-0.28.3/_build\" -I../3rdparty/libprocess/3rdparty/gmock-1.7.0/gtest/include -I../3rdparty/libprocess/3rdparty/gmock-1.7.0/include -DTESTLIBEXECDIR=\"/mesos/mesos-0.28.3/_inst/libexec/mesos/tests\" -DSBINDIR=\"/mesos/mesos-0.28.3/_inst/sbin\" -I/usr/lib/jvm/java-1.8.0-openjdk-1.8.0.111-1.b15.el7_2.x86_64/include -I/usr/lib/jvm/java-1.8.0-openjdk-1.8.0.111-1.b15.el7_2.x86_64/include/linux -DZOOKEEPER_VERSION=\"3.4.5\" -I/usr/include/subversion-1 -I/usr/include/apr-1 -I/usr/include/apr-1.0  -pthread -g1 -O0 -Wno-unused-local-typedefs -std=c++11 -MT tests/mesos_tests-executor_http_api_tests.o -MD -MP -MF tests/.deps/mesos_tests-executor_http_api_tests.Tpo -c -o tests/mesos_tests-executor_http_api_tests.o `test -f 'tests/executor_http_api_tests.cpp' || echo '../../src/'`tests/executor_http_api_tests.cpp
mv -f tests/.deps/mesos_tests-containerizer.Tpo tests/.deps/mesos_tests-containerizer.Po
g++ -DPACKAGE_NAME=\"mesos\" -DPACKAGE_TARNAME=\"mesos\" -DPACKAGE_VERSION=\"0.28.3\" -DPACKAGE_STRING=\"mesos\ 0.28.3\" -DPACKAGE_BUGREPORT=\"\" -DPACKAGE_URL=\"\" -DPACKAGE=\"mesos\" -DVERSION=\"0.28.3\" -DSTDC_HEADERS=1 -DHAVE_SYS_TYPES_H=1 -DHAVE_SYS_STAT_H=1 -DHAVE_STDLIB_H=1 -DHAVE_STRING_H=1 -DHAVE_MEMORY_H=1 -DHAVE_STRINGS_H=1 -DHAVE_INTTYPES_H=1 -DHAVE_STDINT_H=1 -DHAVE_UNISTD_H=1 -DHAVE_DLFCN_H=1 -DLT_OBJDIR=\".libs/\" -DHAVE_PTHREAD_PRIO_INHERIT=1 -DHAVE_PTHREAD=1 -DHAVE_LIBZ=1 -DHAVE_LIBCURL=1 -DHAVE_APR_POOLS_H=1 -DHAVE_LIBAPR_1=1 -DHAVE_SVN_VERSION_H=1 -DHAVE_LIBSVN_SUBR_1=1 -DHAVE_SVN_DELTA_H=1 -DHAVE_LIBSVN_DELTA_1=1 -DHAVE_LIBSASL2=1 -DMESOS_HAS_JAVA=1 -DHAVE_PYTHON=\"2.7\" -DMESOS_HAS_PYTHON=1 -DHAVE_EVENT2_EVENT_H=1 -DHAVE_LIBEVENT=1 -DHAVE_EVENT2_THREAD_H=1 -DHAVE_LIBEVENT_PTHREADS=1 -DHAVE_OPENSSL_SSL_H=1 -DHAVE_LIBSSL=1 -DHAVE_LIBCRYPTO=1 -DHAVE_EVENT2_BUFFEREVENT_SSL_H=1 -DHAVE_LIBEVENT_OPENSSL=1 -DUSE_SSL_SOCKET=1 -I. -I../../src   -Wall -Werror -DLIBDIR=\"/mesos/mesos-0.28.3/_inst/lib\" -DPKGLIBEXECDIR=\"/mesos/mesos-0.28.3/_inst/libexec/mesos\" -DPKGDATADIR=\"/mesos/mesos-0.28.3/_inst/share/mesos\" -DPKGMODULEDIR=\"/mesos/mesos-0.28.3/_inst/lib/mesos/modules\" -I../../include -I../../3rdparty/libprocess/include -I../../3rdparty/libprocess/3rdparty/stout/include -I../include -I../include/mesos -isystem ../3rdparty/libprocess/3rdparty/boost-1.53.0 -I../3rdparty/libprocess/3rdparty/picojson-1.3.0 -DPICOJSON_USE_INT64 -D__STDC_FORMAT_MACROS -I../3rdparty/libprocess/3rdparty/protobuf-2.5.0/src -I../3rdparty/libprocess/3rdparty/glog-0.3.3/src -I../3rdparty/libprocess/3rdparty/glog-0.3.3/src -I../3rdparty/leveldb-1.4/include -I../3rdparty/zookeeper-3.4.5/src/c/include -I../3rdparty/zookeeper-3.4.5/src/c/generated -I../3rdparty/libprocess/3rdparty/protobuf-2.5.0/src -DSOURCE_DIR=\"/mesos/mesos-0.28.3/_build/..\" -DBUILD_DIR=\"/mesos/mesos-0.28.3/_build\" -I../3rdparty/libprocess/3rdparty/gmock-1.7.0/gtest/include -I../3rdparty/libprocess/3rdparty/gmock-1.7.0/include -DTESTLIBEXECDIR=\"/mesos/mesos-0.28.3/_inst/libexec/mesos/tests\" -DSBINDIR=\"/mesos/mesos-0.28.3/_inst/sbin\" -I/usr/lib/jvm/java-1.8.0-openjdk-1.8.0.111-1.b15.el7_2.x86_64/include -I/usr/lib/jvm/java-1.8.0-openjdk-1.8.0.111-1.b15.el7_2.x86_64/include/linux -DZOOKEEPER_VERSION=\"3.4.5\" -I/usr/include/subversion-1 -I/usr/include/apr-1 -I/usr/include/apr-1.0  -pthread -g1 -O0 -Wno-unused-local-typedefs -std=c++11 -MT tests/mesos_tests-fault_tolerance_tests.o -MD -MP -MF tests/.deps/mesos_tests-fault_tolerance_tests.Tpo -c -o tests/mesos_tests-fault_tolerance_tests.o `test -f 'tests/fault_tolerance_tests.cpp' || echo '../../src/'`tests/fault_tolerance_tests.cpp
mv -f tests/.deps/mesos_tests-cram_md5_authentication_tests.Tpo tests/.deps/mesos_tests-cram_md5_authentication_tests.Po
g++ -DPACKAGE_NAME=\"mesos\" -DPACKAGE_TARNAME=\"mesos\" -DPACKAGE_VERSION=\"0.28.3\" -DPACKAGE_STRING=\"mesos\ 0.28.3\" -DPACKAGE_BUGREPORT=\"\" -DPACKAGE_URL=\"\" -DPACKAGE=\"mesos\" -DVERSION=\"0.28.3\" -DSTDC_HEADERS=1 -DHAVE_SYS_TYPES_H=1 -DHAVE_SYS_STAT_H=1 -DHAVE_STDLIB_H=1 -DHAVE_STRING_H=1 -DHAVE_MEMORY_H=1 -DHAVE_STRINGS_H=1 -DHAVE_INTTYPES_H=1 -DHAVE_STDINT_H=1 -DHAVE_UNISTD_H=1 -DHAVE_DLFCN_H=1 -DLT_OBJDIR=\".libs/\" -DHAVE_PTHREAD_PRIO_INHERIT=1 -DHAVE_PTHREAD=1 -DHAVE_LIBZ=1 -DHAVE_LIBCURL=1 -DHAVE_APR_POOLS_H=1 -DHAVE_LIBAPR_1=1 -DHAVE_SVN_VERSION_H=1 -DHAVE_LIBSVN_SUBR_1=1 -DHAVE_SVN_DELTA_H=1 -DHAVE_LIBSVN_DELTA_1=1 -DHAVE_LIBSASL2=1 -DMESOS_HAS_JAVA=1 -DHAVE_PYTHON=\"2.7\" -DMESOS_HAS_PYTHON=1 -DHAVE_EVENT2_EVENT_H=1 -DHAVE_LIBEVENT=1 -DHAVE_EVENT2_THREAD_H=1 -DHAVE_LIBEVENT_PTHREADS=1 -DHAVE_OPENSSL_SSL_H=1 -DHAVE_LIBSSL=1 -DHAVE_LIBCRYPTO=1 -DHAVE_EVENT2_BUFFEREVENT_SSL_H=1 -DHAVE_LIBEVENT_OPENSSL=1 -DUSE_SSL_SOCKET=1 -I. -I../../src   -Wall -Werror -DLIBDIR=\"/mesos/mesos-0.28.3/_inst/lib\" -DPKGLIBEXECDIR=\"/mesos/mesos-0.28.3/_inst/libexec/mesos\" -DPKGDATADIR=\"/mesos/mesos-0.28.3/_inst/share/mesos\" -DPKGMODULEDIR=\"/mesos/mesos-0.28.3/_inst/lib/mesos/modules\" -I../../include -I../../3rdparty/libprocess/include -I../../3rdparty/libprocess/3rdparty/stout/include -I../include -I../include/mesos -isystem ../3rdparty/libprocess/3rdparty/boost-1.53.0 -I../3rdparty/libprocess/3rdparty/picojson-1.3.0 -DPICOJSON_USE_INT64 -D__STDC_FORMAT_MACROS -I../3rdparty/libprocess/3rdparty/protobuf-2.5.0/src -I../3rdparty/libprocess/3rdparty/glog-0.3.3/src -I../3rdparty/libprocess/3rdparty/glog-0.3.3/src -I../3rdparty/leveldb-1.4/include -I../3rdparty/zookeeper-3.4.5/src/c/include -I../3rdparty/zookeeper-3.4.5/src/c/generated -I../3rdparty/libprocess/3rdparty/protobuf-2.5.0/src -DSOURCE_DIR=\"/mesos/mesos-0.28.3/_build/..\" -DBUILD_DIR=\"/mesos/mesos-0.28.3/_build\" -I../3rdparty/libprocess/3rdparty/gmock-1.7.0/gtest/include -I../3rdparty/libprocess/3rdparty/gmock-1.7.0/include -DTESTLIBEXECDIR=\"/mesos/mesos-0.28.3/_inst/libexec/mesos/tests\" -DSBINDIR=\"/mesos/mesos-0.28.3/_inst/sbin\" -I/usr/lib/jvm/java-1.8.0-openjdk-1.8.0.111-1.b15.el7_2.x86_64/include -I/usr/lib/jvm/java-1.8.0-openjdk-1.8.0.111-1.b15.el7_2.x86_64/include/linux -DZOOKEEPER_VERSION=\"3.4.5\" -I/usr/include/subversion-1 -I/usr/include/apr-1 -I/usr/include/apr-1.0  -pthread -g1 -O0 -Wno-unused-local-typedefs -std=c++11 -MT tests/mesos_tests-fetcher_cache_tests.o -MD -MP -MF tests/.deps/mesos_tests-fetcher_cache_tests.Tpo -c -o tests/mesos_tests-fetcher_cache_tests.o `test -f 'tests/fetcher_cache_tests.cpp' || echo '../../src/'`tests/fetcher_cache_tests.cpp
mv -f tests/.deps/mesos_tests-container_logger_tests.Tpo tests/.deps/mesos_tests-container_logger_tests.Po
g++ -DPACKAGE_NAME=\"mesos\" -DPACKAGE_TARNAME=\"mesos\" -DPACKAGE_VERSION=\"0.28.3\" -DPACKAGE_STRING=\"mesos\ 0.28.3\" -DPACKAGE_BUGREPORT=\"\" -DPACKAGE_URL=\"\" -DPACKAGE=\"mesos\" -DVERSION=\"0.28.3\" -DSTDC_HEADERS=1 -DHAVE_SYS_TYPES_H=1 -DHAVE_SYS_STAT_H=1 -DHAVE_STDLIB_H=1 -DHAVE_STRING_H=1 -DHAVE_MEMORY_H=1 -DHAVE_STRINGS_H=1 -DHAVE_INTTYPES_H=1 -DHAVE_STDINT_H=1 -DHAVE_UNISTD_H=1 -DHAVE_DLFCN_H=1 -DLT_OBJDIR=\".libs/\" -DHAVE_PTHREAD_PRIO_INHERIT=1 -DHAVE_PTHREAD=1 -DHAVE_LIBZ=1 -DHAVE_LIBCURL=1 -DHAVE_APR_POOLS_H=1 -DHAVE_LIBAPR_1=1 -DHAVE_SVN_VERSION_H=1 -DHAVE_LIBSVN_SUBR_1=1 -DHAVE_SVN_DELTA_H=1 -DHAVE_LIBSVN_DELTA_1=1 -DHAVE_LIBSASL2=1 -DMESOS_HAS_JAVA=1 -DHAVE_PYTHON=\"2.7\" -DMESOS_HAS_PYTHON=1 -DHAVE_EVENT2_EVENT_H=1 -DHAVE_LIBEVENT=1 -DHAVE_EVENT2_THREAD_H=1 -DHAVE_LIBEVENT_PTHREADS=1 -DHAVE_OPENSSL_SSL_H=1 -DHAVE_LIBSSL=1 -DHAVE_LIBCRYPTO=1 -DHAVE_EVENT2_BUFFEREVENT_SSL_H=1 -DHAVE_LIBEVENT_OPENSSL=1 -DUSE_SSL_SOCKET=1 -I. -I../../src   -Wall -Werror -DLIBDIR=\"/mesos/mesos-0.28.3/_inst/lib\" -DPKGLIBEXECDIR=\"/mesos/mesos-0.28.3/_inst/libexec/mesos\" -DPKGDATADIR=\"/mesos/mesos-0.28.3/_inst/share/mesos\" -DPKGMODULEDIR=\"/mesos/mesos-0.28.3/_inst/lib/mesos/modules\" -I../../include -I../../3rdparty/libprocess/include -I../../3rdparty/libprocess/3rdparty/stout/include -I../include -I../include/mesos -isystem ../3rdparty/libprocess/3rdparty/boost-1.53.0 -I../3rdparty/libprocess/3rdparty/picojson-1.3.0 -DPICOJSON_USE_INT64 -D__STDC_FORMAT_MACROS -I../3rdparty/libprocess/3rdparty/protobuf-2.5.0/src -I../3rdparty/libprocess/3rdparty/glog-0.3.3/src -I../3rdparty/libprocess/3rdparty/glog-0.3.3/src -I../3rdparty/leveldb-1.4/include -I../3rdparty/zookeeper-3.4.5/src/c/include -I../3rdparty/zookeeper-3.4.5/src/c/generated -I../3rdparty/libprocess/3rdparty/protobuf-2.5.0/src -DSOURCE_DIR=\"/mesos/mesos-0.28.3/_build/..\" -DBUILD_DIR=\"/mesos/mesos-0.28.3/_build\" -I../3rdparty/libprocess/3rdparty/gmock-1.7.0/gtest/include -I../3rdparty/libprocess/3rdparty/gmock-1.7.0/include -DTESTLIBEXECDIR=\"/mesos/mesos-0.28.3/_inst/libexec/mesos/tests\" -DSBINDIR=\"/mesos/mesos-0.28.3/_inst/sbin\" -I/usr/lib/jvm/java-1.8.0-openjdk-1.8.0.111-1.b15.el7_2.x86_64/include -I/usr/lib/jvm/java-1.8.0-openjdk-1.8.0.111-1.b15.el7_2.x86_64/include/linux -DZOOKEEPER_VERSION=\"3.4.5\" -I/usr/include/subversion-1 -I/usr/include/apr-1 -I/usr/include/apr-1.0  -pthread -g1 -O0 -Wno-unused-local-typedefs -std=c++11 -MT tests/mesos_tests-fetcher_tests.o -MD -MP -MF tests/.deps/mesos_tests-fetcher_tests.Tpo -c -o tests/mesos_tests-fetcher_tests.o `test -f 'tests/fetcher_tests.cpp' || echo '../../src/'`tests/fetcher_tests.cpp
mv -f tests/.deps/mesos_tests-environment.Tpo tests/.deps/mesos_tests-environment.Po
g++ -DPACKAGE_NAME=\"mesos\" -DPACKAGE_TARNAME=\"mesos\" -DPACKAGE_VERSION=\"0.28.3\" -DPACKAGE_STRING=\"mesos\ 0.28.3\" -DPACKAGE_BUGREPORT=\"\" -DPACKAGE_URL=\"\" -DPACKAGE=\"mesos\" -DVERSION=\"0.28.3\" -DSTDC_HEADERS=1 -DHAVE_SYS_TYPES_H=1 -DHAVE_SYS_STAT_H=1 -DHAVE_STDLIB_H=1 -DHAVE_STRING_H=1 -DHAVE_MEMORY_H=1 -DHAVE_STRINGS_H=1 -DHAVE_INTTYPES_H=1 -DHAVE_STDINT_H=1 -DHAVE_UNISTD_H=1 -DHAVE_DLFCN_H=1 -DLT_OBJDIR=\".libs/\" -DHAVE_PTHREAD_PRIO_INHERIT=1 -DHAVE_PTHREAD=1 -DHAVE_LIBZ=1 -DHAVE_LIBCURL=1 -DHAVE_APR_POOLS_H=1 -DHAVE_LIBAPR_1=1 -DHAVE_SVN_VERSION_H=1 -DHAVE_LIBSVN_SUBR_1=1 -DHAVE_SVN_DELTA_H=1 -DHAVE_LIBSVN_DELTA_1=1 -DHAVE_LIBSASL2=1 -DMESOS_HAS_JAVA=1 -DHAVE_PYTHON=\"2.7\" -DMESOS_HAS_PYTHON=1 -DHAVE_EVENT2_EVENT_H=1 -DHAVE_LIBEVENT=1 -DHAVE_EVENT2_THREAD_H=1 -DHAVE_LIBEVENT_PTHREADS=1 -DHAVE_OPENSSL_SSL_H=1 -DHAVE_LIBSSL=1 -DHAVE_LIBCRYPTO=1 -DHAVE_EVENT2_BUFFEREVENT_SSL_H=1 -DHAVE_LIBEVENT_OPENSSL=1 -DUSE_SSL_SOCKET=1 -I. -I../../src   -Wall -Werror -DLIBDIR=\"/mesos/mesos-0.28.3/_inst/lib\" -DPKGLIBEXECDIR=\"/mesos/mesos-0.28.3/_inst/libexec/mesos\" -DPKGDATADIR=\"/mesos/mesos-0.28.3/_inst/share/mesos\" -DPKGMODULEDIR=\"/mesos/mesos-0.28.3/_inst/lib/mesos/modules\" -I../../include -I../../3rdparty/libprocess/include -I../../3rdparty/libprocess/3rdparty/stout/include -I../include -I../include/mesos -isystem ../3rdparty/libprocess/3rdparty/boost-1.53.0 -I../3rdparty/libprocess/3rdparty/picojson-1.3.0 -DPICOJSON_USE_INT64 -D__STDC_FORMAT_MACROS -I../3rdparty/libprocess/3rdparty/protobuf-2.5.0/src -I../3rdparty/libprocess/3rdparty/glog-0.3.3/src -I../3rdparty/libprocess/3rdparty/glog-0.3.3/src -I../3rdparty/leveldb-1.4/include -I../3rdparty/zookeeper-3.4.5/src/c/include -I../3rdparty/zookeeper-3.4.5/src/c/generated -I../3rdparty/libprocess/3rdparty/protobuf-2.5.0/src -DSOURCE_DIR=\"/mesos/mesos-0.28.3/_build/..\" -DBUILD_DIR=\"/mesos/mesos-0.28.3/_build\" -I../3rdparty/libprocess/3rdparty/gmock-1.7.0/gtest/include -I../3rdparty/libprocess/3rdparty/gmock-1.7.0/include -DTESTLIBEXECDIR=\"/mesos/mesos-0.28.3/_inst/libexec/mesos/tests\" -DSBINDIR=\"/mesos/mesos-0.28.3/_inst/sbin\" -I/usr/lib/jvm/java-1.8.0-openjdk-1.8.0.111-1.b15.el7_2.x86_64/include -I/usr/lib/jvm/java-1.8.0-openjdk-1.8.0.111-1.b15.el7_2.x86_64/include/linux -DZOOKEEPER_VERSION=\"3.4.5\" -I/usr/include/subversion-1 -I/usr/include/apr-1 -I/usr/include/apr-1.0  -pthread -g1 -O0 -Wno-unused-local-typedefs -std=c++11 -MT tests/mesos_tests-files_tests.o -MD -MP -MF tests/.deps/mesos_tests-files_tests.Tpo -c -o tests/mesos_tests-files_tests.o `test -f 'tests/files_tests.cpp' || echo '../../src/'`tests/files_tests.cpp
mv -f tests/.deps/mesos_tests-credentials_tests.Tpo tests/.deps/mesos_tests-credentials_tests.Po
g++ -DPACKAGE_NAME=\"mesos\" -DPACKAGE_TARNAME=\"mesos\" -DPACKAGE_VERSION=\"0.28.3\" -DPACKAGE_STRING=\"mesos\ 0.28.3\" -DPACKAGE_BUGREPORT=\"\" -DPACKAGE_URL=\"\" -DPACKAGE=\"mesos\" -DVERSION=\"0.28.3\" -DSTDC_HEADERS=1 -DHAVE_SYS_TYPES_H=1 -DHAVE_SYS_STAT_H=1 -DHAVE_STDLIB_H=1 -DHAVE_STRING_H=1 -DHAVE_MEMORY_H=1 -DHAVE_STRINGS_H=1 -DHAVE_INTTYPES_H=1 -DHAVE_STDINT_H=1 -DHAVE_UNISTD_H=1 -DHAVE_DLFCN_H=1 -DLT_OBJDIR=\".libs/\" -DHAVE_PTHREAD_PRIO_INHERIT=1 -DHAVE_PTHREAD=1 -DHAVE_LIBZ=1 -DHAVE_LIBCURL=1 -DHAVE_APR_POOLS_H=1 -DHAVE_LIBAPR_1=1 -DHAVE_SVN_VERSION_H=1 -DHAVE_LIBSVN_SUBR_1=1 -DHAVE_SVN_DELTA_H=1 -DHAVE_LIBSVN_DELTA_1=1 -DHAVE_LIBSASL2=1 -DMESOS_HAS_JAVA=1 -DHAVE_PYTHON=\"2.7\" -DMESOS_HAS_PYTHON=1 -DHAVE_EVENT2_EVENT_H=1 -DHAVE_LIBEVENT=1 -DHAVE_EVENT2_THREAD_H=1 -DHAVE_LIBEVENT_PTHREADS=1 -DHAVE_OPENSSL_SSL_H=1 -DHAVE_LIBSSL=1 -DHAVE_LIBCRYPTO=1 -DHAVE_EVENT2_BUFFEREVENT_SSL_H=1 -DHAVE_LIBEVENT_OPENSSL=1 -DUSE_SSL_SOCKET=1 -I. -I../../src   -Wall -Werror -DLIBDIR=\"/mesos/mesos-0.28.3/_inst/lib\" -DPKGLIBEXECDIR=\"/mesos/mesos-0.28.3/_inst/libexec/mesos\" -DPKGDATADIR=\"/mesos/mesos-0.28.3/_inst/share/mesos\" -DPKGMODULEDIR=\"/mesos/mesos-0.28.3/_inst/lib/mesos/modules\" -I../../include -I../../3rdparty/libprocess/include -I../../3rdparty/libprocess/3rdparty/stout/include -I../include -I../include/mesos -isystem ../3rdparty/libprocess/3rdparty/boost-1.53.0 -I../3rdparty/libprocess/3rdparty/picojson-1.3.0 -DPICOJSON_USE_INT64 -D__STDC_FORMAT_MACROS -I../3rdparty/libprocess/3rdparty/protobuf-2.5.0/src -I../3rdparty/libprocess/3rdparty/glog-0.3.3/src -I../3rdparty/libprocess/3rdparty/glog-0.3.3/src -I../3rdparty/leveldb-1.4/include -I../3rdparty/zookeeper-3.4.5/src/c/include -I../3rdparty/zookeeper-3.4.5/src/c/generated -I../3rdparty/libprocess/3rdparty/protobuf-2.5.0/src -DSOURCE_DIR=\"/mesos/mesos-0.28.3/_build/..\" -DBUILD_DIR=\"/mesos/mesos-0.28.3/_build\" -I../3rdparty/libprocess/3rdparty/gmock-1.7.0/gtest/include -I../3rdparty/libprocess/3rdparty/gmock-1.7.0/include -DTESTLIBEXECDIR=\"/mesos/mesos-0.28.3/_inst/libexec/mesos/tests\" -DSBINDIR=\"/mesos/mesos-0.28.3/_inst/sbin\" -I/usr/lib/jvm/java-1.8.0-openjdk-1.8.0.111-1.b15.el7_2.x86_64/include -I/usr/lib/jvm/java-1.8.0-openjdk-1.8.0.111-1.b15.el7_2.x86_64/include/linux -DZOOKEEPER_VERSION=\"3.4.5\" -I/usr/include/subversion-1 -I/usr/include/apr-1 -I/usr/include/apr-1.0  -pthread -g1 -O0 -Wno-unused-local-typedefs -std=c++11 -MT tests/mesos_tests-flags.o -MD -MP -MF tests/.deps/mesos_tests-flags.Tpo -c -o tests/mesos_tests-flags.o `test -f 'tests/flags.cpp' || echo '../../src/'`tests/flags.cpp
mv -f tests/.deps/mesos_tests-files_tests.Tpo tests/.deps/mesos_tests-files_tests.Po
g++ -DPACKAGE_NAME=\"mesos\" -DPACKAGE_TARNAME=\"mesos\" -DPACKAGE_VERSION=\"0.28.3\" -DPACKAGE_STRING=\"mesos\ 0.28.3\" -DPACKAGE_BUGREPORT=\"\" -DPACKAGE_URL=\"\" -DPACKAGE=\"mesos\" -DVERSION=\"0.28.3\" -DSTDC_HEADERS=1 -DHAVE_SYS_TYPES_H=1 -DHAVE_SYS_STAT_H=1 -DHAVE_STDLIB_H=1 -DHAVE_STRING_H=1 -DHAVE_MEMORY_H=1 -DHAVE_STRINGS_H=1 -DHAVE_INTTYPES_H=1 -DHAVE_STDINT_H=1 -DHAVE_UNISTD_H=1 -DHAVE_DLFCN_H=1 -DLT_OBJDIR=\".libs/\" -DHAVE_PTHREAD_PRIO_INHERIT=1 -DHAVE_PTHREAD=1 -DHAVE_LIBZ=1 -DHAVE_LIBCURL=1 -DHAVE_APR_POOLS_H=1 -DHAVE_LIBAPR_1=1 -DHAVE_SVN_VERSION_H=1 -DHAVE_LIBSVN_SUBR_1=1 -DHAVE_SVN_DELTA_H=1 -DHAVE_LIBSVN_DELTA_1=1 -DHAVE_LIBSASL2=1 -DMESOS_HAS_JAVA=1 -DHAVE_PYTHON=\"2.7\" -DMESOS_HAS_PYTHON=1 -DHAVE_EVENT2_EVENT_H=1 -DHAVE_LIBEVENT=1 -DHAVE_EVENT2_THREAD_H=1 -DHAVE_LIBEVENT_PTHREADS=1 -DHAVE_OPENSSL_SSL_H=1 -DHAVE_LIBSSL=1 -DHAVE_LIBCRYPTO=1 -DHAVE_EVENT2_BUFFEREVENT_SSL_H=1 -DHAVE_LIBEVENT_OPENSSL=1 -DUSE_SSL_SOCKET=1 -I. -I../../src   -Wall -Werror -DLIBDIR=\"/mesos/mesos-0.28.3/_inst/lib\" -DPKGLIBEXECDIR=\"/mesos/mesos-0.28.3/_inst/libexec/mesos\" -DPKGDATADIR=\"/mesos/mesos-0.28.3/_inst/share/mesos\" -DPKGMODULEDIR=\"/mesos/mesos-0.28.3/_inst/lib/mesos/modules\" -I../../include -I../../3rdparty/libprocess/include -I../../3rdparty/libprocess/3rdparty/stout/include -I../include -I../include/mesos -isystem ../3rdparty/libprocess/3rdparty/boost-1.53.0 -I../3rdparty/libprocess/3rdparty/picojson-1.3.0 -DPICOJSON_USE_INT64 -D__STDC_FORMAT_MACROS -I../3rdparty/libprocess/3rdparty/protobuf-2.5.0/src -I../3rdparty/libprocess/3rdparty/glog-0.3.3/src -I../3rdparty/libprocess/3rdparty/glog-0.3.3/src -I../3rdparty/leveldb-1.4/include -I../3rdparty/zookeeper-3.4.5/src/c/include -I../3rdparty/zookeeper-3.4.5/src/c/generated -I../3rdparty/libprocess/3rdparty/protobuf-2.5.0/src -DSOURCE_DIR=\"/mesos/mesos-0.28.3/_build/..\" -DBUILD_DIR=\"/mesos/mesos-0.28.3/_build\" -I../3rdparty/libprocess/3rdparty/gmock-1.7.0/gtest/include -I../3rdparty/libprocess/3rdparty/gmock-1.7.0/include -DTESTLIBEXECDIR=\"/mesos/mesos-0.28.3/_inst/libexec/mesos/tests\" -DSBINDIR=\"/mesos/mesos-0.28.3/_inst/sbin\" -I/usr/lib/jvm/java-1.8.0-openjdk-1.8.0.111-1.b15.el7_2.x86_64/include -I/usr/lib/jvm/java-1.8.0-openjdk-1.8.0.111-1.b15.el7_2.x86_64/include/linux -DZOOKEEPER_VERSION=\"3.4.5\" -I/usr/include/subversion-1 -I/usr/include/apr-1 -I/usr/include/apr-1.0  -pthread -g1 -O0 -Wno-unused-local-typedefs -std=c++11 -MT tests/mesos_tests-gc_tests.o -MD -MP -MF tests/.deps/mesos_tests-gc_tests.Tpo -c -o tests/mesos_tests-gc_tests.o `test -f 'tests/gc_tests.cpp' || echo '../../src/'`tests/gc_tests.cpp
mv -f tests/.deps/mesos_tests-flags.Tpo tests/.deps/mesos_tests-flags.Po
g++ -DPACKAGE_NAME=\"mesos\" -DPACKAGE_TARNAME=\"mesos\" -DPACKAGE_VERSION=\"0.28.3\" -DPACKAGE_STRING=\"mesos\ 0.28.3\" -DPACKAGE_BUGREPORT=\"\" -DPACKAGE_URL=\"\" -DPACKAGE=\"mesos\" -DVERSION=\"0.28.3\" -DSTDC_HEADERS=1 -DHAVE_SYS_TYPES_H=1 -DHAVE_SYS_STAT_H=1 -DHAVE_STDLIB_H=1 -DHAVE_STRING_H=1 -DHAVE_MEMORY_H=1 -DHAVE_STRINGS_H=1 -DHAVE_INTTYPES_H=1 -DHAVE_STDINT_H=1 -DHAVE_UNISTD_H=1 -DHAVE_DLFCN_H=1 -DLT_OBJDIR=\".libs/\" -DHAVE_PTHREAD_PRIO_INHERIT=1 -DHAVE_PTHREAD=1 -DHAVE_LIBZ=1 -DHAVE_LIBCURL=1 -DHAVE_APR_POOLS_H=1 -DHAVE_LIBAPR_1=1 -DHAVE_SVN_VERSION_H=1 -DHAVE_LIBSVN_SUBR_1=1 -DHAVE_SVN_DELTA_H=1 -DHAVE_LIBSVN_DELTA_1=1 -DHAVE_LIBSASL2=1 -DMESOS_HAS_JAVA=1 -DHAVE_PYTHON=\"2.7\" -DMESOS_HAS_PYTHON=1 -DHAVE_EVENT2_EVENT_H=1 -DHAVE_LIBEVENT=1 -DHAVE_EVENT2_THREAD_H=1 -DHAVE_LIBEVENT_PTHREADS=1 -DHAVE_OPENSSL_SSL_H=1 -DHAVE_LIBSSL=1 -DHAVE_LIBCRYPTO=1 -DHAVE_EVENT2_BUFFEREVENT_SSL_H=1 -DHAVE_LIBEVENT_OPENSSL=1 -DUSE_SSL_SOCKET=1 -I. -I../../src   -Wall -Werror -DLIBDIR=\"/mesos/mesos-0.28.3/_inst/lib\" -DPKGLIBEXECDIR=\"/mesos/mesos-0.28.3/_inst/libexec/mesos\" -DPKGDATADIR=\"/mesos/mesos-0.28.3/_inst/share/mesos\" -DPKGMODULEDIR=\"/mesos/mesos-0.28.3/_inst/lib/mesos/modules\" -I../../include -I../../3rdparty/libprocess/include -I../../3rdparty/libprocess/3rdparty/stout/include -I../include -I../include/mesos -isystem ../3rdparty/libprocess/3rdparty/boost-1.53.0 -I../3rdparty/libprocess/3rdparty/picojson-1.3.0 -DPICOJSON_USE_INT64 -D__STDC_FORMAT_MACROS -I../3rdparty/libprocess/3rdparty/protobuf-2.5.0/src -I../3rdparty/libprocess/3rdparty/glog-0.3.3/src -I../3rdparty/libprocess/3rdparty/glog-0.3.3/src -I../3rdparty/leveldb-1.4/include -I../3rdparty/zookeeper-3.4.5/src/c/include -I../3rdparty/zookeeper-3.4.5/src/c/generated -I../3rdparty/libprocess/3rdparty/protobuf-2.5.0/src -DSOURCE_DIR=\"/mesos/mesos-0.28.3/_build/..\" -DBUILD_DIR=\"/mesos/mesos-0.28.3/_build\" -I../3rdparty/libprocess/3rdparty/gmock-1.7.0/gtest/include -I../3rdparty/libprocess/3rdparty/gmock-1.7.0/include -DTESTLIBEXECDIR=\"/mesos/mesos-0.28.3/_inst/libexec/mesos/tests\" -DSBINDIR=\"/mesos/mesos-0.28.3/_inst/sbin\" -I/usr/lib/jvm/java-1.8.0-openjdk-1.8.0.111-1.b15.el7_2.x86_64/include -I/usr/lib/jvm/java-1.8.0-openjdk-1.8.0.111-1.b15.el7_2.x86_64/include/linux -DZOOKEEPER_VERSION=\"3.4.5\" -I/usr/include/subversion-1 -I/usr/include/apr-1 -I/usr/include/apr-1.0  -pthread -g1 -O0 -Wno-unused-local-typedefs -std=c++11 -MT tests/mesos_tests-hdfs_tests.o -MD -MP -MF tests/.deps/mesos_tests-hdfs_tests.Tpo -c -o tests/mesos_tests-hdfs_tests.o `test -f 'tests/hdfs_tests.cpp' || echo '../../src/'`tests/hdfs_tests.cpp
mv -f tests/.deps/mesos_tests-exception_tests.Tpo tests/.deps/mesos_tests-exception_tests.Po
g++ -DPACKAGE_NAME=\"mesos\" -DPACKAGE_TARNAME=\"mesos\" -DPACKAGE_VERSION=\"0.28.3\" -DPACKAGE_STRING=\"mesos\ 0.28.3\" -DPACKAGE_BUGREPORT=\"\" -DPACKAGE_URL=\"\" -DPACKAGE=\"mesos\" -DVERSION=\"0.28.3\" -DSTDC_HEADERS=1 -DHAVE_SYS_TYPES_H=1 -DHAVE_SYS_STAT_H=1 -DHAVE_STDLIB_H=1 -DHAVE_STRING_H=1 -DHAVE_MEMORY_H=1 -DHAVE_STRINGS_H=1 -DHAVE_INTTYPES_H=1 -DHAVE_STDINT_H=1 -DHAVE_UNISTD_H=1 -DHAVE_DLFCN_H=1 -DLT_OBJDIR=\".libs/\" -DHAVE_PTHREAD_PRIO_INHERIT=1 -DHAVE_PTHREAD=1 -DHAVE_LIBZ=1 -DHAVE_LIBCURL=1 -DHAVE_APR_POOLS_H=1 -DHAVE_LIBAPR_1=1 -DHAVE_SVN_VERSION_H=1 -DHAVE_LIBSVN_SUBR_1=1 -DHAVE_SVN_DELTA_H=1 -DHAVE_LIBSVN_DELTA_1=1 -DHAVE_LIBSASL2=1 -DMESOS_HAS_JAVA=1 -DHAVE_PYTHON=\"2.7\" -DMESOS_HAS_PYTHON=1 -DHAVE_EVENT2_EVENT_H=1 -DHAVE_LIBEVENT=1 -DHAVE_EVENT2_THREAD_H=1 -DHAVE_LIBEVENT_PTHREADS=1 -DHAVE_OPENSSL_SSL_H=1 -DHAVE_LIBSSL=1 -DHAVE_LIBCRYPTO=1 -DHAVE_EVENT2_BUFFEREVENT_SSL_H=1 -DHAVE_LIBEVENT_OPENSSL=1 -DUSE_SSL_SOCKET=1 -I. -I../../src   -Wall -Werror -DLIBDIR=\"/mesos/mesos-0.28.3/_inst/lib\" -DPKGLIBEXECDIR=\"/mesos/mesos-0.28.3/_inst/libexec/mesos\" -DPKGDATADIR=\"/mesos/mesos-0.28.3/_inst/share/mesos\" -DPKGMODULEDIR=\"/mesos/mesos-0.28.3/_inst/lib/mesos/modules\" -I../../include -I../../3rdparty/libprocess/include -I../../3rdparty/libprocess/3rdparty/stout/include -I../include -I../include/mesos -isystem ../3rdparty/libprocess/3rdparty/boost-1.53.0 -I../3rdparty/libprocess/3rdparty/picojson-1.3.0 -DPICOJSON_USE_INT64 -D__STDC_FORMAT_MACROS -I../3rdparty/libprocess/3rdparty/protobuf-2.5.0/src -I../3rdparty/libprocess/3rdparty/glog-0.3.3/src -I../3rdparty/libprocess/3rdparty/glog-0.3.3/src -I../3rdparty/leveldb-1.4/include -I../3rdparty/zookeeper-3.4.5/src/c/include -I../3rdparty/zookeeper-3.4.5/src/c/generated -I../3rdparty/libprocess/3rdparty/protobuf-2.5.0/src -DSOURCE_DIR=\"/mesos/mesos-0.28.3/_build/..\" -DBUILD_DIR=\"/mesos/mesos-0.28.3/_build\" -I../3rdparty/libprocess/3rdparty/gmock-1.7.0/gtest/include -I../3rdparty/libprocess/3rdparty/gmock-1.7.0/include -DTESTLIBEXECDIR=\"/mesos/mesos-0.28.3/_inst/libexec/mesos/tests\" -DSBINDIR=\"/mesos/mesos-0.28.3/_inst/sbin\" -I/usr/lib/jvm/java-1.8.0-openjdk-1.8.0.111-1.b15.el7_2.x86_64/include -I/usr/lib/jvm/java-1.8.0-openjdk-1.8.0.111-1.b15.el7_2.x86_64/include/linux -DZOOKEEPER_VERSION=\"3.4.5\" -I/usr/include/subversion-1 -I/usr/include/apr-1 -I/usr/include/apr-1.0  -pthread -g1 -O0 -Wno-unused-local-typedefs -std=c++11 -MT tests/mesos_tests-health_check_tests.o -MD -MP -MF tests/.deps/mesos_tests-health_check_tests.Tpo -c -o tests/mesos_tests-health_check_tests.o `test -f 'tests/health_check_tests.cpp' || echo '../../src/'`tests/health_check_tests.cpp
mv -f tests/.deps/mesos_tests-disk_quota_tests.Tpo tests/.deps/mesos_tests-disk_quota_tests.Po
g++ -DPACKAGE_NAME=\"mesos\" -DPACKAGE_TARNAME=\"mesos\" -DPACKAGE_VERSION=\"0.28.3\" -DPACKAGE_STRING=\"mesos\ 0.28.3\" -DPACKAGE_BUGREPORT=\"\" -DPACKAGE_URL=\"\" -DPACKAGE=\"mesos\" -DVERSION=\"0.28.3\" -DSTDC_HEADERS=1 -DHAVE_SYS_TYPES_H=1 -DHAVE_SYS_STAT_H=1 -DHAVE_STDLIB_H=1 -DHAVE_STRING_H=1 -DHAVE_MEMORY_H=1 -DHAVE_STRINGS_H=1 -DHAVE_INTTYPES_H=1 -DHAVE_STDINT_H=1 -DHAVE_UNISTD_H=1 -DHAVE_DLFCN_H=1 -DLT_OBJDIR=\".libs/\" -DHAVE_PTHREAD_PRIO_INHERIT=1 -DHAVE_PTHREAD=1 -DHAVE_LIBZ=1 -DHAVE_LIBCURL=1 -DHAVE_APR_POOLS_H=1 -DHAVE_LIBAPR_1=1 -DHAVE_SVN_VERSION_H=1 -DHAVE_LIBSVN_SUBR_1=1 -DHAVE_SVN_DELTA_H=1 -DHAVE_LIBSVN_DELTA_1=1 -DHAVE_LIBSASL2=1 -DMESOS_HAS_JAVA=1 -DHAVE_PYTHON=\"2.7\" -DMESOS_HAS_PYTHON=1 -DHAVE_EVENT2_EVENT_H=1 -DHAVE_LIBEVENT=1 -DHAVE_EVENT2_THREAD_H=1 -DHAVE_LIBEVENT_PTHREADS=1 -DHAVE_OPENSSL_SSL_H=1 -DHAVE_LIBSSL=1 -DHAVE_LIBCRYPTO=1 -DHAVE_EVENT2_BUFFEREVENT_SSL_H=1 -DHAVE_LIBEVENT_OPENSSL=1 -DUSE_SSL_SOCKET=1 -I. -I../../src   -Wall -Werror -DLIBDIR=\"/mesos/mesos-0.28.3/_inst/lib\" -DPKGLIBEXECDIR=\"/mesos/mesos-0.28.3/_inst/libexec/mesos\" -DPKGDATADIR=\"/mesos/mesos-0.28.3/_inst/share/mesos\" -DPKGMODULEDIR=\"/mesos/mesos-0.28.3/_inst/lib/mesos/modules\" -I../../include -I../../3rdparty/libprocess/include -I../../3rdparty/libprocess/3rdparty/stout/include -I../include -I../include/mesos -isystem ../3rdparty/libprocess/3rdparty/boost-1.53.0 -I../3rdparty/libprocess/3rdparty/picojson-1.3.0 -DPICOJSON_USE_INT64 -D__STDC_FORMAT_MACROS -I../3rdparty/libprocess/3rdparty/protobuf-2.5.0/src -I../3rdparty/libprocess/3rdparty/glog-0.3.3/src -I../3rdparty/libprocess/3rdparty/glog-0.3.3/src -I../3rdparty/leveldb-1.4/include -I../3rdparty/zookeeper-3.4.5/src/c/include -I../3rdparty/zookeeper-3.4.5/src/c/generated -I../3rdparty/libprocess/3rdparty/protobuf-2.5.0/src -DSOURCE_DIR=\"/mesos/mesos-0.28.3/_build/..\" -DBUILD_DIR=\"/mesos/mesos-0.28.3/_build\" -I../3rdparty/libprocess/3rdparty/gmock-1.7.0/gtest/include -I../3rdparty/libprocess/3rdparty/gmock-1.7.0/include -DTESTLIBEXECDIR=\"/mesos/mesos-0.28.3/_inst/libexec/mesos/tests\" -DSBINDIR=\"/mesos/mesos-0.28.3/_inst/sbin\" -I/usr/lib/jvm/java-1.8.0-openjdk-1.8.0.111-1.b15.el7_2.x86_64/include -I/usr/lib/jvm/java-1.8.0-openjdk-1.8.0.111-1.b15.el7_2.x86_64/include/linux -DZOOKEEPER_VERSION=\"3.4.5\" -I/usr/include/subversion-1 -I/usr/include/apr-1 -I/usr/include/apr-1.0  -pthread -g1 -O0 -Wno-unused-local-typedefs -std=c++11 -MT tests/mesos_tests-hierarchical_allocator_tests.o -MD -MP -MF tests/.deps/mesos_tests-hierarchical_allocator_tests.Tpo -c -o tests/mesos_tests-hierarchical_allocator_tests.o `test -f 'tests/hierarchical_allocator_tests.cpp' || echo '../../src/'`tests/hierarchical_allocator_tests.cpp
mv -f tests/.deps/mesos_tests-fetcher_tests.Tpo tests/.deps/mesos_tests-fetcher_tests.Po
g++ -DPACKAGE_NAME=\"mesos\" -DPACKAGE_TARNAME=\"mesos\" -DPACKAGE_VERSION=\"0.28.3\" -DPACKAGE_STRING=\"mesos\ 0.28.3\" -DPACKAGE_BUGREPORT=\"\" -DPACKAGE_URL=\"\" -DPACKAGE=\"mesos\" -DVERSION=\"0.28.3\" -DSTDC_HEADERS=1 -DHAVE_SYS_TYPES_H=1 -DHAVE_SYS_STAT_H=1 -DHAVE_STDLIB_H=1 -DHAVE_STRING_H=1 -DHAVE_MEMORY_H=1 -DHAVE_STRINGS_H=1 -DHAVE_INTTYPES_H=1 -DHAVE_STDINT_H=1 -DHAVE_UNISTD_H=1 -DHAVE_DLFCN_H=1 -DLT_OBJDIR=\".libs/\" -DHAVE_PTHREAD_PRIO_INHERIT=1 -DHAVE_PTHREAD=1 -DHAVE_LIBZ=1 -DHAVE_LIBCURL=1 -DHAVE_APR_POOLS_H=1 -DHAVE_LIBAPR_1=1 -DHAVE_SVN_VERSION_H=1 -DHAVE_LIBSVN_SUBR_1=1 -DHAVE_SVN_DELTA_H=1 -DHAVE_LIBSVN_DELTA_1=1 -DHAVE_LIBSASL2=1 -DMESOS_HAS_JAVA=1 -DHAVE_PYTHON=\"2.7\" -DMESOS_HAS_PYTHON=1 -DHAVE_EVENT2_EVENT_H=1 -DHAVE_LIBEVENT=1 -DHAVE_EVENT2_THREAD_H=1 -DHAVE_LIBEVENT_PTHREADS=1 -DHAVE_OPENSSL_SSL_H=1 -DHAVE_LIBSSL=1 -DHAVE_LIBCRYPTO=1 -DHAVE_EVENT2_BUFFEREVENT_SSL_H=1 -DHAVE_LIBEVENT_OPENSSL=1 -DUSE_SSL_SOCKET=1 -I. -I../../src   -Wall -Werror -DLIBDIR=\"/mesos/mesos-0.28.3/_inst/lib\" -DPKGLIBEXECDIR=\"/mesos/mesos-0.28.3/_inst/libexec/mesos\" -DPKGDATADIR=\"/mesos/mesos-0.28.3/_inst/share/mesos\" -DPKGMODULEDIR=\"/mesos/mesos-0.28.3/_inst/lib/mesos/modules\" -I../../include -I../../3rdparty/libprocess/include -I../../3rdparty/libprocess/3rdparty/stout/include -I../include -I../include/mesos -isystem ../3rdparty/libprocess/3rdparty/boost-1.53.0 -I../3rdparty/libprocess/3rdparty/picojson-1.3.0 -DPICOJSON_USE_INT64 -D__STDC_FORMAT_MACROS -I../3rdparty/libprocess/3rdparty/protobuf-2.5.0/src -I../3rdparty/libprocess/3rdparty/glog-0.3.3/src -I../3rdparty/libprocess/3rdparty/glog-0.3.3/src -I../3rdparty/leveldb-1.4/include -I../3rdparty/zookeeper-3.4.5/src/c/include -I../3rdparty/zookeeper-3.4.5/src/c/generated -I../3rdparty/libprocess/3rdparty/protobuf-2.5.0/src -DSOURCE_DIR=\"/mesos/mesos-0.28.3/_build/..\" -DBUILD_DIR=\"/mesos/mesos-0.28.3/_build\" -I../3rdparty/libprocess/3rdparty/gmock-1.7.0/gtest/include -I../3rdparty/libprocess/3rdparty/gmock-1.7.0/include -DTESTLIBEXECDIR=\"/mesos/mesos-0.28.3/_inst/libexec/mesos/tests\" -DSBINDIR=\"/mesos/mesos-0.28.3/_inst/sbin\" -I/usr/lib/jvm/java-1.8.0-openjdk-1.8.0.111-1.b15.el7_2.x86_64/include -I/usr/lib/jvm/java-1.8.0-openjdk-1.8.0.111-1.b15.el7_2.x86_64/include/linux -DZOOKEEPER_VERSION=\"3.4.5\" -I/usr/include/subversion-1 -I/usr/include/apr-1 -I/usr/include/apr-1.0  -pthread -g1 -O0 -Wno-unused-local-typedefs -std=c++11 -MT tests/mesos_tests-hook_tests.o -MD -MP -MF tests/.deps/mesos_tests-hook_tests.Tpo -c -o tests/mesos_tests-hook_tests.o `test -f 'tests/hook_tests.cpp' || echo '../../src/'`tests/hook_tests.cpp
mv -f tests/.deps/mesos_tests-hdfs_tests.Tpo tests/.deps/mesos_tests-hdfs_tests.Po
g++ -DPACKAGE_NAME=\"mesos\" -DPACKAGE_TARNAME=\"mesos\" -DPACKAGE_VERSION=\"0.28.3\" -DPACKAGE_STRING=\"mesos\ 0.28.3\" -DPACKAGE_BUGREPORT=\"\" -DPACKAGE_URL=\"\" -DPACKAGE=\"mesos\" -DVERSION=\"0.28.3\" -DSTDC_HEADERS=1 -DHAVE_SYS_TYPES_H=1 -DHAVE_SYS_STAT_H=1 -DHAVE_STDLIB_H=1 -DHAVE_STRING_H=1 -DHAVE_MEMORY_H=1 -DHAVE_STRINGS_H=1 -DHAVE_INTTYPES_H=1 -DHAVE_STDINT_H=1 -DHAVE_UNISTD_H=1 -DHAVE_DLFCN_H=1 -DLT_OBJDIR=\".libs/\" -DHAVE_PTHREAD_PRIO_INHERIT=1 -DHAVE_PTHREAD=1 -DHAVE_LIBZ=1 -DHAVE_LIBCURL=1 -DHAVE_APR_POOLS_H=1 -DHAVE_LIBAPR_1=1 -DHAVE_SVN_VERSION_H=1 -DHAVE_LIBSVN_SUBR_1=1 -DHAVE_SVN_DELTA_H=1 -DHAVE_LIBSVN_DELTA_1=1 -DHAVE_LIBSASL2=1 -DMESOS_HAS_JAVA=1 -DHAVE_PYTHON=\"2.7\" -DMESOS_HAS_PYTHON=1 -DHAVE_EVENT2_EVENT_H=1 -DHAVE_LIBEVENT=1 -DHAVE_EVENT2_THREAD_H=1 -DHAVE_LIBEVENT_PTHREADS=1 -DHAVE_OPENSSL_SSL_H=1 -DHAVE_LIBSSL=1 -DHAVE_LIBCRYPTO=1 -DHAVE_EVENT2_BUFFEREVENT_SSL_H=1 -DHAVE_LIBEVENT_OPENSSL=1 -DUSE_SSL_SOCKET=1 -I. -I../../src   -Wall -Werror -DLIBDIR=\"/mesos/mesos-0.28.3/_inst/lib\" -DPKGLIBEXECDIR=\"/mesos/mesos-0.28.3/_inst/libexec/mesos\" -DPKGDATADIR=\"/mesos/mesos-0.28.3/_inst/share/mesos\" -DPKGMODULEDIR=\"/mesos/mesos-0.28.3/_inst/lib/mesos/modules\" -I../../include -I../../3rdparty/libprocess/include -I../../3rdparty/libprocess/3rdparty/stout/include -I../include -I../include/mesos -isystem ../3rdparty/libprocess/3rdparty/boost-1.53.0 -I../3rdparty/libprocess/3rdparty/picojson-1.3.0 -DPICOJSON_USE_INT64 -D__STDC_FORMAT_MACROS -I../3rdparty/libprocess/3rdparty/protobuf-2.5.0/src -I../3rdparty/libprocess/3rdparty/glog-0.3.3/src -I../3rdparty/libprocess/3rdparty/glog-0.3.3/src -I../3rdparty/leveldb-1.4/include -I../3rdparty/zookeeper-3.4.5/src/c/include -I../3rdparty/zookeeper-3.4.5/src/c/generated -I../3rdparty/libprocess/3rdparty/protobuf-2.5.0/src -DSOURCE_DIR=\"/mesos/mesos-0.28.3/_build/..\" -DBUILD_DIR=\"/mesos/mesos-0.28.3/_build\" -I../3rdparty/libprocess/3rdparty/gmock-1.7.0/gtest/include -I../3rdparty/libprocess/3rdparty/gmock-1.7.0/include -DTESTLIBEXECDIR=\"/mesos/mesos-0.28.3/_inst/libexec/mesos/tests\" -DSBINDIR=\"/mesos/mesos-0.28.3/_inst/sbin\" -I/usr/lib/jvm/java-1.8.0-openjdk-1.8.0.111-1.b15.el7_2.x86_64/include -I/usr/lib/jvm/java-1.8.0-openjdk-1.8.0.111-1.b15.el7_2.x86_64/include/linux -DZOOKEEPER_VERSION=\"3.4.5\" -I/usr/include/subversion-1 -I/usr/include/apr-1 -I/usr/include/apr-1.0  -pthread -g1 -O0 -Wno-unused-local-typedefs -std=c++11 -MT tests/mesos_tests-http_authentication_tests.o -MD -MP -MF tests/.deps/mesos_tests-http_authentication_tests.Tpo -c -o tests/mesos_tests-http_authentication_tests.o `test -f 'tests/http_authentication_tests.cpp' || echo '../../src/'`tests/http_authentication_tests.cpp
mv -f tests/.deps/mesos_tests-executor_http_api_tests.Tpo tests/.deps/mesos_tests-executor_http_api_tests.Po
g++ -DPACKAGE_NAME=\"mesos\" -DPACKAGE_TARNAME=\"mesos\" -DPACKAGE_VERSION=\"0.28.3\" -DPACKAGE_STRING=\"mesos\ 0.28.3\" -DPACKAGE_BUGREPORT=\"\" -DPACKAGE_URL=\"\" -DPACKAGE=\"mesos\" -DVERSION=\"0.28.3\" -DSTDC_HEADERS=1 -DHAVE_SYS_TYPES_H=1 -DHAVE_SYS_STAT_H=1 -DHAVE_STDLIB_H=1 -DHAVE_STRING_H=1 -DHAVE_MEMORY_H=1 -DHAVE_STRINGS_H=1 -DHAVE_INTTYPES_H=1 -DHAVE_STDINT_H=1 -DHAVE_UNISTD_H=1 -DHAVE_DLFCN_H=1 -DLT_OBJDIR=\".libs/\" -DHAVE_PTHREAD_PRIO_INHERIT=1 -DHAVE_PTHREAD=1 -DHAVE_LIBZ=1 -DHAVE_LIBCURL=1 -DHAVE_APR_POOLS_H=1 -DHAVE_LIBAPR_1=1 -DHAVE_SVN_VERSION_H=1 -DHAVE_LIBSVN_SUBR_1=1 -DHAVE_SVN_DELTA_H=1 -DHAVE_LIBSVN_DELTA_1=1 -DHAVE_LIBSASL2=1 -DMESOS_HAS_JAVA=1 -DHAVE_PYTHON=\"2.7\" -DMESOS_HAS_PYTHON=1 -DHAVE_EVENT2_EVENT_H=1 -DHAVE_LIBEVENT=1 -DHAVE_EVENT2_THREAD_H=1 -DHAVE_LIBEVENT_PTHREADS=1 -DHAVE_OPENSSL_SSL_H=1 -DHAVE_LIBSSL=1 -DHAVE_LIBCRYPTO=1 -DHAVE_EVENT2_BUFFEREVENT_SSL_H=1 -DHAVE_LIBEVENT_OPENSSL=1 -DUSE_SSL_SOCKET=1 -I. -I../../src   -Wall -Werror -DLIBDIR=\"/mesos/mesos-0.28.3/_inst/lib\" -DPKGLIBEXECDIR=\"/mesos/mesos-0.28.3/_inst/libexec/mesos\" -DPKGDATADIR=\"/mesos/mesos-0.28.3/_inst/share/mesos\" -DPKGMODULEDIR=\"/mesos/mesos-0.28.3/_inst/lib/mesos/modules\" -I../../include -I../../3rdparty/libprocess/include -I../../3rdparty/libprocess/3rdparty/stout/include -I../include -I../include/mesos -isystem ../3rdparty/libprocess/3rdparty/boost-1.53.0 -I../3rdparty/libprocess/3rdparty/picojson-1.3.0 -DPICOJSON_USE_INT64 -D__STDC_FORMAT_MACROS -I../3rdparty/libprocess/3rdparty/protobuf-2.5.0/src -I../3rdparty/libprocess/3rdparty/glog-0.3.3/src -I../3rdparty/libprocess/3rdparty/glog-0.3.3/src -I../3rdparty/leveldb-1.4/include -I../3rdparty/zookeeper-3.4.5/src/c/include -I../3rdparty/zookeeper-3.4.5/src/c/generated -I../3rdparty/libprocess/3rdparty/protobuf-2.5.0/src -DSOURCE_DIR=\"/mesos/mesos-0.28.3/_build/..\" -DBUILD_DIR=\"/mesos/mesos-0.28.3/_build\" -I../3rdparty/libprocess/3rdparty/gmock-1.7.0/gtest/include -I../3rdparty/libprocess/3rdparty/gmock-1.7.0/include -DTESTLIBEXECDIR=\"/mesos/mesos-0.28.3/_inst/libexec/mesos/tests\" -DSBINDIR=\"/mesos/mesos-0.28.3/_inst/sbin\" -I/usr/lib/jvm/java-1.8.0-openjdk-1.8.0.111-1.b15.el7_2.x86_64/include -I/usr/lib/jvm/java-1.8.0-openjdk-1.8.0.111-1.b15.el7_2.x86_64/include/linux -DZOOKEEPER_VERSION=\"3.4.5\" -I/usr/include/subversion-1 -I/usr/include/apr-1 -I/usr/include/apr-1.0  -pthread -g1 -O0 -Wno-unused-local-typedefs -std=c++11 -MT tests/mesos_tests-log_tests.o -MD -MP -MF tests/.deps/mesos_tests-log_tests.Tpo -c -o tests/mesos_tests-log_tests.o `test -f 'tests/log_tests.cpp' || echo '../../src/'`tests/log_tests.cpp
mv -f tests/.deps/mesos_tests-fetcher_cache_tests.Tpo tests/.deps/mesos_tests-fetcher_cache_tests.Po
g++ -DPACKAGE_NAME=\"mesos\" -DPACKAGE_TARNAME=\"mesos\" -DPACKAGE_VERSION=\"0.28.3\" -DPACKAGE_STRING=\"mesos\ 0.28.3\" -DPACKAGE_BUGREPORT=\"\" -DPACKAGE_URL=\"\" -DPACKAGE=\"mesos\" -DVERSION=\"0.28.3\" -DSTDC_HEADERS=1 -DHAVE_SYS_TYPES_H=1 -DHAVE_SYS_STAT_H=1 -DHAVE_STDLIB_H=1 -DHAVE_STRING_H=1 -DHAVE_MEMORY_H=1 -DHAVE_STRINGS_H=1 -DHAVE_INTTYPES_H=1 -DHAVE_STDINT_H=1 -DHAVE_UNISTD_H=1 -DHAVE_DLFCN_H=1 -DLT_OBJDIR=\".libs/\" -DHAVE_PTHREAD_PRIO_INHERIT=1 -DHAVE_PTHREAD=1 -DHAVE_LIBZ=1 -DHAVE_LIBCURL=1 -DHAVE_APR_POOLS_H=1 -DHAVE_LIBAPR_1=1 -DHAVE_SVN_VERSION_H=1 -DHAVE_LIBSVN_SUBR_1=1 -DHAVE_SVN_DELTA_H=1 -DHAVE_LIBSVN_DELTA_1=1 -DHAVE_LIBSASL2=1 -DMESOS_HAS_JAVA=1 -DHAVE_PYTHON=\"2.7\" -DMESOS_HAS_PYTHON=1 -DHAVE_EVENT2_EVENT_H=1 -DHAVE_LIBEVENT=1 -DHAVE_EVENT2_THREAD_H=1 -DHAVE_LIBEVENT_PTHREADS=1 -DHAVE_OPENSSL_SSL_H=1 -DHAVE_LIBSSL=1 -DHAVE_LIBCRYPTO=1 -DHAVE_EVENT2_BUFFEREVENT_SSL_H=1 -DHAVE_LIBEVENT_OPENSSL=1 -DUSE_SSL_SOCKET=1 -I. -I../../src   -Wall -Werror -DLIBDIR=\"/mesos/mesos-0.28.3/_inst/lib\" -DPKGLIBEXECDIR=\"/mesos/mesos-0.28.3/_inst/libexec/mesos\" -DPKGDATADIR=\"/mesos/mesos-0.28.3/_inst/share/mesos\" -DPKGMODULEDIR=\"/mesos/mesos-0.28.3/_inst/lib/mesos/modules\" -I../../include -I../../3rdparty/libprocess/include -I../../3rdparty/libprocess/3rdparty/stout/include -I../include -I../include/mesos -isystem ../3rdparty/libprocess/3rdparty/boost-1.53.0 -I../3rdparty/libprocess/3rdparty/picojson-1.3.0 -DPICOJSON_USE_INT64 -D__STDC_FORMAT_MACROS -I../3rdparty/libprocess/3rdparty/protobuf-2.5.0/src -I../3rdparty/libprocess/3rdparty/glog-0.3.3/src -I../3rdparty/libprocess/3rdparty/glog-0.3.3/src -I../3rdparty/leveldb-1.4/include -I../3rdparty/zookeeper-3.4.5/src/c/include -I../3rdparty/zookeeper-3.4.5/src/c/generated -I../3rdparty/libprocess/3rdparty/protobuf-2.5.0/src -DSOURCE_DIR=\"/mesos/mesos-0.28.3/_build/..\" -DBUILD_DIR=\"/mesos/mesos-0.28.3/_build\" -I../3rdparty/libprocess/3rdparty/gmock-1.7.0/gtest/include -I../3rdparty/libprocess/3rdparty/gmock-1.7.0/include -DTESTLIBEXECDIR=\"/mesos/mesos-0.28.3/_inst/libexec/mesos/tests\" -DSBINDIR=\"/mesos/mesos-0.28.3/_inst/sbin\" -I/usr/lib/jvm/java-1.8.0-openjdk-1.8.0.111-1.b15.el7_2.x86_64/include -I/usr/lib/jvm/java-1.8.0-openjdk-1.8.0.111-1.b15.el7_2.x86_64/include/linux -DZOOKEEPER_VERSION=\"3.4.5\" -I/usr/include/subversion-1 -I/usr/include/apr-1 -I/usr/include/apr-1.0  -pthread -g1 -O0 -Wno-unused-local-typedefs -std=c++11 -MT tests/mesos_tests-logging_tests.o -MD -MP -MF tests/.deps/mesos_tests-logging_tests.Tpo -c -o tests/mesos_tests-logging_tests.o `test -f 'tests/logging_tests.cpp' || echo '../../src/'`tests/logging_tests.cpp
mv -f tests/.deps/mesos_tests-fault_tolerance_tests.Tpo tests/.deps/mesos_tests-fault_tolerance_tests.Po
mv -f tests/.deps/mesos_tests-logging_tests.Tpo tests/.deps/mesos_tests-logging_tests.Po
g++ -DPACKAGE_NAME=\"mesos\" -DPACKAGE_TARNAME=\"mesos\" -DPACKAGE_VERSION=\"0.28.3\" -DPACKAGE_STRING=\"mesos\ 0.28.3\" -DPACKAGE_BUGREPORT=\"\" -DPACKAGE_URL=\"\" -DPACKAGE=\"mesos\" -DVERSION=\"0.28.3\" -DSTDC_HEADERS=1 -DHAVE_SYS_TYPES_H=1 -DHAVE_SYS_STAT_H=1 -DHAVE_STDLIB_H=1 -DHAVE_STRING_H=1 -DHAVE_MEMORY_H=1 -DHAVE_STRINGS_H=1 -DHAVE_INTTYPES_H=1 -DHAVE_STDINT_H=1 -DHAVE_UNISTD_H=1 -DHAVE_DLFCN_H=1 -DLT_OBJDIR=\".libs/\" -DHAVE_PTHREAD_PRIO_INHERIT=1 -DHAVE_PTHREAD=1 -DHAVE_LIBZ=1 -DHAVE_LIBCURL=1 -DHAVE_APR_POOLS_H=1 -DHAVE_LIBAPR_1=1 -DHAVE_SVN_VERSION_H=1 -DHAVE_LIBSVN_SUBR_1=1 -DHAVE_SVN_DELTA_H=1 -DHAVE_LIBSVN_DELTA_1=1 -DHAVE_LIBSASL2=1 -DMESOS_HAS_JAVA=1 -DHAVE_PYTHON=\"2.7\" -DMESOS_HAS_PYTHON=1 -DHAVE_EVENT2_EVENT_H=1 -DHAVE_LIBEVENT=1 -DHAVE_EVENT2_THREAD_H=1 -DHAVE_LIBEVENT_PTHREADS=1 -DHAVE_OPENSSL_SSL_H=1 -DHAVE_LIBSSL=1 -DHAVE_LIBCRYPTO=1 -DHAVE_EVENT2_BUFFEREVENT_SSL_H=1 -DHAVE_LIBEVENT_OPENSSL=1 -DUSE_SSL_SOCKET=1 -I. -I../../src   -Wall -Werror -DLIBDIR=\"/mesos/mesos-0.28.3/_inst/lib\" -DPKGLIBEXECDIR=\"/mesos/mesos-0.28.3/_inst/libexec/mesos\" -DPKGDATADIR=\"/mesos/mesos-0.28.3/_inst/share/mesos\" -DPKGMODULEDIR=\"/mesos/mesos-0.28.3/_inst/lib/mesos/modules\" -I../../include -I../../3rdparty/libprocess/include -I../../3rdparty/libprocess/3rdparty/stout/include -I../include -I../include/mesos -isystem ../3rdparty/libprocess/3rdparty/boost-1.53.0 -I../3rdparty/libprocess/3rdparty/picojson-1.3.0 -DPICOJSON_USE_INT64 -D__STDC_FORMAT_MACROS -I../3rdparty/libprocess/3rdparty/protobuf-2.5.0/src -I../3rdparty/libprocess/3rdparty/glog-0.3.3/src -I../3rdparty/libprocess/3rdparty/glog-0.3.3/src -I../3rdparty/leveldb-1.4/include -I../3rdparty/zookeeper-3.4.5/src/c/include -I../3rdparty/zookeeper-3.4.5/src/c/generated -I../3rdparty/libprocess/3rdparty/protobuf-2.5.0/src -DSOURCE_DIR=\"/mesos/mesos-0.28.3/_build/..\" -DBUILD_DIR=\"/mesos/mesos-0.28.3/_build\" -I../3rdparty/libprocess/3rdparty/gmock-1.7.0/gtest/include -I../3rdparty/libprocess/3rdparty/gmock-1.7.0/include -DTESTLIBEXECDIR=\"/mesos/mesos-0.28.3/_inst/libexec/mesos/tests\" -DSBINDIR=\"/mesos/mesos-0.28.3/_inst/sbin\" -I/usr/lib/jvm/java-1.8.0-openjdk-1.8.0.111-1.b15.el7_2.x86_64/include -I/usr/lib/jvm/java-1.8.0-openjdk-1.8.0.111-1.b15.el7_2.x86_64/include/linux -DZOOKEEPER_VERSION=\"3.4.5\" -I/usr/include/subversion-1 -I/usr/include/apr-1 -I/usr/include/apr-1.0  -pthread -g1 -O0 -Wno-unused-local-typedefs -std=c++11 -MT tests/mesos_tests-main.o -MD -MP -MF tests/.deps/mesos_tests-main.Tpo -c -o tests/mesos_tests-main.o `test -f 'tests/main.cpp' || echo '../../src/'`tests/main.cpp
g++ -DPACKAGE_NAME=\"mesos\" -DPACKAGE_TARNAME=\"mesos\" -DPACKAGE_VERSION=\"0.28.3\" -DPACKAGE_STRING=\"mesos\ 0.28.3\" -DPACKAGE_BUGREPORT=\"\" -DPACKAGE_URL=\"\" -DPACKAGE=\"mesos\" -DVERSION=\"0.28.3\" -DSTDC_HEADERS=1 -DHAVE_SYS_TYPES_H=1 -DHAVE_SYS_STAT_H=1 -DHAVE_STDLIB_H=1 -DHAVE_STRING_H=1 -DHAVE_MEMORY_H=1 -DHAVE_STRINGS_H=1 -DHAVE_INTTYPES_H=1 -DHAVE_STDINT_H=1 -DHAVE_UNISTD_H=1 -DHAVE_DLFCN_H=1 -DLT_OBJDIR=\".libs/\" -DHAVE_PTHREAD_PRIO_INHERIT=1 -DHAVE_PTHREAD=1 -DHAVE_LIBZ=1 -DHAVE_LIBCURL=1 -DHAVE_APR_POOLS_H=1 -DHAVE_LIBAPR_1=1 -DHAVE_SVN_VERSION_H=1 -DHAVE_LIBSVN_SUBR_1=1 -DHAVE_SVN_DELTA_H=1 -DHAVE_LIBSVN_DELTA_1=1 -DHAVE_LIBSASL2=1 -DMESOS_HAS_JAVA=1 -DHAVE_PYTHON=\"2.7\" -DMESOS_HAS_PYTHON=1 -DHAVE_EVENT2_EVENT_H=1 -DHAVE_LIBEVENT=1 -DHAVE_EVENT2_THREAD_H=1 -DHAVE_LIBEVENT_PTHREADS=1 -DHAVE_OPENSSL_SSL_H=1 -DHAVE_LIBSSL=1 -DHAVE_LIBCRYPTO=1 -DHAVE_EVENT2_BUFFEREVENT_SSL_H=1 -DHAVE_LIBEVENT_OPENSSL=1 -DUSE_SSL_SOCKET=1 -I. -I../../src   -Wall -Werror -DLIBDIR=\"/mesos/mesos-0.28.3/_inst/lib\" -DPKGLIBEXECDIR=\"/mesos/mesos-0.28.3/_inst/libexec/mesos\" -DPKGDATADIR=\"/mesos/mesos-0.28.3/_inst/share/mesos\" -DPKGMODULEDIR=\"/mesos/mesos-0.28.3/_inst/lib/mesos/modules\" -I../../include -I../../3rdparty/libprocess/include -I../../3rdparty/libprocess/3rdparty/stout/include -I../include -I../include/mesos -isystem ../3rdparty/libprocess/3rdparty/boost-1.53.0 -I../3rdparty/libprocess/3rdparty/picojson-1.3.0 -DPICOJSON_USE_INT64 -D__STDC_FORMAT_MACROS -I../3rdparty/libprocess/3rdparty/protobuf-2.5.0/src -I../3rdparty/libprocess/3rdparty/glog-0.3.3/src -I../3rdparty/libprocess/3rdparty/glog-0.3.3/src -I../3rdparty/leveldb-1.4/include -I../3rdparty/zookeeper-3.4.5/src/c/include -I../3rdparty/zookeeper-3.4.5/src/c/generated -I../3rdparty/libprocess/3rdparty/protobuf-2.5.0/src -DSOURCE_DIR=\"/mesos/mesos-0.28.3/_build/..\" -DBUILD_DIR=\"/mesos/mesos-0.28.3/_build\" -I../3rdparty/libprocess/3rdparty/gmock-1.7.0/gtest/include -I../3rdparty/libprocess/3rdparty/gmock-1.7.0/include -DTESTLIBEXECDIR=\"/mesos/mesos-0.28.3/_inst/libexec/mesos/tests\" -DSBINDIR=\"/mesos/mesos-0.28.3/_inst/sbin\" -I/usr/lib/jvm/java-1.8.0-openjdk-1.8.0.111-1.b15.el7_2.x86_64/include -I/usr/lib/jvm/java-1.8.0-openjdk-1.8.0.111-1.b15.el7_2.x86_64/include/linux -DZOOKEEPER_VERSION=\"3.4.5\" -I/usr/include/subversion-1 -I/usr/include/apr-1 -I/usr/include/apr-1.0  -pthread -g1 -O0 -Wno-unused-local-typedefs -std=c++11 -MT tests/mesos_tests-master_allocator_tests.o -MD -MP -MF tests/.deps/mesos_tests-master_allocator_tests.Tpo -c -o tests/mesos_tests-master_allocator_tests.o `test -f 'tests/master_allocator_tests.cpp' || echo '../../src/'`tests/master_allocator_tests.cpp
mv -f tests/.deps/mesos_tests-gc_tests.Tpo tests/.deps/mesos_tests-gc_tests.Po
g++ -DPACKAGE_NAME=\"mesos\" -DPACKAGE_TARNAME=\"mesos\" -DPACKAGE_VERSION=\"0.28.3\" -DPACKAGE_STRING=\"mesos\ 0.28.3\" -DPACKAGE_BUGREPORT=\"\" -DPACKAGE_URL=\"\" -DPACKAGE=\"mesos\" -DVERSION=\"0.28.3\" -DSTDC_HEADERS=1 -DHAVE_SYS_TYPES_H=1 -DHAVE_SYS_STAT_H=1 -DHAVE_STDLIB_H=1 -DHAVE_STRING_H=1 -DHAVE_MEMORY_H=1 -DHAVE_STRINGS_H=1 -DHAVE_INTTYPES_H=1 -DHAVE_STDINT_H=1 -DHAVE_UNISTD_H=1 -DHAVE_DLFCN_H=1 -DLT_OBJDIR=\".libs/\" -DHAVE_PTHREAD_PRIO_INHERIT=1 -DHAVE_PTHREAD=1 -DHAVE_LIBZ=1 -DHAVE_LIBCURL=1 -DHAVE_APR_POOLS_H=1 -DHAVE_LIBAPR_1=1 -DHAVE_SVN_VERSION_H=1 -DHAVE_LIBSVN_SUBR_1=1 -DHAVE_SVN_DELTA_H=1 -DHAVE_LIBSVN_DELTA_1=1 -DHAVE_LIBSASL2=1 -DMESOS_HAS_JAVA=1 -DHAVE_PYTHON=\"2.7\" -DMESOS_HAS_PYTHON=1 -DHAVE_EVENT2_EVENT_H=1 -DHAVE_LIBEVENT=1 -DHAVE_EVENT2_THREAD_H=1 -DHAVE_LIBEVENT_PTHREADS=1 -DHAVE_OPENSSL_SSL_H=1 -DHAVE_LIBSSL=1 -DHAVE_LIBCRYPTO=1 -DHAVE_EVENT2_BUFFEREVENT_SSL_H=1 -DHAVE_LIBEVENT_OPENSSL=1 -DUSE_SSL_SOCKET=1 -I. -I../../src   -Wall -Werror -DLIBDIR=\"/mesos/mesos-0.28.3/_inst/lib\" -DPKGLIBEXECDIR=\"/mesos/mesos-0.28.3/_inst/libexec/mesos\" -DPKGDATADIR=\"/mesos/mesos-0.28.3/_inst/share/mesos\" -DPKGMODULEDIR=\"/mesos/mesos-0.28.3/_inst/lib/mesos/modules\" -I../../include -I../../3rdparty/libprocess/include -I../../3rdparty/libprocess/3rdparty/stout/include -I../include -I../include/mesos -isystem ../3rdparty/libprocess/3rdparty/boost-1.53.0 -I../3rdparty/libprocess/3rdparty/picojson-1.3.0 -DPICOJSON_USE_INT64 -D__STDC_FORMAT_MACROS -I../3rdparty/libprocess/3rdparty/protobuf-2.5.0/src -I../3rdparty/libprocess/3rdparty/glog-0.3.3/src -I../3rdparty/libprocess/3rdparty/glog-0.3.3/src -I../3rdparty/leveldb-1.4/include -I../3rdparty/zookeeper-3.4.5/src/c/include -I../3rdparty/zookeeper-3.4.5/src/c/generated -I../3rdparty/libprocess/3rdparty/protobuf-2.5.0/src -DSOURCE_DIR=\"/mesos/mesos-0.28.3/_build/..\" -DBUILD_DIR=\"/mesos/mesos-0.28.3/_build\" -I../3rdparty/libprocess/3rdparty/gmock-1.7.0/gtest/include -I../3rdparty/libprocess/3rdparty/gmock-1.7.0/include -DTESTLIBEXECDIR=\"/mesos/mesos-0.28.3/_inst/libexec/mesos/tests\" -DSBINDIR=\"/mesos/mesos-0.28.3/_inst/sbin\" -I/usr/lib/jvm/java-1.8.0-openjdk-1.8.0.111-1.b15.el7_2.x86_64/include -I/usr/lib/jvm/java-1.8.0-openjdk-1.8.0.111-1.b15.el7_2.x86_64/include/linux -DZOOKEEPER_VERSION=\"3.4.5\" -I/usr/include/subversion-1 -I/usr/include/apr-1 -I/usr/include/apr-1.0  -pthread -g1 -O0 -Wno-unused-local-typedefs -std=c++11 -MT tests/mesos_tests-master_authorization_tests.o -MD -MP -MF tests/.deps/mesos_tests-master_authorization_tests.Tpo -c -o tests/mesos_tests-master_authorization_tests.o `test -f 'tests/master_authorization_tests.cpp' || echo '../../src/'`tests/master_authorization_tests.cpp
mv -f tests/.deps/mesos_tests-http_authentication_tests.Tpo tests/.deps/mesos_tests-http_authentication_tests.Po
g++ -DPACKAGE_NAME=\"mesos\" -DPACKAGE_TARNAME=\"mesos\" -DPACKAGE_VERSION=\"0.28.3\" -DPACKAGE_STRING=\"mesos\ 0.28.3\" -DPACKAGE_BUGREPORT=\"\" -DPACKAGE_URL=\"\" -DPACKAGE=\"mesos\" -DVERSION=\"0.28.3\" -DSTDC_HEADERS=1 -DHAVE_SYS_TYPES_H=1 -DHAVE_SYS_STAT_H=1 -DHAVE_STDLIB_H=1 -DHAVE_STRING_H=1 -DHAVE_MEMORY_H=1 -DHAVE_STRINGS_H=1 -DHAVE_INTTYPES_H=1 -DHAVE_STDINT_H=1 -DHAVE_UNISTD_H=1 -DHAVE_DLFCN_H=1 -DLT_OBJDIR=\".libs/\" -DHAVE_PTHREAD_PRIO_INHERIT=1 -DHAVE_PTHREAD=1 -DHAVE_LIBZ=1 -DHAVE_LIBCURL=1 -DHAVE_APR_POOLS_H=1 -DHAVE_LIBAPR_1=1 -DHAVE_SVN_VERSION_H=1 -DHAVE_LIBSVN_SUBR_1=1 -DHAVE_SVN_DELTA_H=1 -DHAVE_LIBSVN_DELTA_1=1 -DHAVE_LIBSASL2=1 -DMESOS_HAS_JAVA=1 -DHAVE_PYTHON=\"2.7\" -DMESOS_HAS_PYTHON=1 -DHAVE_EVENT2_EVENT_H=1 -DHAVE_LIBEVENT=1 -DHAVE_EVENT2_THREAD_H=1 -DHAVE_LIBEVENT_PTHREADS=1 -DHAVE_OPENSSL_SSL_H=1 -DHAVE_LIBSSL=1 -DHAVE_LIBCRYPTO=1 -DHAVE_EVENT2_BUFFEREVENT_SSL_H=1 -DHAVE_LIBEVENT_OPENSSL=1 -DUSE_SSL_SOCKET=1 -I. -I../../src   -Wall -Werror -DLIBDIR=\"/mesos/mesos-0.28.3/_inst/lib\" -DPKGLIBEXECDIR=\"/mesos/mesos-0.28.3/_inst/libexec/mesos\" -DPKGDATADIR=\"/mesos/mesos-0.28.3/_inst/share/mesos\" -DPKGMODULEDIR=\"/mesos/mesos-0.28.3/_inst/lib/mesos/modules\" -I../../include -I../../3rdparty/libprocess/include -I../../3rdparty/libprocess/3rdparty/stout/include -I../include -I../include/mesos -isystem ../3rdparty/libprocess/3rdparty/boost-1.53.0 -I../3rdparty/libprocess/3rdparty/picojson-1.3.0 -DPICOJSON_USE_INT64 -D__STDC_FORMAT_MACROS -I../3rdparty/libprocess/3rdparty/protobuf-2.5.0/src -I../3rdparty/libprocess/3rdparty/glog-0.3.3/src -I../3rdparty/libprocess/3rdparty/glog-0.3.3/src -I../3rdparty/leveldb-1.4/include -I../3rdparty/zookeeper-3.4.5/src/c/include -I../3rdparty/zookeeper-3.4.5/src/c/generated -I../3rdparty/libprocess/3rdparty/protobuf-2.5.0/src -DSOURCE_DIR=\"/mesos/mesos-0.28.3/_build/..\" -DBUILD_DIR=\"/mesos/mesos-0.28.3/_build\" -I../3rdparty/libprocess/3rdparty/gmock-1.7.0/gtest/include -I../3rdparty/libprocess/3rdparty/gmock-1.7.0/include -DTESTLIBEXECDIR=\"/mesos/mesos-0.28.3/_inst/libexec/mesos/tests\" -DSBINDIR=\"/mesos/mesos-0.28.3/_inst/sbin\" -I/usr/lib/jvm/java-1.8.0-openjdk-1.8.0.111-1.b15.el7_2.x86_64/include -I/usr/lib/jvm/java-1.8.0-openjdk-1.8.0.111-1.b15.el7_2.x86_64/include/linux -DZOOKEEPER_VERSION=\"3.4.5\" -I/usr/include/subversion-1 -I/usr/include/apr-1 -I/usr/include/apr-1.0  -pthread -g1 -O0 -Wno-unused-local-typedefs -std=c++11 -MT tests/mesos_tests-master_contender_detector_tests.o -MD -MP -MF tests/.deps/mesos_tests-master_contender_detector_tests.Tpo -c -o tests/mesos_tests-master_contender_detector_tests.o `test -f 'tests/master_contender_detector_tests.cpp' || echo '../../src/'`tests/master_contender_detector_tests.cpp
mv -f tests/.deps/mesos_tests-health_check_tests.Tpo tests/.deps/mesos_tests-health_check_tests.Po
g++ -DPACKAGE_NAME=\"mesos\" -DPACKAGE_TARNAME=\"mesos\" -DPACKAGE_VERSION=\"0.28.3\" -DPACKAGE_STRING=\"mesos\ 0.28.3\" -DPACKAGE_BUGREPORT=\"\" -DPACKAGE_URL=\"\" -DPACKAGE=\"mesos\" -DVERSION=\"0.28.3\" -DSTDC_HEADERS=1 -DHAVE_SYS_TYPES_H=1 -DHAVE_SYS_STAT_H=1 -DHAVE_STDLIB_H=1 -DHAVE_STRING_H=1 -DHAVE_MEMORY_H=1 -DHAVE_STRINGS_H=1 -DHAVE_INTTYPES_H=1 -DHAVE_STDINT_H=1 -DHAVE_UNISTD_H=1 -DHAVE_DLFCN_H=1 -DLT_OBJDIR=\".libs/\" -DHAVE_PTHREAD_PRIO_INHERIT=1 -DHAVE_PTHREAD=1 -DHAVE_LIBZ=1 -DHAVE_LIBCURL=1 -DHAVE_APR_POOLS_H=1 -DHAVE_LIBAPR_1=1 -DHAVE_SVN_VERSION_H=1 -DHAVE_LIBSVN_SUBR_1=1 -DHAVE_SVN_DELTA_H=1 -DHAVE_LIBSVN_DELTA_1=1 -DHAVE_LIBSASL2=1 -DMESOS_HAS_JAVA=1 -DHAVE_PYTHON=\"2.7\" -DMESOS_HAS_PYTHON=1 -DHAVE_EVENT2_EVENT_H=1 -DHAVE_LIBEVENT=1 -DHAVE_EVENT2_THREAD_H=1 -DHAVE_LIBEVENT_PTHREADS=1 -DHAVE_OPENSSL_SSL_H=1 -DHAVE_LIBSSL=1 -DHAVE_LIBCRYPTO=1 -DHAVE_EVENT2_BUFFEREVENT_SSL_H=1 -DHAVE_LIBEVENT_OPENSSL=1 -DUSE_SSL_SOCKET=1 -I. -I../../src   -Wall -Werror -DLIBDIR=\"/mesos/mesos-0.28.3/_inst/lib\" -DPKGLIBEXECDIR=\"/mesos/mesos-0.28.3/_inst/libexec/mesos\" -DPKGDATADIR=\"/mesos/mesos-0.28.3/_inst/share/mesos\" -DPKGMODULEDIR=\"/mesos/mesos-0.28.3/_inst/lib/mesos/modules\" -I../../include -I../../3rdparty/libprocess/include -I../../3rdparty/libprocess/3rdparty/stout/include -I../include -I../include/mesos -isystem ../3rdparty/libprocess/3rdparty/boost-1.53.0 -I../3rdparty/libprocess/3rdparty/picojson-1.3.0 -DPICOJSON_USE_INT64 -D__STDC_FORMAT_MACROS -I../3rdparty/libprocess/3rdparty/protobuf-2.5.0/src -I../3rdparty/libprocess/3rdparty/glog-0.3.3/src -I../3rdparty/libprocess/3rdparty/glog-0.3.3/src -I../3rdparty/leveldb-1.4/include -I../3rdparty/zookeeper-3.4.5/src/c/include -I../3rdparty/zookeeper-3.4.5/src/c/generated -I../3rdparty/libprocess/3rdparty/protobuf-2.5.0/src -DSOURCE_DIR=\"/mesos/mesos-0.28.3/_build/..\" -DBUILD_DIR=\"/mesos/mesos-0.28.3/_build\" -I../3rdparty/libprocess/3rdparty/gmock-1.7.0/gtest/include -I../3rdparty/libprocess/3rdparty/gmock-1.7.0/include -DTESTLIBEXECDIR=\"/mesos/mesos-0.28.3/_inst/libexec/mesos/tests\" -DSBINDIR=\"/mesos/mesos-0.28.3/_inst/sbin\" -I/usr/lib/jvm/java-1.8.0-openjdk-1.8.0.111-1.b15.el7_2.x86_64/include -I/usr/lib/jvm/java-1.8.0-openjdk-1.8.0.111-1.b15.el7_2.x86_64/include/linux -DZOOKEEPER_VERSION=\"3.4.5\" -I/usr/include/subversion-1 -I/usr/include/apr-1 -I/usr/include/apr-1.0  -pthread -g1 -O0 -Wno-unused-local-typedefs -std=c++11 -MT tests/mesos_tests-master_maintenance_tests.o -MD -MP -MF tests/.deps/mesos_tests-master_maintenance_tests.Tpo -c -o tests/mesos_tests-master_maintenance_tests.o `test -f 'tests/master_maintenance_tests.cpp' || echo '../../src/'`tests/master_maintenance_tests.cpp
mv -f tests/.deps/mesos_tests-hierarchical_allocator_tests.Tpo tests/.deps/mesos_tests-hierarchical_allocator_tests.Po
g++ -DPACKAGE_NAME=\"mesos\" -DPACKAGE_TARNAME=\"mesos\" -DPACKAGE_VERSION=\"0.28.3\" -DPACKAGE_STRING=\"mesos\ 0.28.3\" -DPACKAGE_BUGREPORT=\"\" -DPACKAGE_URL=\"\" -DPACKAGE=\"mesos\" -DVERSION=\"0.28.3\" -DSTDC_HEADERS=1 -DHAVE_SYS_TYPES_H=1 -DHAVE_SYS_STAT_H=1 -DHAVE_STDLIB_H=1 -DHAVE_STRING_H=1 -DHAVE_MEMORY_H=1 -DHAVE_STRINGS_H=1 -DHAVE_INTTYPES_H=1 -DHAVE_STDINT_H=1 -DHAVE_UNISTD_H=1 -DHAVE_DLFCN_H=1 -DLT_OBJDIR=\".libs/\" -DHAVE_PTHREAD_PRIO_INHERIT=1 -DHAVE_PTHREAD=1 -DHAVE_LIBZ=1 -DHAVE_LIBCURL=1 -DHAVE_APR_POOLS_H=1 -DHAVE_LIBAPR_1=1 -DHAVE_SVN_VERSION_H=1 -DHAVE_LIBSVN_SUBR_1=1 -DHAVE_SVN_DELTA_H=1 -DHAVE_LIBSVN_DELTA_1=1 -DHAVE_LIBSASL2=1 -DMESOS_HAS_JAVA=1 -DHAVE_PYTHON=\"2.7\" -DMESOS_HAS_PYTHON=1 -DHAVE_EVENT2_EVENT_H=1 -DHAVE_LIBEVENT=1 -DHAVE_EVENT2_THREAD_H=1 -DHAVE_LIBEVENT_PTHREADS=1 -DHAVE_OPENSSL_SSL_H=1 -DHAVE_LIBSSL=1 -DHAVE_LIBCRYPTO=1 -DHAVE_EVENT2_BUFFEREVENT_SSL_H=1 -DHAVE_LIBEVENT_OPENSSL=1 -DUSE_SSL_SOCKET=1 -I. -I../../src   -Wall -Werror -DLIBDIR=\"/mesos/mesos-0.28.3/_inst/lib\" -DPKGLIBEXECDIR=\"/mesos/mesos-0.28.3/_inst/libexec/mesos\" -DPKGDATADIR=\"/mesos/mesos-0.28.3/_inst/share/mesos\" -DPKGMODULEDIR=\"/mesos/mesos-0.28.3/_inst/lib/mesos/modules\" -I../../include -I../../3rdparty/libprocess/include -I../../3rdparty/libprocess/3rdparty/stout/include -I../include -I../include/mesos -isystem ../3rdparty/libprocess/3rdparty/boost-1.53.0 -I../3rdparty/libprocess/3rdparty/picojson-1.3.0 -DPICOJSON_USE_INT64 -D__STDC_FORMAT_MACROS -I../3rdparty/libprocess/3rdparty/protobuf-2.5.0/src -I../3rdparty/libprocess/3rdparty/glog-0.3.3/src -I../3rdparty/libprocess/3rdparty/glog-0.3.3/src -I../3rdparty/leveldb-1.4/include -I../3rdparty/zookeeper-3.4.5/src/c/include -I../3rdparty/zookeeper-3.4.5/src/c/generated -I../3rdparty/libprocess/3rdparty/protobuf-2.5.0/src -DSOURCE_DIR=\"/mesos/mesos-0.28.3/_build/..\" -DBUILD_DIR=\"/mesos/mesos-0.28.3/_build\" -I../3rdparty/libprocess/3rdparty/gmock-1.7.0/gtest/include -I../3rdparty/libprocess/3rdparty/gmock-1.7.0/include -DTESTLIBEXECDIR=\"/mesos/mesos-0.28.3/_inst/libexec/mesos/tests\" -DSBINDIR=\"/mesos/mesos-0.28.3/_inst/sbin\" -I/usr/lib/jvm/java-1.8.0-openjdk-1.8.0.111-1.b15.el7_2.x86_64/include -I/usr/lib/jvm/java-1.8.0-openjdk-1.8.0.111-1.b15.el7_2.x86_64/include/linux -DZOOKEEPER_VERSION=\"3.4.5\" -I/usr/include/subversion-1 -I/usr/include/apr-1 -I/usr/include/apr-1.0  -pthread -g1 -O0 -Wno-unused-local-typedefs -std=c++11 -MT tests/mesos_tests-master_quota_tests.o -MD -MP -MF tests/.deps/mesos_tests-master_quota_tests.Tpo -c -o tests/mesos_tests-master_quota_tests.o `test -f 'tests/master_quota_tests.cpp' || echo '../../src/'`tests/master_quota_tests.cpp
mv -f tests/.deps/mesos_tests-hook_tests.Tpo tests/.deps/mesos_tests-hook_tests.Po
g++ -DPACKAGE_NAME=\"mesos\" -DPACKAGE_TARNAME=\"mesos\" -DPACKAGE_VERSION=\"0.28.3\" -DPACKAGE_STRING=\"mesos\ 0.28.3\" -DPACKAGE_BUGREPORT=\"\" -DPACKAGE_URL=\"\" -DPACKAGE=\"mesos\" -DVERSION=\"0.28.3\" -DSTDC_HEADERS=1 -DHAVE_SYS_TYPES_H=1 -DHAVE_SYS_STAT_H=1 -DHAVE_STDLIB_H=1 -DHAVE_STRING_H=1 -DHAVE_MEMORY_H=1 -DHAVE_STRINGS_H=1 -DHAVE_INTTYPES_H=1 -DHAVE_STDINT_H=1 -DHAVE_UNISTD_H=1 -DHAVE_DLFCN_H=1 -DLT_OBJDIR=\".libs/\" -DHAVE_PTHREAD_PRIO_INHERIT=1 -DHAVE_PTHREAD=1 -DHAVE_LIBZ=1 -DHAVE_LIBCURL=1 -DHAVE_APR_POOLS_H=1 -DHAVE_LIBAPR_1=1 -DHAVE_SVN_VERSION_H=1 -DHAVE_LIBSVN_SUBR_1=1 -DHAVE_SVN_DELTA_H=1 -DHAVE_LIBSVN_DELTA_1=1 -DHAVE_LIBSASL2=1 -DMESOS_HAS_JAVA=1 -DHAVE_PYTHON=\"2.7\" -DMESOS_HAS_PYTHON=1 -DHAVE_EVENT2_EVENT_H=1 -DHAVE_LIBEVENT=1 -DHAVE_EVENT2_THREAD_H=1 -DHAVE_LIBEVENT_PTHREADS=1 -DHAVE_OPENSSL_SSL_H=1 -DHAVE_LIBSSL=1 -DHAVE_LIBCRYPTO=1 -DHAVE_EVENT2_BUFFEREVENT_SSL_H=1 -DHAVE_LIBEVENT_OPENSSL=1 -DUSE_SSL_SOCKET=1 -I. -I../../src   -Wall -Werror -DLIBDIR=\"/mesos/mesos-0.28.3/_inst/lib\" -DPKGLIBEXECDIR=\"/mesos/mesos-0.28.3/_inst/libexec/mesos\" -DPKGDATADIR=\"/mesos/mesos-0.28.3/_inst/share/mesos\" -DPKGMODULEDIR=\"/mesos/mesos-0.28.3/_inst/lib/mesos/modules\" -I../../include -I../../3rdparty/libprocess/include -I../../3rdparty/libprocess/3rdparty/stout/include -I../include -I../include/mesos -isystem ../3rdparty/libprocess/3rdparty/boost-1.53.0 -I../3rdparty/libprocess/3rdparty/picojson-1.3.0 -DPICOJSON_USE_INT64 -D__STDC_FORMAT_MACROS -I../3rdparty/libprocess/3rdparty/protobuf-2.5.0/src -I../3rdparty/libprocess/3rdparty/glog-0.3.3/src -I../3rdparty/libprocess/3rdparty/glog-0.3.3/src -I../3rdparty/leveldb-1.4/include -I../3rdparty/zookeeper-3.4.5/src/c/include -I../3rdparty/zookeeper-3.4.5/src/c/generated -I../3rdparty/libprocess/3rdparty/protobuf-2.5.0/src -DSOURCE_DIR=\"/mesos/mesos-0.28.3/_build/..\" -DBUILD_DIR=\"/mesos/mesos-0.28.3/_build\" -I../3rdparty/libprocess/3rdparty/gmock-1.7.0/gtest/include -I../3rdparty/libprocess/3rdparty/gmock-1.7.0/include -DTESTLIBEXECDIR=\"/mesos/mesos-0.28.3/_inst/libexec/mesos/tests\" -DSBINDIR=\"/mesos/mesos-0.28.3/_inst/sbin\" -I/usr/lib/jvm/java-1.8.0-openjdk-1.8.0.111-1.b15.el7_2.x86_64/include -I/usr/lib/jvm/java-1.8.0-openjdk-1.8.0.111-1.b15.el7_2.x86_64/include/linux -DZOOKEEPER_VERSION=\"3.4.5\" -I/usr/include/subversion-1 -I/usr/include/apr-1 -I/usr/include/apr-1.0  -pthread -g1 -O0 -Wno-unused-local-typedefs -std=c++11 -MT tests/mesos_tests-master_slave_reconciliation_tests.o -MD -MP -MF tests/.deps/mesos_tests-master_slave_reconciliation_tests.Tpo -c -o tests/mesos_tests-master_slave_reconciliation_tests.o `test -f 'tests/master_slave_reconciliation_tests.cpp' || echo '../../src/'`tests/master_slave_reconciliation_tests.cpp
mv -f tests/.deps/mesos_tests-main.Tpo tests/.deps/mesos_tests-main.Po
g++ -DPACKAGE_NAME=\"mesos\" -DPACKAGE_TARNAME=\"mesos\" -DPACKAGE_VERSION=\"0.28.3\" -DPACKAGE_STRING=\"mesos\ 0.28.3\" -DPACKAGE_BUGREPORT=\"\" -DPACKAGE_URL=\"\" -DPACKAGE=\"mesos\" -DVERSION=\"0.28.3\" -DSTDC_HEADERS=1 -DHAVE_SYS_TYPES_H=1 -DHAVE_SYS_STAT_H=1 -DHAVE_STDLIB_H=1 -DHAVE_STRING_H=1 -DHAVE_MEMORY_H=1 -DHAVE_STRINGS_H=1 -DHAVE_INTTYPES_H=1 -DHAVE_STDINT_H=1 -DHAVE_UNISTD_H=1 -DHAVE_DLFCN_H=1 -DLT_OBJDIR=\".libs/\" -DHAVE_PTHREAD_PRIO_INHERIT=1 -DHAVE_PTHREAD=1 -DHAVE_LIBZ=1 -DHAVE_LIBCURL=1 -DHAVE_APR_POOLS_H=1 -DHAVE_LIBAPR_1=1 -DHAVE_SVN_VERSION_H=1 -DHAVE_LIBSVN_SUBR_1=1 -DHAVE_SVN_DELTA_H=1 -DHAVE_LIBSVN_DELTA_1=1 -DHAVE_LIBSASL2=1 -DMESOS_HAS_JAVA=1 -DHAVE_PYTHON=\"2.7\" -DMESOS_HAS_PYTHON=1 -DHAVE_EVENT2_EVENT_H=1 -DHAVE_LIBEVENT=1 -DHAVE_EVENT2_THREAD_H=1 -DHAVE_LIBEVENT_PTHREADS=1 -DHAVE_OPENSSL_SSL_H=1 -DHAVE_LIBSSL=1 -DHAVE_LIBCRYPTO=1 -DHAVE_EVENT2_BUFFEREVENT_SSL_H=1 -DHAVE_LIBEVENT_OPENSSL=1 -DUSE_SSL_SOCKET=1 -I. -I../../src   -Wall -Werror -DLIBDIR=\"/mesos/mesos-0.28.3/_inst/lib\" -DPKGLIBEXECDIR=\"/mesos/mesos-0.28.3/_inst/libexec/mesos\" -DPKGDATADIR=\"/mesos/mesos-0.28.3/_inst/share/mesos\" -DPKGMODULEDIR=\"/mesos/mesos-0.28.3/_inst/lib/mesos/modules\" -I../../include -I../../3rdparty/libprocess/include -I../../3rdparty/libprocess/3rdparty/stout/include -I../include -I../include/mesos -isystem ../3rdparty/libprocess/3rdparty/boost-1.53.0 -I../3rdparty/libprocess/3rdparty/picojson-1.3.0 -DPICOJSON_USE_INT64 -D__STDC_FORMAT_MACROS -I../3rdparty/libprocess/3rdparty/protobuf-2.5.0/src -I../3rdparty/libprocess/3rdparty/glog-0.3.3/src -I../3rdparty/libprocess/3rdparty/glog-0.3.3/src -I../3rdparty/leveldb-1.4/include -I../3rdparty/zookeeper-3.4.5/src/c/include -I../3rdparty/zookeeper-3.4.5/src/c/generated -I../3rdparty/libprocess/3rdparty/protobuf-2.5.0/src -DSOURCE_DIR=\"/mesos/mesos-0.28.3/_build/..\" -DBUILD_DIR=\"/mesos/mesos-0.28.3/_build\" -I../3rdparty/libprocess/3rdparty/gmock-1.7.0/gtest/include -I../3rdparty/libprocess/3rdparty/gmock-1.7.0/include -DTESTLIBEXECDIR=\"/mesos/mesos-0.28.3/_inst/libexec/mesos/tests\" -DSBINDIR=\"/mesos/mesos-0.28.3/_inst/sbin\" -I/usr/lib/jvm/java-1.8.0-openjdk-1.8.0.111-1.b15.el7_2.x86_64/include -I/usr/lib/jvm/java-1.8.0-openjdk-1.8.0.111-1.b15.el7_2.x86_64/include/linux -DZOOKEEPER_VERSION=\"3.4.5\" -I/usr/include/subversion-1 -I/usr/include/apr-1 -I/usr/include/apr-1.0  -pthread -g1 -O0 -Wno-unused-local-typedefs -std=c++11 -MT tests/mesos_tests-master_tests.o -MD -MP -MF tests/.deps/mesos_tests-master_tests.Tpo -c -o tests/mesos_tests-master_tests.o `test -f 'tests/master_tests.cpp' || echo '../../src/'`tests/master_tests.cpp
mv -f tests/.deps/mesos_tests-log_tests.Tpo tests/.deps/mesos_tests-log_tests.Po
g++ -DPACKAGE_NAME=\"mesos\" -DPACKAGE_TARNAME=\"mesos\" -DPACKAGE_VERSION=\"0.28.3\" -DPACKAGE_STRING=\"mesos\ 0.28.3\" -DPACKAGE_BUGREPORT=\"\" -DPACKAGE_URL=\"\" -DPACKAGE=\"mesos\" -DVERSION=\"0.28.3\" -DSTDC_HEADERS=1 -DHAVE_SYS_TYPES_H=1 -DHAVE_SYS_STAT_H=1 -DHAVE_STDLIB_H=1 -DHAVE_STRING_H=1 -DHAVE_MEMORY_H=1 -DHAVE_STRINGS_H=1 -DHAVE_INTTYPES_H=1 -DHAVE_STDINT_H=1 -DHAVE_UNISTD_H=1 -DHAVE_DLFCN_H=1 -DLT_OBJDIR=\".libs/\" -DHAVE_PTHREAD_PRIO_INHERIT=1 -DHAVE_PTHREAD=1 -DHAVE_LIBZ=1 -DHAVE_LIBCURL=1 -DHAVE_APR_POOLS_H=1 -DHAVE_LIBAPR_1=1 -DHAVE_SVN_VERSION_H=1 -DHAVE_LIBSVN_SUBR_1=1 -DHAVE_SVN_DELTA_H=1 -DHAVE_LIBSVN_DELTA_1=1 -DHAVE_LIBSASL2=1 -DMESOS_HAS_JAVA=1 -DHAVE_PYTHON=\"2.7\" -DMESOS_HAS_PYTHON=1 -DHAVE_EVENT2_EVENT_H=1 -DHAVE_LIBEVENT=1 -DHAVE_EVENT2_THREAD_H=1 -DHAVE_LIBEVENT_PTHREADS=1 -DHAVE_OPENSSL_SSL_H=1 -DHAVE_LIBSSL=1 -DHAVE_LIBCRYPTO=1 -DHAVE_EVENT2_BUFFEREVENT_SSL_H=1 -DHAVE_LIBEVENT_OPENSSL=1 -DUSE_SSL_SOCKET=1 -I. -I../../src   -Wall -Werror -DLIBDIR=\"/mesos/mesos-0.28.3/_inst/lib\" -DPKGLIBEXECDIR=\"/mesos/mesos-0.28.3/_inst/libexec/mesos\" -DPKGDATADIR=\"/mesos/mesos-0.28.3/_inst/share/mesos\" -DPKGMODULEDIR=\"/mesos/mesos-0.28.3/_inst/lib/mesos/modules\" -I../../include -I../../3rdparty/libprocess/include -I../../3rdparty/libprocess/3rdparty/stout/include -I../include -I../include/mesos -isystem ../3rdparty/libprocess/3rdparty/boost-1.53.0 -I../3rdparty/libprocess/3rdparty/picojson-1.3.0 -DPICOJSON_USE_INT64 -D__STDC_FORMAT_MACROS -I../3rdparty/libprocess/3rdparty/protobuf-2.5.0/src -I../3rdparty/libprocess/3rdparty/glog-0.3.3/src -I../3rdparty/libprocess/3rdparty/glog-0.3.3/src -I../3rdparty/leveldb-1.4/include -I../3rdparty/zookeeper-3.4.5/src/c/include -I../3rdparty/zookeeper-3.4.5/src/c/generated -I../3rdparty/libprocess/3rdparty/protobuf-2.5.0/src -DSOURCE_DIR=\"/mesos/mesos-0.28.3/_build/..\" -DBUILD_DIR=\"/mesos/mesos-0.28.3/_build\" -I../3rdparty/libprocess/3rdparty/gmock-1.7.0/gtest/include -I../3rdparty/libprocess/3rdparty/gmock-1.7.0/include -DTESTLIBEXECDIR=\"/mesos/mesos-0.28.3/_inst/libexec/mesos/tests\" -DSBINDIR=\"/mesos/mesos-0.28.3/_inst/sbin\" -I/usr/lib/jvm/java-1.8.0-openjdk-1.8.0.111-1.b15.el7_2.x86_64/include -I/usr/lib/jvm/java-1.8.0-openjdk-1.8.0.111-1.b15.el7_2.x86_64/include/linux -DZOOKEEPER_VERSION=\"3.4.5\" -I/usr/include/subversion-1 -I/usr/include/apr-1 -I/usr/include/apr-1.0  -pthread -g1 -O0 -Wno-unused-local-typedefs -std=c++11 -MT tests/mesos_tests-master_validation_tests.o -MD -MP -MF tests/.deps/mesos_tests-master_validation_tests.Tpo -c -o tests/mesos_tests-master_validation_tests.o `test -f 'tests/master_validation_tests.cpp' || echo '../../src/'`tests/master_validation_tests.cpp
mv -f tests/.deps/mesos_tests-master_authorization_tests.Tpo tests/.deps/mesos_tests-master_authorization_tests.Po
g++ -DPACKAGE_NAME=\"mesos\" -DPACKAGE_TARNAME=\"mesos\" -DPACKAGE_VERSION=\"0.28.3\" -DPACKAGE_STRING=\"mesos\ 0.28.3\" -DPACKAGE_BUGREPORT=\"\" -DPACKAGE_URL=\"\" -DPACKAGE=\"mesos\" -DVERSION=\"0.28.3\" -DSTDC_HEADERS=1 -DHAVE_SYS_TYPES_H=1 -DHAVE_SYS_STAT_H=1 -DHAVE_STDLIB_H=1 -DHAVE_STRING_H=1 -DHAVE_MEMORY_H=1 -DHAVE_STRINGS_H=1 -DHAVE_INTTYPES_H=1 -DHAVE_STDINT_H=1 -DHAVE_UNISTD_H=1 -DHAVE_DLFCN_H=1 -DLT_OBJDIR=\".libs/\" -DHAVE_PTHREAD_PRIO_INHERIT=1 -DHAVE_PTHREAD=1 -DHAVE_LIBZ=1 -DHAVE_LIBCURL=1 -DHAVE_APR_POOLS_H=1 -DHAVE_LIBAPR_1=1 -DHAVE_SVN_VERSION_H=1 -DHAVE_LIBSVN_SUBR_1=1 -DHAVE_SVN_DELTA_H=1 -DHAVE_LIBSVN_DELTA_1=1 -DHAVE_LIBSASL2=1 -DMESOS_HAS_JAVA=1 -DHAVE_PYTHON=\"2.7\" -DMESOS_HAS_PYTHON=1 -DHAVE_EVENT2_EVENT_H=1 -DHAVE_LIBEVENT=1 -DHAVE_EVENT2_THREAD_H=1 -DHAVE_LIBEVENT_PTHREADS=1 -DHAVE_OPENSSL_SSL_H=1 -DHAVE_LIBSSL=1 -DHAVE_LIBCRYPTO=1 -DHAVE_EVENT2_BUFFEREVENT_SSL_H=1 -DHAVE_LIBEVENT_OPENSSL=1 -DUSE_SSL_SOCKET=1 -I. -I../../src   -Wall -Werror -DLIBDIR=\"/mesos/mesos-0.28.3/_inst/lib\" -DPKGLIBEXECDIR=\"/mesos/mesos-0.28.3/_inst/libexec/mesos\" -DPKGDATADIR=\"/mesos/mesos-0.28.3/_inst/share/mesos\" -DPKGMODULEDIR=\"/mesos/mesos-0.28.3/_inst/lib/mesos/modules\" -I../../include -I../../3rdparty/libprocess/include -I../../3rdparty/libprocess/3rdparty/stout/include -I../include -I../include/mesos -isystem ../3rdparty/libprocess/3rdparty/boost-1.53.0 -I../3rdparty/libprocess/3rdparty/picojson-1.3.0 -DPICOJSON_USE_INT64 -D__STDC_FORMAT_MACROS -I../3rdparty/libprocess/3rdparty/protobuf-2.5.0/src -I../3rdparty/libprocess/3rdparty/glog-0.3.3/src -I../3rdparty/libprocess/3rdparty/glog-0.3.3/src -I../3rdparty/leveldb-1.4/include -I../3rdparty/zookeeper-3.4.5/src/c/include -I../3rdparty/zookeeper-3.4.5/src/c/generated -I../3rdparty/libprocess/3rdparty/protobuf-2.5.0/src -DSOURCE_DIR=\"/mesos/mesos-0.28.3/_build/..\" -DBUILD_DIR=\"/mesos/mesos-0.28.3/_build\" -I../3rdparty/libprocess/3rdparty/gmock-1.7.0/gtest/include -I../3rdparty/libprocess/3rdparty/gmock-1.7.0/include -DTESTLIBEXECDIR=\"/mesos/mesos-0.28.3/_inst/libexec/mesos/tests\" -DSBINDIR=\"/mesos/mesos-0.28.3/_inst/sbin\" -I/usr/lib/jvm/java-1.8.0-openjdk-1.8.0.111-1.b15.el7_2.x86_64/include -I/usr/lib/jvm/java-1.8.0-openjdk-1.8.0.111-1.b15.el7_2.x86_64/include/linux -DZOOKEEPER_VERSION=\"3.4.5\" -I/usr/include/subversion-1 -I/usr/include/apr-1 -I/usr/include/apr-1.0  -pthread -g1 -O0 -Wno-unused-local-typedefs -std=c++11 -MT tests/mesos_tests-mesos.o -MD -MP -MF tests/.deps/mesos_tests-mesos.Tpo -c -o tests/mesos_tests-mesos.o `test -f 'tests/mesos.cpp' || echo '../../src/'`tests/mesos.cpp
mv -f tests/.deps/mesos_tests-master_contender_detector_tests.Tpo tests/.deps/mesos_tests-master_contender_detector_tests.Po
g++ -DPACKAGE_NAME=\"mesos\" -DPACKAGE_TARNAME=\"mesos\" -DPACKAGE_VERSION=\"0.28.3\" -DPACKAGE_STRING=\"mesos\ 0.28.3\" -DPACKAGE_BUGREPORT=\"\" -DPACKAGE_URL=\"\" -DPACKAGE=\"mesos\" -DVERSION=\"0.28.3\" -DSTDC_HEADERS=1 -DHAVE_SYS_TYPES_H=1 -DHAVE_SYS_STAT_H=1 -DHAVE_STDLIB_H=1 -DHAVE_STRING_H=1 -DHAVE_MEMORY_H=1 -DHAVE_STRINGS_H=1 -DHAVE_INTTYPES_H=1 -DHAVE_STDINT_H=1 -DHAVE_UNISTD_H=1 -DHAVE_DLFCN_H=1 -DLT_OBJDIR=\".libs/\" -DHAVE_PTHREAD_PRIO_INHERIT=1 -DHAVE_PTHREAD=1 -DHAVE_LIBZ=1 -DHAVE_LIBCURL=1 -DHAVE_APR_POOLS_H=1 -DHAVE_LIBAPR_1=1 -DHAVE_SVN_VERSION_H=1 -DHAVE_LIBSVN_SUBR_1=1 -DHAVE_SVN_DELTA_H=1 -DHAVE_LIBSVN_DELTA_1=1 -DHAVE_LIBSASL2=1 -DMESOS_HAS_JAVA=1 -DHAVE_PYTHON=\"2.7\" -DMESOS_HAS_PYTHON=1 -DHAVE_EVENT2_EVENT_H=1 -DHAVE_LIBEVENT=1 -DHAVE_EVENT2_THREAD_H=1 -DHAVE_LIBEVENT_PTHREADS=1 -DHAVE_OPENSSL_SSL_H=1 -DHAVE_LIBSSL=1 -DHAVE_LIBCRYPTO=1 -DHAVE_EVENT2_BUFFEREVENT_SSL_H=1 -DHAVE_LIBEVENT_OPENSSL=1 -DUSE_SSL_SOCKET=1 -I. -I../../src   -Wall -Werror -DLIBDIR=\"/mesos/mesos-0.28.3/_inst/lib\" -DPKGLIBEXECDIR=\"/mesos/mesos-0.28.3/_inst/libexec/mesos\" -DPKGDATADIR=\"/mesos/mesos-0.28.3/_inst/share/mesos\" -DPKGMODULEDIR=\"/mesos/mesos-0.28.3/_inst/lib/mesos/modules\" -I../../include -I../../3rdparty/libprocess/include -I../../3rdparty/libprocess/3rdparty/stout/include -I../include -I../include/mesos -isystem ../3rdparty/libprocess/3rdparty/boost-1.53.0 -I../3rdparty/libprocess/3rdparty/picojson-1.3.0 -DPICOJSON_USE_INT64 -D__STDC_FORMAT_MACROS -I../3rdparty/libprocess/3rdparty/protobuf-2.5.0/src -I../3rdparty/libprocess/3rdparty/glog-0.3.3/src -I../3rdparty/libprocess/3rdparty/glog-0.3.3/src -I../3rdparty/leveldb-1.4/include -I../3rdparty/zookeeper-3.4.5/src/c/include -I../3rdparty/zookeeper-3.4.5/src/c/generated -I../3rdparty/libprocess/3rdparty/protobuf-2.5.0/src -DSOURCE_DIR=\"/mesos/mesos-0.28.3/_build/..\" -DBUILD_DIR=\"/mesos/mesos-0.28.3/_build\" -I../3rdparty/libprocess/3rdparty/gmock-1.7.0/gtest/include -I../3rdparty/libprocess/3rdparty/gmock-1.7.0/include -DTESTLIBEXECDIR=\"/mesos/mesos-0.28.3/_inst/libexec/mesos/tests\" -DSBINDIR=\"/mesos/mesos-0.28.3/_inst/sbin\" -I/usr/lib/jvm/java-1.8.0-openjdk-1.8.0.111-1.b15.el7_2.x86_64/include -I/usr/lib/jvm/java-1.8.0-openjdk-1.8.0.111-1.b15.el7_2.x86_64/include/linux -DZOOKEEPER_VERSION=\"3.4.5\" -I/usr/include/subversion-1 -I/usr/include/apr-1 -I/usr/include/apr-1.0  -pthread -g1 -O0 -Wno-unused-local-typedefs -std=c++11 -MT tests/mesos_tests-metrics_tests.o -MD -MP -MF tests/.deps/mesos_tests-metrics_tests.Tpo -c -o tests/mesos_tests-metrics_tests.o `test -f 'tests/metrics_tests.cpp' || echo '../../src/'`tests/metrics_tests.cpp
In file included from ../3rdparty/libprocess/3rdparty/gmock-1.7.0/gtest/include/gtest/gtest.h:1929:0,
                 from ../3rdparty/libprocess/3rdparty/gmock-1.7.0/include/gmock/internal/gmock-internal-utils.h:47,
                 from ../3rdparty/libprocess/3rdparty/gmock-1.7.0/include/gmock/gmock-actions.h:46,
                 from ../3rdparty/libprocess/3rdparty/gmock-1.7.0/include/gmock/gmock.h:58,
                 from ../../src/tests/master_validation_tests.cpp:21:
../../src/tests/master_validation_tests.cpp: In member function 'virtual void mesos::internal::tests::ReserveOperationValidationTest_FrameworkMissingPrincipal_Test::TestBody()':
../../src/tests/master_validation_tests.cpp:275:50: error: no matching function for call to 'validate(mesos::Offer_Operation::Reserve&, None)'
   EXPECT_SOME(operation::validate(reserve, None()));
                                                  ^
../3rdparty/libprocess/3rdparty/gmock-1.7.0/gtest/include/gtest/gtest_pred_impl.h:77:52: note: in definition of macro 'GTEST_ASSERT_'
   if (const ::testing::AssertionResult gtest_ar = (expression)) \
                                                    ^
../3rdparty/libprocess/3rdparty/gmock-1.7.0/gtest/include/gtest/gtest_pred_impl.h:114:3: note: in expansion of macro 'GTEST_PRED_FORMAT1_'
   GTEST_PRED_FORMAT1_(pred_format, v1, GTEST_NONFATAL_FAILURE_)
   ^
../../3rdparty/libprocess/3rdparty/stout/include/stout/gtest.hpp:125:3: note: in expansion of macro 'EXPECT_PRED_FORMAT1'
   EXPECT_PRED_FORMAT1(AssertSome, actual)
   ^
../../src/tests/master_validation_tests.cpp:275:3: note: in expansion of macro 'EXPECT_SOME'
   EXPECT_SOME(operation::validate(reserve, None()));
   ^
../../src/tests/master_validation_tests.cpp:275:50: note: candidates are:
   EXPECT_SOME(operation::validate(reserve, None()));
                                                  ^
../3rdparty/libprocess/3rdparty/gmock-1.7.0/gtest/include/gtest/gtest_pred_impl.h:77:52: note: in definition of macro 'GTEST_ASSERT_'
   if (const ::testing::AssertionResult gtest_ar = (expression)) \
                                                    ^
../3rdparty/libprocess/3rdparty/gmock-1.7.0/gtest/include/gtest/gtest_pred_impl.h:114:3: note: in expansion of macro 'GTEST_PRED_FORMAT1_'
   GTEST_PRED_FORMAT1_(pred_format, v1, GTEST_NONFATAL_FAILURE_)
   ^
../../3rdparty/libprocess/3rdparty/stout/include/stout/gtest.hpp:125:3: note: in expansion of macro 'EXPECT_PRED_FORMAT1'
   EXPECT_PRED_FORMAT1(AssertSome, actual)
   ^
../../src/tests/master_validation_tests.cpp:275:3: note: in expansion of macro 'EXPECT_SOME'
   EXPECT_SOME(operation::validate(reserve, None()));
   ^
In file included from ../../src/master/master.hpp:77:0,
                 from ../../src/tests/master_validation_tests.cpp:36:
../../src/master/validation.hpp:106:15: note: Option<Error> mesos::internal::master::validation::operation::validate(const Reserve&, const Option<std::basic_string<char> >&, const Option<std::basic_string<char> >&)
 Option<Error> validate(
               ^
../../src/master/validation.hpp:106:15: note:   candidate expects 3 arguments, 2 provided
../../src/master/validation.hpp:113:15: note: Option<Error> mesos::internal::master::validation::operation::validate(const Unreserve&)
 Option<Error> validate(const Offer::Operation::Unreserve& unreserve);
               ^
../../src/master/validation.hpp:113:15: note:   candidate expects 1 argument, 2 provided
../../src/master/validation.hpp:118:15: note: Option<Error> mesos::internal::master::validation::operation::validate(const Create&, const mesos::Resources&)
 Option<Error> validate(
               ^
../../src/master/validation.hpp:118:15: note:   no known conversion for argument 1 from 'mesos::Offer_Operation::Reserve {aka mesos::Offer_Operation_Reserve}' to 'const Create& {aka const mesos::Offer_Operation_Create&}'
../../src/master/validation.hpp:125:15: note: Option<Error> mesos::internal::master::validation::operation::validate(const Destroy&, const mesos::Resources&)
 Option<Error> validate(
               ^
../../src/master/validation.hpp:125:15: note:   no known conversion for argument 1 from 'mesos::Offer_Operation::Reserve {aka mesos::Offer_Operation_Reserve}' to 'const Destroy& {aka const mesos::Offer_Operation_Destroy&}'
mv -f tests/.deps/mesos_tests-master_allocator_tests.Tpo tests/.deps/mesos_tests-master_allocator_tests.Po
g++ -DPACKAGE_NAME=\"mesos\" -DPACKAGE_TARNAME=\"mesos\" -DPACKAGE_VERSION=\"0.28.3\" -DPACKAGE_STRING=\"mesos\ 0.28.3\" -DPACKAGE_BUGREPORT=\"\" -DPACKAGE_URL=\"\" -DPACKAGE=\"mesos\" -DVERSION=\"0.28.3\" -DSTDC_HEADERS=1 -DHAVE_SYS_TYPES_H=1 -DHAVE_SYS_STAT_H=1 -DHAVE_STDLIB_H=1 -DHAVE_STRING_H=1 -DHAVE_MEMORY_H=1 -DHAVE_STRINGS_H=1 -DHAVE_INTTYPES_H=1 -DHAVE_STDINT_H=1 -DHAVE_UNISTD_H=1 -DHAVE_DLFCN_H=1 -DLT_OBJDIR=\".libs/\" -DHAVE_PTHREAD_PRIO_INHERIT=1 -DHAVE_PTHREAD=1 -DHAVE_LIBZ=1 -DHAVE_LIBCURL=1 -DHAVE_APR_POOLS_H=1 -DHAVE_LIBAPR_1=1 -DHAVE_SVN_VERSION_H=1 -DHAVE_LIBSVN_SUBR_1=1 -DHAVE_SVN_DELTA_H=1 -DHAVE_LIBSVN_DELTA_1=1 -DHAVE_LIBSASL2=1 -DMESOS_HAS_JAVA=1 -DHAVE_PYTHON=\"2.7\" -DMESOS_HAS_PYTHON=1 -DHAVE_EVENT2_EVENT_H=1 -DHAVE_LIBEVENT=1 -DHAVE_EVENT2_THREAD_H=1 -DHAVE_LIBEVENT_PTHREADS=1 -DHAVE_OPENSSL_SSL_H=1 -DHAVE_LIBSSL=1 -DHAVE_LIBCRYPTO=1 -DHAVE_EVENT2_BUFFEREVENT_SSL_H=1 -DHAVE_LIBEVENT_OPENSSL=1 -DUSE_SSL_SOCKET=1 -I. -I../../src   -Wall -Werror -DLIBDIR=\"/mesos/mesos-0.28.3/_inst/lib\" -DPKGLIBEXECDIR=\"/mesos/mesos-0.28.3/_inst/libexec/mesos\" -DPKGDATADIR=\"/mesos/mesos-0.28.3/_inst/share/mesos\" -DPKGMODULEDIR=\"/mesos/mesos-0.28.3/_inst/lib/mesos/modules\" -I../../include -I../../3rdparty/libprocess/include -I../../3rdparty/libprocess/3rdparty/stout/include -I../include -I../include/mesos -isystem ../3rdparty/libprocess/3rdparty/boost-1.53.0 -I../3rdparty/libprocess/3rdparty/picojson-1.3.0 -DPICOJSON_USE_INT64 -D__STDC_FORMAT_MACROS -I../3rdparty/libprocess/3rdparty/protobuf-2.5.0/src -I../3rdparty/libprocess/3rdparty/glog-0.3.3/src -I../3rdparty/libprocess/3rdparty/glog-0.3.3/src -I../3rdparty/leveldb-1.4/include -I../3rdparty/zookeeper-3.4.5/src/c/include -I../3rdparty/zookeeper-3.4.5/src/c/generated -I../3rdparty/libprocess/3rdparty/protobuf-2.5.0/src -DSOURCE_DIR=\"/mesos/mesos-0.28.3/_build/..\" -DBUILD_DIR=\"/mesos/mesos-0.28.3/_build\" -I../3rdparty/libprocess/3rdparty/gmock-1.7.0/gtest/include -I../3rdparty/libprocess/3rdparty/gmock-1.7.0/include -DTESTLIBEXECDIR=\"/mesos/mesos-0.28.3/_inst/libexec/mesos/tests\" -DSBINDIR=\"/mesos/mesos-0.28.3/_inst/sbin\" -I/usr/lib/jvm/java-1.8.0-openjdk-1.8.0.111-1.b15.el7_2.x86_64/include -I/usr/lib/jvm/java-1.8.0-openjdk-1.8.0.111-1.b15.el7_2.x86_64/include/linux -DZOOKEEPER_VERSION=\"3.4.5\" -I/usr/include/subversion-1 -I/usr/include/apr-1 -I/usr/include/apr-1.0  -pthread -g1 -O0 -Wno-unused-local-typedefs -std=c++11 -MT tests/mesos_tests-module.o -MD -MP -MF tests/.deps/mesos_tests-module.Tpo -c -o tests/mesos_tests-module.o `test -f 'tests/module.cpp' || echo '../../src/'`tests/module.cpp
make[4]: *** [tests/mesos_tests-master_validation_tests.o] Error 1
make[4]: *** Waiting for unfinished jobs....
mv -f tests/.deps/mesos_tests-master_maintenance_tests.Tpo tests/.deps/mesos_tests-master_maintenance_tests.Po
mv -f tests/.deps/mesos_tests-master_quota_tests.Tpo tests/.deps/mesos_tests-master_quota_tests.Po
mv -f tests/.deps/mesos_tests-master_slave_reconciliation_tests.Tpo tests/.deps/mesos_tests-master_slave_reconciliation_tests.Po
mv -f tests/.deps/mesos_tests-metrics_tests.Tpo tests/.deps/mesos_tests-metrics_tests.Po
mv -f tests/.deps/mesos_tests-module.Tpo tests/.deps/mesos_tests-module.Po
mv -f tests/.deps/mesos_tests-master_tests.Tpo tests/.deps/mesos_tests-master_tests.Po
mv -f tests/.deps/mesos_tests-mesos.Tpo tests/.deps/mesos_tests-mesos.Po
make[4]: Leaving directory `/mesos/mesos-0.28.3/_build/src'
make[3]: *** [check-am] Error 2
make[3]: Leaving directory `/mesos/mesos-0.28.3/_build/src'
make[2]: *** [check] Error 2
make[2]: Leaving directory `/mesos/mesos-0.28.3/_build/src'
make[1]: *** [check-recursive] Error 1
make[1]: Leaving directory `/mesos/mesos-0.28.3/_build'
make: *** [distcheck] Error 1
+ docker rmi mesos-1478647387-520
Untagged: mesos-1478647387-520:latest
Deleted: sha256:fbf075680d7ba6971eef26b138ea7a8fc22b4e39b769fb8073e095e7f261bfcb
Deleted: sha256:38513b45f499d8fb681a2a6b85b791d795120c43eacb9868430ee53741befbdc
Deleted: sha256:e44e90b68d64b9178f66aecaa1f836a2b3823a4ad4b963fc782686299249413b
Deleted: sha256:51e2c0aceb1e049b2562857156f1d6032559bc9c5e46f6d0d1f2e0be17348f3b
Deleted: sha256:5a3e2e9fd93fea92d942e1bbc5b3c6d1402d8ac8cf2066b61df0ea117a53fe70
Deleted: sha256:703f823e72b2f766fccd0a815b03da38ff2a024edad00de753a6dcad523306e8
Deleted: sha256:dc65968bae1e00be5402a953c8c751f716077997cd0134446c91de7f5fd74241
Deleted: sha256:eacba7c7035cb3960a02a5e1f54a45ee0ac1fdbc3affc2f3f9ee6b8d42296c2b
Deleted: sha256:3fbc437153e78ceca3b5303b504438e6b064712d28b5398981c376ebeff720ed
Deleted: sha256:5abd112da155c251da1565f754f13e7aa73bae7cad16743eaea2aad3b038840f
Deleted: sha256:be229ba8f30c51664fd2d45cfc0317e8ed4289f13b9d0d0fd9046b8258b83f20
Deleted: sha256:36d51802d74d4bb345f7996651e5872722f8ba370d94c7f6da07fea8e57259c4
Deleted: sha256:2eded317849cf265b4879457cbf509e98ab110a732053306bac0ae0b80ab30a0
Deleted: sha256:9e72ed757a03a52565a400523381bb9c4cba382f18cf25235ea2b51267f2bd64
Deleted: sha256:a70dceacbe50a54cf31ed8724ce3d236754ccc75c4dbb8b62aefacd58e34a0df
Deleted: sha256:b73495ab29c505ed1506c41ecda0a26f91112bcd6720ccbc724a99b8c3234d04
Deleted: sha256:f2a6dc90e8879cab54e1ed93aaa90960dc89c009a3ca8971d2b7cef770828eea
Deleted: sha256:277bcb2c4e72b1baf5a25ef69cb790533f56c96fd791d6412ccf1029e88ad378
Deleted: sha256:6045938bd88cff7adc3b72d2e086cbdecaeb83d6534f83aa136c13a8d6bf45c6
Deleted: sha256:2d3d71b5a18bdb7470e4ef438b73a26b83eb570f65db07867c3dcf42bd8c2f9d
Deleted: sha256:ec6380661cea456b9fd7887689e94c7047d1d575dbf78faede069a67fdad8b80
Deleted: sha256:1ad945dfa2c938aa9276ac76dc947874a5c152f439caf10a2322c81e168b00f2
Deleted: sha256:578592c0fd627a8637f1bb35f47e3bf51564982a46999d6cf239d81c99daa546
Deleted: sha256:7b37f43e3c0867ac1c02b936c3fb72722f0613b1c4e354361a53a56d1f0a3989
Deleted: sha256:52d4731b8337e949a889e0e5802fe53f394d85732c9a9615baba1063626a0650
Build step 'Execute shell' marked build as failure

Mime
View raw message