mesos-builds mailing list archives

Site index · List index
Message view « Date » · « Thread »
Top « Date » · « Thread »
From Neil Conway <neil.con...@gmail.com>
Subject Re: Build failed in Jenkins: mesos-reviewbot #15469
Date Thu, 06 Oct 2016 20:12:52 GMT
Unfortunately, it seems the CI log has been GC'd and the problem
hasn't reoccurred. I'm inclined to shelve this until/unless the
problem reoccurs.

Neil

On Fri, Sep 30, 2016 at 5:24 PM, Vinod Kone <vinodkone@apache.org> wrote:
> neil?
>
> On Fri, Sep 30, 2016 at 10:29 AM, Apache Jenkins Server <
> jenkins@builds.apache.org> wrote:
>
>> See <https://builds.apache.org/job/mesos-reviewbot/15469/>
>>
>> ------------------------------------------
>> [...truncated 205724 lines...]
>> I0930 17:28:55.348125 29100 containerizer.cpp:226] Using isolation:
>> posix/cpu,posix/mem,filesystem/posix,network/cni
>> W0930 17:28:55.348834 29100 backend.cpp:75] Failed to create 'aufs'
>> backend: AufsBackend requires root privileges, but is running as user mesos
>> W0930 17:28:55.349006 29100 backend.cpp:75] Failed to create 'bind'
>> backend: BindBackend requires root privileges
>> I0930 17:28:55.352018 29134 slave.cpp:208] Mesos agent started on (607)@
>> 172.17.0.2:41028
>> I0930 17:28:55.352051 29134 slave.cpp:209] Flags at startup: --acls=""
>> --appc_simple_discovery_uri_prefix="http://"
>> --appc_store_dir="/tmp/mesos/store/appc" --authenticate_http_readonly="true"
>> --authenticate_http_readwrite="true" --authenticatee="crammd5"
>> --authentication_backoff_factor="1secs" --authorizer="local"
>> --cgroups_cpu_enable_pids_and_tids_count="false"
>> --cgroups_enable_cfs="false" --cgroups_hierarchy="/sys/fs/cgroup"
>> --cgroups_limit_swap="false" --cgroups_root="mesos"
>> --container_disk_watch_interval="15secs" --containerizers="mesos"
>> --credential="/tmp/Endpoint_SlaveEndpointTest_AuthorizedRequest_1_DiaJzR/credential"
>> --default_role="*" --disk_watch_interval="1mins" --docker="docker"
>> --docker_kill_orphans="true" --docker_registry="https://reg
>> istry-1.docker.io" --docker_remove_delay="6hrs"
>> --docker_socket="/var/run/docker.sock" --docker_stop_timeout="0ns"
>> --docker_store_dir="/tmp/mesos/store/docker"
>> --docker_volume_checkpoint_dir="/var/run/mesos/isolators/docker/volume"
>> --enforce_container_disk_quota="false" --executor_registration_timeout="1mins"
>> --executor_shutdown_grace_period="5secs" --fetcher_cache_dir="/tmp/Endp
>> oint_SlaveEndpointTest_AuthorizedRequest_1_DiaJzR/fetch"
>> --fetcher_cache_size="2GB" --frameworks_home="" --gc_delay="1weeks"
>> --gc_disk_headroom="0.1" --hadoop_home="" --help="true"
>> --hostname_lookup="true" --http_authenticators="basic"
>> --http_command_executor="false" --http_credentials="/tmp/Endpo
>> int_SlaveEndpointTest_AuthorizedRequest_1_DiaJzR/http_credentials"
>> --image_provisioner_backend="copy" --initialize_driver_logging="true"
>> --isolation="posix/cpu,posix/mem" --launcher="posix"
>> --launcher_dir="/mesos/mesos-1.1.0/_build/src" --logbufsecs="0"
>> --logging_level="INFO" --oversubscribed_resources_interval="15secs"
>> --perf_duration="10secs" --perf_interval="1mins"
>> --qos_correction_interval_min="0ns" --quiet="false" --recover="reconnect"
>> --recovery_timeout="15mins" --registration_backoff_factor="10ms"
>> --resources="cpus:2;gpus:0;mem:1024;disk:1024;ports:[31000-32000]"
>> --revocable_cpu_low_priority="true" --runtime_dir="/tmp/Endpoint_S
>> laveEndpointTest_AuthorizedRequest_1_DiaJzR"
>> --sandbox_directory="/mnt/mesos/sandbox" --strict="true"
>> --switch_user="true" --systemd_enable_support="true"
>> --systemd_runtime_directory="/run/systemd/system" --version="false"
>> --work_dir="/tmp/Endpoint_SlaveEndpointTest_AuthorizedRequest_1_ngmqb3"
>> I0930 17:28:55.352696 29134 credentials.hpp:86] Loading credential for
>> authentication from '/tmp/Endpoint_SlaveEndpointTe
>> st_AuthorizedRequest_1_DiaJzR/credential'
>> I0930 17:28:55.352902 29134 slave.cpp:346] Agent using credential for:
>> test-principal
>> I0930 17:28:55.352929 29134 credentials.hpp:37] Loading credentials for
>> authentication from '/tmp/Endpoint_SlaveEndpointTe
>> st_AuthorizedRequest_1_DiaJzR/http_credentials'
>> I0930 17:28:55.353193 29134 http.cpp:883] Using default 'basic' HTTP
>> authenticator for realm 'mesos-agent-readonly'
>> I0930 17:28:55.353394 29134 http.cpp:883] Using default 'basic' HTTP
>> authenticator for realm 'mesos-agent-readwrite'
>> I0930 17:28:55.354624 29134 slave.cpp:533] Agent resources: cpus(*):2;
>> mem(*):1024; disk(*):1024; ports(*):[31000-32000]
>> I0930 17:28:55.354727 29134 slave.cpp:541] Agent attributes: [  ]
>> I0930 17:28:55.354753 29134 slave.cpp:546] Agent hostname: 60dbce65f411
>> I0930 17:28:55.356168 29124 state.cpp:57] Recovering state from
>> '/tmp/Endpoint_SlaveEndpointTest_AuthorizedRequest_1_ngmqb3/meta'
>> I0930 17:28:55.356242 29134 process.cpp:3377] Handling HTTP event for
>> process 'slave(607)' with path: '/slave(607)/monitor/statistics.json'
>> I0930 17:28:55.356691 29126 status_update_manager.cpp:203] Recovering
>> status update manager
>> I0930 17:28:55.356916 29121 containerizer.cpp:580] Recovering containerizer
>> I0930 17:28:55.357089 29125 http.cpp:835] Authorizing principal
>> 'test-principal' to GET the '/monitor/statistics.json' endpoint
>> I0930 17:28:55.358302 29127 provisioner.cpp:253] Provisioner recovery
>> complete
>> I0930 17:28:55.358739 29125 slave.cpp:5256] Finished recovery
>> I0930 17:28:55.359225 29125 slave.cpp:5428] Querying resource estimator
>> for oversubscribable resources
>> I0930 17:28:55.359561 29132 slave.cpp:5442] Received oversubscribable
>> resources {} from the resource estimator
>> I0930 17:28:55.360692 29133 slave.cpp:787] Agent terminating
>> [       OK ] Endpoint/SlaveEndpointTest.AuthorizedRequest/1 (21 ms)
>> [ RUN      ] Endpoint/SlaveEndpointTest.AuthorizedRequest/2
>> I0930 17:28:55.370875 29100 containerizer.cpp:226] Using isolation:
>> posix/cpu,posix/mem,filesystem/posix,network/cni
>> W0930 17:28:55.371615 29100 backend.cpp:75] Failed to create 'aufs'
>> backend: AufsBackend requires root privileges, but is running as user mesos
>> W0930 17:28:55.371809 29100 backend.cpp:75] Failed to create 'bind'
>> backend: BindBackend requires root privileges
>> I0930 17:28:55.375237 29122 slave.cpp:208] Mesos agent started on (608)@
>> 172.17.0.2:41028
>> I0930 17:28:55.375360 29122 slave.cpp:209] Flags at startup: --acls=""
>> --appc_simple_discovery_uri_prefix="http://"
>> --appc_store_dir="/tmp/mesos/store/appc" --authenticate_http_readonly="true"
>> --authenticate_http_readwrite="true" --authenticatee="crammd5"
>> --authentication_backoff_factor="1secs" --authorizer="local"
>> --cgroups_cpu_enable_pids_and_tids_count="false"
>> --cgroups_enable_cfs="false" --cgroups_hierarchy="/sys/fs/cgroup"
>> --cgroups_limit_swap="false" --cgroups_root="mesos"
>> --container_disk_watch_interval="15secs" --containerizers="mesos"
>> --credential="/tmp/Endpoint_SlaveEndpointTest_AuthorizedRequest_2_lxvwl7/credential"
>> --default_role="*" --disk_watch_interval="1mins" --docker="docker"
>> --docker_kill_orphans="true" --docker_registry="https://reg
>> istry-1.docker.io" --docker_remove_delay="6hrs"
>> --docker_socket="/var/run/docker.sock" --docker_stop_timeout="0ns"
>> --docker_store_dir="/tmp/mesos/store/docker"
>> --docker_volume_checkpoint_dir="/var/run/mesos/isolators/docker/volume"
>> --enforce_container_disk_quota="false" --executor_registration_timeout="1mins"
>> --executor_shutdown_grace_period="5secs" --fetcher_cache_dir="/tmp/Endp
>> oint_SlaveEndpointTest_AuthorizedRequest_2_lxvwl7/fetch"
>> --fetcher_cache_size="2GB" --frameworks_home="" --gc_delay="1weeks"
>> --gc_disk_headroom="0.1" --hadoop_home="" --help="true"
>> --hostname_lookup="true" --http_authenticators="basic"
>> --http_command_executor="false" --http_credentials="/tmp/Endpo
>> int_SlaveEndpointTest_AuthorizedRequest_2_lxvwl7/http_credentials"
>> --image_provisioner_backend="copy" --initialize_driver_logging="true"
>> --isolation="posix/cpu,posix/mem" --launcher="posix"
>> --launcher_dir="/mesos/mesos-1.1.0/_build/src" --logbufsecs="0"
>> --logging_level="INFO" --oversubscribed_resources_interval="15secs"
>> --perf_duration="10secs" --perf_interval="1mins"
>> --qos_correction_interval_min="0ns" --quiet="false" --recover="reconnect"
>> --recovery_timeout="15mins" --registration_backoff_factor="10ms"
>> --resources="cpus:2;gpus:0;mem:1024;disk:1024;ports:[31000-32000]"
>> --revocable_cpu_low_priority="true" --runtime_dir="/tmp/Endpoint_S
>> laveEndpointTest_AuthorizedRequest_2_lxvwl7"
>> --sandbox_directory="/mnt/mesos/sandbox" --strict="true"
>> --switch_user="true" --systemd_enable_support="true"
>> --systemd_runtime_directory="/run/systemd/system" --version="false"
>> --work_dir="/tmp/Endpoint_SlaveEndpointTest_AuthorizedRequest_2_XJyCTi"
>> I0930 17:28:55.375983 29122 credentials.hpp:86] Loading credential for
>> authentication from '/tmp/Endpoint_SlaveEndpointTe
>> st_AuthorizedRequest_2_lxvwl7/credential'
>> I0930 17:28:55.376180 29122 slave.cpp:346] Agent using credential for:
>> test-principal
>> I0930 17:28:55.376212 29122 credentials.hpp:37] Loading credentials for
>> authentication from '/tmp/Endpoint_SlaveEndpointTe
>> st_AuthorizedRequest_2_lxvwl7/http_credentials'
>> I0930 17:28:55.376533 29122 http.cpp:883] Using default 'basic' HTTP
>> authenticator for realm 'mesos-agent-readonly'
>> I0930 17:28:55.376696 29122 http.cpp:883] Using default 'basic' HTTP
>> authenticator for realm 'mesos-agent-readwrite'
>> I0930 17:28:55.377890 29122 slave.cpp:533] Agent resources: cpus(*):2;
>> mem(*):1024; disk(*):1024; ports(*):[31000-32000]
>> I0930 17:28:55.377991 29122 slave.cpp:541] Agent attributes: [  ]
>> I0930 17:28:55.378016 29122 slave.cpp:546] Agent hostname: 60dbce65f411
>> I0930 17:28:55.379531 29131 state.cpp:57] Recovering state from
>> '/tmp/Endpoint_SlaveEndpointTest_AuthorizedRequest_2_XJyCTi/meta'
>> I0930 17:28:55.379592 29122 process.cpp:3377] Handling HTTP event for
>> process 'slave(608)' with path: '/slave(608)/containers'
>> I0930 17:28:55.379951 29131 status_update_manager.cpp:203] Recovering
>> status update manager
>> I0930 17:28:55.380156 29132 containerizer.cpp:580] Recovering containerizer
>> I0930 17:28:55.380408 29133 http.cpp:835] Authorizing principal
>> 'test-principal' to GET the '/containers' endpoint
>> I0930 17:28:55.381343 29128 provisioner.cpp:253] Provisioner recovery
>> complete
>> I0930 17:28:55.381551 29132 slave.cpp:5256] Finished recovery
>> I0930 17:28:55.381948 29132 slave.cpp:5428] Querying resource estimator
>> for oversubscribable resources
>> I0930 17:28:55.382187 29128 slave.cpp:5442] Received oversubscribable
>> resources {} from the resource estimator
>> I0930 17:28:55.383329 29121 slave.cpp:787] Agent terminating
>> [       OK ] Endpoint/SlaveEndpointTest.AuthorizedRequest/2 (20 ms)
>> [ RUN      ] Endpoint/SlaveEndpointTest.UnauthorizedRequest/0
>> I0930 17:28:55.390463 29100 containerizer.cpp:226] Using isolation:
>> posix/cpu,posix/mem,filesystem/posix,network/cni
>> W0930 17:28:55.391039 29100 backend.cpp:75] Failed to create 'aufs'
>> backend: AufsBackend requires root privileges, but is running as user mesos
>> W0930 17:28:55.391177 29100 backend.cpp:75] Failed to create 'bind'
>> backend: BindBackend requires root privileges
>> I0930 17:28:55.393635 29131 slave.cpp:208] Mesos agent started on (609)@
>> 172.17.0.2:41028
>> I0930 17:28:55.393661 29131 slave.cpp:209] Flags at startup: --acls=""
>> --appc_simple_discovery_uri_prefix="http://"
>> --appc_store_dir="/tmp/mesos/store/appc" --authenticate_http_readonly="true"
>> --authenticate_http_readwrite="true" --authenticatee="crammd5"
>> --authentication_backoff_factor="1secs" --authorizer="local"
>> --cgroups_cpu_enable_pids_and_tids_count="false"
>> --cgroups_enable_cfs="false" --cgroups_hierarchy="/sys/fs/cgroup"
>> --cgroups_limit_swap="false" --cgroups_root="mesos"
>> --container_disk_watch_interval="15secs" --containerizers="mesos"
>> --credential="/tmp/Endpoint_SlaveEndpointTest_UnauthorizedRequest_0_75m4kn/credential"
>> --default_role="*" --disk_watch_interval="1mins" --docker="docker"
>> --docker_kill_orphans="true" --docker_registry="https://reg
>> istry-1.docker.io" --docker_remove_delay="6hrs"
>> --docker_socket="/var/run/docker.sock" --docker_stop_timeout="0ns"
>> --docker_store_dir="/tmp/mesos/store/docker"
>> --docker_volume_checkpoint_dir="/var/run/mesos/isolators/docker/volume"
>> --enforce_container_disk_quota="false" --executor_registration_timeout="1mins"
>> --executor_shutdown_grace_period="5secs" --fetcher_cache_dir="/tmp/Endp
>> oint_SlaveEndpointTest_UnauthorizedRequest_0_75m4kn/fetch"
>> --fetcher_cache_size="2GB" --frameworks_home="" --gc_delay="1weeks"
>> --gc_disk_headroom="0.1" --hadoop_home="" --help="true"
>> --hostname_lookup="true" --http_authenticators="basic"
>> --http_command_executor="false" --http_credentials="/tmp/Endpo
>> int_SlaveEndpointTest_UnauthorizedRequest_0_75m4kn/http_credentials"
>> --image_provisioner_backend="copy" --initialize_driver_logging="true"
>> --isolation="posix/cpu,posix/mem" --launcher="posix"
>> --launcher_dir="/mesos/mesos-1.1.0/_build/src" --logbufsecs="0"
>> --logging_level="INFO" --oversubscribed_resources_interval="15secs"
>> --perf_duration="10secs" --perf_interval="1mins"
>> --qos_correction_interval_min="0ns" --quiet="false" --recover="reconnect"
>> --recovery_timeout="15mins" --registration_backoff_factor="10ms"
>> --resources="cpus:2;gpus:0;mem:1024;disk:1024;ports:[31000-32000]"
>> --revocable_cpu_low_priority="true" --runtime_dir="/tmp/Endpoint_S
>> laveEndpointTest_UnauthorizedRequest_0_75m4kn"
>> --sandbox_directory="/mnt/mesos/sandbox" --strict="true"
>> --switch_user="true" --systemd_enable_support="true"
>> --systemd_runtime_directory="/run/systemd/system" --version="false"
>> --work_dir="/tmp/Endpoint_SlaveEndpointTest_UnauthorizedRequest_0_xDxQPy"
>> I0930 17:28:55.394053 29131 credentials.hpp:86] Loading credential for
>> authentication from '/tmp/Endpoint_SlaveEndpointTe
>> st_UnauthorizedRequest_0_75m4kn/credential'
>> I0930 17:28:55.394172 29131 slave.cpp:346] Agent using credential for:
>> test-principal
>> I0930 17:28:55.394197 29131 credentials.hpp:37] Loading credentials for
>> authentication from '/tmp/Endpoint_SlaveEndpointTe
>> st_UnauthorizedRequest_0_75m4kn/http_credentials'
>> I0930 17:28:55.394413 29131 http.cpp:883] Using default 'basic' HTTP
>> authenticator for realm 'mesos-agent-readonly'
>> I0930 17:28:55.394533 29131 http.cpp:883] Using default 'basic' HTTP
>> authenticator for realm 'mesos-agent-readwrite'
>> I0930 17:28:55.395470 29131 slave.cpp:533] Agent resources: cpus(*):2;
>> mem(*):1024; disk(*):1024; ports(*):[31000-32000]
>> I0930 17:28:55.395541 29131 slave.cpp:541] Agent attributes: [  ]
>> I0930 17:28:55.395552 29131 slave.cpp:546] Agent hostname: 60dbce65f411
>> I0930 17:28:55.396733 29124 state.cpp:57] Recovering state from
>> '/tmp/Endpoint_SlaveEndpointTest_UnauthorizedRequest_0_xDxQPy/meta'
>> I0930 17:28:55.396793 29131 process.cpp:3377] Handling HTTP event for
>> process 'slave(609)' with path: '/slave(609)/monitor/statistics'
>> I0930 17:28:55.397152 29128 status_update_manager.cpp:203] Recovering
>> status update manager
>> I0930 17:28:55.397289 29121 containerizer.cpp:580] Recovering containerizer
>> I0930 17:28:55.397552 29126 http.cpp:835] Authorizing principal
>> 'test-principal' to GET the '/monitor/statistics' endpoint
>> I0930 17:28:55.398370 29122 provisioner.cpp:253] Provisioner recovery
>> complete
>> I0930 17:28:55.398571 29119 slave.cpp:5256] Finished recovery
>> I0930 17:28:55.399034 29119 slave.cpp:5428] Querying resource estimator
>> for oversubscribable resources
>> I0930 17:28:55.399301 29123 slave.cpp:5442] Received oversubscribable
>> resources {} from the resource estimator
>> I0930 17:28:55.399593 29127 slave.cpp:787] Agent terminating
>> [       OK ] Endpoint/SlaveEndpointTest.UnauthorizedRequest/0 (16 ms)
>> [ RUN      ] Endpoint/SlaveEndpointTest.UnauthorizedRequest/1
>> I0930 17:28:55.408339 29100 containerizer.cpp:226] Using isolation:
>> posix/cpu,posix/mem,filesystem/posix,network/cni
>> W0930 17:28:55.408896 29100 backend.cpp:75] Failed to create 'aufs'
>> backend: AufsBackend requires root privileges, but is running as user mesos
>> W0930 17:28:55.409065 29100 backend.cpp:75] Failed to create 'bind'
>> backend: BindBackend requires root privileges
>> I0930 17:28:55.411878 29131 slave.cpp:208] Mesos agent started on (610)@
>> 172.17.0.2:41028
>> I0930 17:28:55.411900 29131 slave.cpp:209] Flags at startup: --acls=""
>> --appc_simple_discovery_uri_prefix="http://"
>> --appc_store_dir="/tmp/mesos/store/appc" --authenticate_http_readonly="true"
>> --authenticate_http_readwrite="true" --authenticatee="crammd5"
>> --authentication_backoff_factor="1secs" --authorizer="local"
>> --cgroups_cpu_enable_pids_and_tids_count="false"
>> --cgroups_enable_cfs="false" --cgroups_hierarchy="/sys/fs/cgroup"
>> --cgroups_limit_swap="false" --cgroups_root="mesos"
>> --container_disk_watch_interval="15secs" --containerizers="mesos"
>> --credential="/tmp/Endpoint_SlaveEndpointTest_UnauthorizedRequest_1_xGLDvD/credential"
>> --default_role="*" --disk_watch_interval="1mins" --docker="docker"
>> --docker_kill_orphans="true" --docker_registry="https://reg
>> istry-1.docker.io" --docker_remove_delay="6hrs"
>> --docker_socket="/var/run/docker.sock" --docker_stop_timeout="0ns"
>> --docker_store_dir="/tmp/mesos/store/docker"
>> --docker_volume_checkpoint_dir="/var/run/mesos/isolators/docker/volume"
>> --enforce_container_disk_quota="false" --executor_registration_timeout="1mins"
>> --executor_shutdown_grace_period="5secs" --fetcher_cache_dir="/tmp/Endp
>> oint_SlaveEndpointTest_UnauthorizedRequest_1_xGLDvD/fetch"
>> --fetcher_cache_size="2GB" --frameworks_home="" --gc_delay="1weeks"
>> --gc_disk_headroom="0.1" --hadoop_home="" --help="true"
>> --hostname_lookup="true" --http_authenticators="basic"
>> --http_command_executor="false" --http_credentials="/tmp/Endpo
>> int_SlaveEndpointTest_UnauthorizedRequest_1_xGLDvD/http_credentials"
>> --image_provisioner_backend="copy" --initialize_driver_logging="true"
>> --isolation="posix/cpu,posix/mem" --launcher="posix"
>> --launcher_dir="/mesos/mesos-1.1.0/_build/src" --logbufsecs="0"
>> --logging_level="INFO" --oversubscribed_resources_interval="15secs"
>> --perf_duration="10secs" --perf_interval="1mins"
>> --qos_correction_interval_min="0ns" --quiet="false" --recover="reconnect"
>> --recovery_timeout="15mins" --registration_backoff_factor="10ms"
>> --resources="cpus:2;gpus:0;mem:1024;disk:1024;ports:[31000-32000]"
>> --revocable_cpu_low_priority="true" --runtime_dir="/tmp/Endpoint_S
>> laveEndpointTest_UnauthorizedRequest_1_xGLDvD"
>> --sandbox_directory="/mnt/mesos/sandbox" --strict="true"
>> --switch_user="true" --systemd_enable_support="true"
>> --systemd_runtime_directory="/run/systemd/system" --version="false"
>> --work_dir="/tmp/Endpoint_SlaveEndpointTest_UnauthorizedRequest_1_BaADXO"
>> I0930 17:28:55.412266 29131 credentials.hpp:86] Loading credential for
>> authentication from '/tmp/Endpoint_SlaveEndpointTe
>> st_UnauthorizedRequest_1_xGLDvD/credential'
>> I0930 17:28:55.412410 29131 slave.cpp:346] Agent using credential for:
>> test-principal
>> I0930 17:28:55.412428 29131 credentials.hpp:37] Loading credentials for
>> authentication from '/tmp/Endpoint_SlaveEndpointTe
>> st_UnauthorizedRequest_1_xGLDvD/http_credentials'
>> I0930 17:28:55.412729 29131 http.cpp:883] Using default 'basic' HTTP
>> authenticator for realm 'mesos-agent-readonly'
>> I0930 17:28:55.412909 29131 http.cpp:883] Using default 'basic' HTTP
>> authenticator for realm 'mesos-agent-readwrite'
>> I0930 17:28:55.414227 29131 slave.cpp:533] Agent resources: cpus(*):2;
>> mem(*):1024; disk(*):1024; ports(*):[31000-32000]
>> I0930 17:28:55.414325 29131 slave.cpp:541] Agent attributes: [  ]
>> I0930 17:28:55.414341 29131 slave.cpp:546] Agent hostname: 60dbce65f411
>> I0930 17:28:55.415787 29134 state.cpp:57] Recovering state from
>> '/tmp/Endpoint_SlaveEndpointTest_UnauthorizedRequest_1_BaADXO/meta'
>> I0930 17:28:55.415845 29131 process.cpp:3377] Handling HTTP event for
>> process 'slave(610)' with path: '/slave(610)/monitor/statistics.json'
>> I0930 17:28:55.416234 29132 status_update_manager.cpp:203] Recovering
>> status update manager
>> I0930 17:28:55.416498 29127 containerizer.cpp:580] Recovering containerizer
>> I0930 17:28:55.416625 29124 http.cpp:835] Authorizing principal
>> 'test-principal' to GET the '/monitor/statistics.json' endpoint
>> I0930 17:28:55.417505 29124 provisioner.cpp:253] Provisioner recovery
>> complete
>> I0930 17:28:55.417718 29131 slave.cpp:5256] Finished recovery
>> I0930 17:28:55.418082 29131 slave.cpp:5428] Querying resource estimator
>> for oversubscribable resources
>> I0930 17:28:55.418226 29131 slave.cpp:5442] Received oversubscribable
>> resources {} from the resource estimator
>> I0930 17:28:55.418627 29134 slave.cpp:787] Agent terminating
>> [       OK ] Endpoint/SlaveEndpointTest.UnauthorizedRequest/1 (19 ms)
>> [ RUN      ] Endpoint/SlaveEndpointTest.UnauthorizedRequest/2
>> I0930 17:28:55.426049 29100 containerizer.cpp:226] Using isolation:
>> posix/cpu,posix/mem,filesystem/posix,network/cni
>> W0930 17:28:55.426635 29100 backend.cpp:75] Failed to create 'aufs'
>> backend: AufsBackend requires root privileges, but is running as user mesos
>> W0930 17:28:55.426807 29100 backend.cpp:75] Failed to create 'bind'
>> backend: BindBackend requires root privileges
>> I0930 17:28:55.429453 29120 slave.cpp:208] Mesos agent started on (611)@
>> 172.17.0.2:41028
>> I0930 17:28:55.429476 29120 slave.cpp:209] Flags at startup: --acls=""
>> --appc_simple_discovery_uri_prefix="http://"
>> --appc_store_dir="/tmp/mesos/store/appc" --authenticate_http_readonly="true"
>> --authenticate_http_readwrite="true" --authenticatee="crammd5"
>> --authentication_backoff_factor="1secs" --authorizer="local"
>> --cgroups_cpu_enable_pids_and_tids_count="false"
>> --cgroups_enable_cfs="false" --cgroups_hierarchy="/sys/fs/cgroup"
>> --cgroups_limit_swap="false" --cgroups_root="mesos"
>> --container_disk_watch_interval="15secs" --containerizers="mesos"
>> --credential="/tmp/Endpoint_SlaveEndpointTest_UnauthorizedRequest_2_RznoST/credential"
>> --default_role="*" --disk_watch_interval="1mins" --docker="docker"
>> --docker_kill_orphans="true" --docker_registry="https://reg
>> istry-1.docker.io" --docker_remove_delay="6hrs"
>> --docker_socket="/var/run/docker.sock" --docker_stop_timeout="0ns"
>> --docker_store_dir="/tmp/mesos/store/docker"
>> --docker_volume_checkpoint_dir="/var/run/mesos/isolators/docker/volume"
>> --enforce_container_disk_quota="false" --executor_registration_timeout="1mins"
>> --executor_shutdown_grace_period="5secs" --fetcher_cache_dir="/tmp/Endp
>> oint_SlaveEndpointTest_UnauthorizedRequest_2_RznoST/fetch"
>> --fetcher_cache_size="2GB" --frameworks_home="" --gc_delay="1weeks"
>> --gc_disk_headroom="0.1" --hadoop_home="" --help="true"
>> --hostname_lookup="true" --http_authenticators="basic"
>> --http_command_executor="false" --http_credentials="/tmp/Endpo
>> int_SlaveEndpointTest_UnauthorizedRequest_2_RznoST/http_credentials"
>> --image_provisioner_backend="copy" --initialize_driver_logging="true"
>> --isolation="posix/cpu,posix/mem" --launcher="posix"
>> --launcher_dir="/mesos/mesos-1.1.0/_build/src" --logbufsecs="0"
>> --logging_level="INFO" --oversubscribed_resources_interval="15secs"
>> --perf_duration="10secs" --perf_interval="1mins"
>> --qos_correction_interval_min="0ns" --quiet="false" --recover="reconnect"
>> --recovery_timeout="15mins" --registration_backoff_factor="10ms"
>> --resources="cpus:2;gpus:0;mem:1024;disk:1024;ports:[31000-32000]"
>> --revocable_cpu_low_priority="true" --runtime_dir="/tmp/Endpoint_S
>> laveEndpointTest_UnauthorizedRequest_2_RznoST"
>> --sandbox_directory="/mnt/mesos/sandbox" --strict="true"
>> --switch_user="true" --systemd_enable_support="true"
>> --systemd_runtime_directory="/run/systemd/system" --version="false"
>> --work_dir="/tmp/Endpoint_SlaveEndpointTest_UnauthorizedRequest_2_rJloh5"
>> I0930 17:28:55.429859 29120 credentials.hpp:86] Loading credential for
>> authentication from '/tmp/Endpoint_SlaveEndpointTe
>> st_UnauthorizedRequest_2_RznoST/credential'
>> I0930 17:28:55.429991 29120 slave.cpp:346] Agent using credential for:
>> test-principal
>> I0930 17:28:55.430011 29120 credentials.hpp:37] Loading credentials for
>> authentication from '/tmp/Endpoint_SlaveEndpointTe
>> st_UnauthorizedRequest_2_RznoST/http_credentials'
>> I0930 17:28:55.430224 29120 http.cpp:883] Using default 'basic' HTTP
>> authenticator for realm 'mesos-agent-readonly'
>> I0930 17:28:55.430362 29120 http.cpp:883] Using default 'basic' HTTP
>> authenticator for realm 'mesos-agent-readwrite'
>> I0930 17:28:55.431323 29120 slave.cpp:533] Agent resources: cpus(*):2;
>> mem(*):1024; disk(*):1024; ports(*):[31000-32000]
>> I0930 17:28:55.431396 29120 slave.cpp:541] Agent attributes: [  ]
>> I0930 17:28:55.431413 29120 slave.cpp:546] Agent hostname: 60dbce65f411
>> I0930 17:28:55.432737 29128 state.cpp:57] Recovering state from
>> '/tmp/Endpoint_SlaveEndpointTest_UnauthorizedRequest_2_rJloh5/meta'
>> I0930 17:28:55.432814 29120 process.cpp:3377] Handling HTTP event for
>> process 'slave(611)' with path: '/slave(611)/containers'
>> I0930 17:28:55.433182 29134 status_update_manager.cpp:203] Recovering
>> status update manager
>> I0930 17:28:55.433411 29120 containerizer.cpp:580] Recovering containerizer
>> I0930 17:28:55.433528 29131 http.cpp:835] Authorizing principal
>> 'test-principal' to GET the '/containers' endpoint
>> I0930 17:28:55.434465 29119 provisioner.cpp:253] Provisioner recovery
>> complete
>> I0930 17:28:55.434671 29127 slave.cpp:5256] Finished recovery
>> I0930 17:28:55.435122 29127 slave.cpp:5428] Querying resource estimator
>> for oversubscribable resources
>> I0930 17:28:55.435478 29125 slave.cpp:5442] Received oversubscribable
>> resources {} from the resource estimator
>> I0930 17:28:55.435734 29120 slave.cpp:787] Agent terminating
>> [       OK ] Endpoint/SlaveEndpointTest.UnauthorizedRequest/2 (17 ms)
>> [ RUN      ] Endpoint/SlaveEndpointTest.NoAuthorizer/0
>> I0930 17:28:55.444180 29100 containerizer.cpp:226] Using isolation:
>> posix/cpu,posix/mem,filesystem/posix,network/cni
>> W0930 17:28:55.444872 29100 backend.cpp:75] Failed to create 'aufs'
>> backend: AufsBackend requires root privileges, but is running as user mesos
>> W0930 17:28:55.445035 29100 backend.cpp:75] Failed to create 'bind'
>> backend: BindBackend requires root privileges
>> I0930 17:28:55.446346 29100 cluster.cpp:435] Creating default 'local'
>> authorizer
>> I0930 17:28:55.447960 29126 slave.cpp:208] Mesos agent started on (612)@
>> 172.17.0.2:41028
>> I0930 17:28:55.447993 29126 slave.cpp:209] Flags at startup: --acls=""
>> --appc_simple_discovery_uri_prefix="http://"
>> --appc_store_dir="/tmp/mesos/store/appc" --authenticate_http_readonly="true"
>> --authenticate_http_readwrite="true" --authenticatee="crammd5"
>> --authentication_backoff_factor="1secs" --authorizer="local"
>> --cgroups_cpu_enable_pids_and_tids_count="false"
>> --cgroups_enable_cfs="false" --cgroups_hierarchy="/sys/fs/cgroup"
>> --cgroups_limit_swap="false" --cgroups_root="mesos"
>> --container_disk_watch_interval="15secs" --containerizers="mesos"
>> --credential="/tmp/Endpoint_SlaveEndpointTest_NoAuthorizer_0_75ibqa/credential"
>> --default_role="*" --disk_watch_interval="1mins" --docker="docker"
>> --docker_kill_orphans="true" --docker_registry="https://reg
>> istry-1.docker.io" --docker_remove_delay="6hrs"
>> --docker_socket="/var/run/docker.sock" --docker_stop_timeout="0ns"
>> --docker_store_dir="/tmp/mesos/store/docker"
>> --docker_volume_checkpoint_dir="/var/run/mesos/isolators/docker/volume"
>> --enforce_container_disk_quota="false" --executor_registration_timeout="1mins"
>> --executor_shutdown_grace_period="5secs" --fetcher_cache_dir="/tmp/Endp
>> oint_SlaveEndpointTest_NoAuthorizer_0_75ibqa/fetch"
>> --fetcher_cache_size="2GB" --frameworks_home="" --gc_delay="1weeks"
>> --gc_disk_headroom="0.1" --hadoop_home="" --help="false"
>> --hostname_lookup="true" --http_authenticators="basic"
>> --http_command_executor="false" --http_credentials="/tmp/Endpo
>> int_SlaveEndpointTest_NoAuthorizer_0_75ibqa/http_credentials"
>> --image_provisioner_backend="copy" --initialize_driver_logging="true"
>> --isolation="posix/cpu,posix/mem" --launcher="posix"
>> --launcher_dir="/mesos/mesos-1.1.0/_build/src" --logbufsecs="0"
>> --logging_level="INFO" --oversubscribed_resources_interval="15secs"
>> --perf_duration="10secs" --perf_interval="1mins"
>> --qos_correction_interval_min="0ns" --quiet="false" --recover="reconnect"
>> --recovery_timeout="15mins" --registration_backoff_factor="10ms"
>> --resources="cpus:2;gpus:0;mem:1024;disk:1024;ports:[31000-32000]"
>> --revocable_cpu_low_priority="true" --runtime_dir="/tmp/Endpoint_S
>> laveEndpointTest_NoAuthorizer_0_75ibqa" --sandbox_directory="/mnt/mesos/sandbox"
>> --strict="true" --switch_user="true" --systemd_enable_support="true"
>> --systemd_runtime_directory="/run/systemd/system" --version="false"
>> --work_dir="/tmp/Endpoint_SlaveEndpointTest_NoAuthorizer_0_tNCoMl"
>> I0930 17:28:55.448871 29126 credentials.hpp:86] Loading credential for
>> authentication from '/tmp/Endpoint_SlaveEndpointTe
>> st_NoAuthorizer_0_75ibqa/credential'
>> I0930 17:28:55.449074 29126 slave.cpp:346] Agent using credential for:
>> test-principal
>> I0930 17:28:55.449105 29126 credentials.hpp:37] Loading credentials for
>> authentication from '/tmp/Endpoint_SlaveEndpointTe
>> st_NoAuthorizer_0_75ibqa/http_credentials'
>> I0930 17:28:55.449385 29126 http.cpp:883] Using default 'basic' HTTP
>> authenticator for realm 'mesos-agent-readonly'
>> I0930 17:28:55.449534 29126 http.cpp:883] Using default 'basic' HTTP
>> authenticator for realm 'mesos-agent-readwrite'
>> I0930 17:28:55.450776 29126 slave.cpp:533] Agent resources: cpus(*):2;
>> mem(*):1024; disk(*):1024; ports(*):[31000-32000]
>> I0930 17:28:55.450880 29126 slave.cpp:541] Agent attributes: [  ]
>> I0930 17:28:55.450906 29126 slave.cpp:546] Agent hostname: 60dbce65f411
>> I0930 17:28:55.452394 29129 state.cpp:57] Recovering state from
>> '/tmp/Endpoint_SlaveEndpointTest_NoAuthorizer_0_tNCoMl/meta'
>> I0930 17:28:55.452428 29126 process.cpp:3377] Handling HTTP event for
>> process 'slave(612)' with path: '/slave(612)/monitor/statistics'
>> I0930 17:28:55.453042 29132 status_update_manager.cpp:203] Recovering
>> status update manager
>> I0930 17:28:55.453294 29127 containerizer.cpp:580] Recovering containerizer
>> I0930 17:28:55.453413 29133 http.cpp:835] Authorizing principal
>> 'test-principal' to GET the '/monitor/statistics' endpoint
>> I0930 17:28:55.455919 29124 provisioner.cpp:253] Provisioner recovery
>> complete
>> I0930 17:28:55.456276 29131 slave.cpp:5256] Finished recovery
>> I0930 17:28:55.456786 29131 slave.cpp:5428] Querying resource estimator
>> for oversubscribable resources
>> I0930 17:28:55.457267 29119 slave.cpp:5442] Received oversubscribable
>> resources {} from the resource estimator
>> I0930 17:28:55.457451 29126 slave.cpp:787] Agent terminating
>> [       OK ] Endpoint/SlaveEndpointTest.NoAuthorizer/0 (23 ms)
>> [ RUN      ] Endpoint/SlaveEndpointTest.NoAuthorizer/1
>> I0930 17:28:55.467718 29100 containerizer.cpp:226] Using isolation:
>> posix/cpu,posix/mem,filesystem/posix,network/cni
>> W0930 17:28:55.468426 29100 backend.cpp:75] Failed to create 'aufs'
>> backend: AufsBackend requires root privileges, but is running as user mesos
>> W0930 17:28:55.468600 29100 backend.cpp:75] Failed to create 'bind'
>> backend: BindBackend requires root privileges
>> I0930 17:28:55.470147 29100 cluster.cpp:435] Creating default 'local'
>> authorizer
>> I0930 17:28:55.472133 29123 slave.cpp:208] Mesos agent started on (613)@
>> 172.17.0.2:41028
>> I0930 17:28:55.472165 29123 slave.cpp:209] Flags at startup: --acls=""
>> --appc_simple_discovery_uri_prefix="http://"
>> --appc_store_dir="/tmp/mesos/store/appc" --authenticate_http_readonly="true"
>> --authenticate_http_readwrite="true" --authenticatee="crammd5"
>> --authentication_backoff_factor="1secs" --authorizer="local"
>> --cgroups_cpu_enable_pids_and_tids_count="false"
>> --cgroups_enable_cfs="false" --cgroups_hierarchy="/sys/fs/cgroup"
>> --cgroups_limit_swap="false" --cgroups_root="mesos"
>> --container_disk_watch_interval="15secs" --containerizers="mesos"
>> --credential="/tmp/Endpoint_SlaveEndpointTest_NoAuthorizer_1_RAvVcr/credential"
>> --default_role="*" --disk_watch_interval="1mins" --docker="docker"
>> --docker_kill_orphans="true" --docker_registry="https://reg
>> istry-1.docker.io" --docker_remove_delay="6hrs"
>> --docker_socket="/var/run/docker.sock" --docker_stop_timeout="0ns"
>> --docker_store_dir="/tmp/mesos/store/docker"
>> --docker_volume_checkpoint_dir="/var/run/mesos/isolators/docker/volume"
>> --enforce_container_disk_quota="false" --executor_registration_timeout="1mins"
>> --executor_shutdown_grace_period="5secs" --fetcher_cache_dir="/tmp/Endp
>> oint_SlaveEndpointTest_NoAuthorizer_1_RAvVcr/fetch"
>> --fetcher_cache_size="2GB" --frameworks_home="" --gc_delay="1weeks"
>> --gc_disk_headroom="0.1" --hadoop_home="" --help="false"
>> --hostname_lookup="true" --http_authenticators="basic"
>> --http_command_executor="false" --http_credentials="/tmp/Endpo
>> int_SlaveEndpointTest_NoAuthorizer_1_RAvVcr/http_credentials"
>> --image_provisioner_backend="copy" --initialize_driver_logging="true"
>> --isolation="posix/cpu,posix/mem" --launcher="posix"
>> --launcher_dir="/mesos/mesos-1.1.0/_build/src" --logbufsecs="0"
>> --logging_level="INFO" --oversubscribed_resources_interval="15secs"
>> --perf_duration="10secs" --perf_interval="1mins"
>> --qos_correction_interval_min="0ns" --quiet="false" --recover="reconnect"
>> --recovery_timeout="15mins" --registration_backoff_factor="10ms"
>> --resources="cpus:2;gpus:0;mem:1024;disk:1024;ports:[31000-32000]"
>> --revocable_cpu_low_priority="true" --runtime_dir="/tmp/Endpoint_S
>> laveEndpointTest_NoAuthorizer_1_RAvVcr" --sandbox_directory="/mnt/mesos/sandbox"
>> --strict="true" --switch_user="true" --systemd_enable_support="true"
>> --systemd_runtime_directory="/run/systemd/system" --version="false"
>> --work_dir="/tmp/Endpoint_SlaveEndpointTest_NoAuthorizer_1_3Q3jvC"
>> I0930 17:28:55.472721 29123 credentials.hpp:86] Loading credential for
>> authentication from '/tmp/Endpoint_SlaveEndpointTe
>> st_NoAuthorizer_1_RAvVcr/credential'
>> I0930 17:28:55.472901 29123 slave.cpp:346] Agent using credential for:
>> test-principal
>> I0930 17:28:55.472929 29123 credentials.hpp:37] Loading credentials for
>> authentication from '/tmp/Endpoint_SlaveEndpointTe
>> st_NoAuthorizer_1_RAvVcr/http_credentials'
>> I0930 17:28:55.473207 29123 http.cpp:883] Using default 'basic' HTTP
>> authenticator for realm 'mesos-agent-readonly'
>> I0930 17:28:55.473479 29123 http.cpp:883] Using default 'basic' HTTP
>> authenticator for realm 'mesos-agent-readwrite'
>> I0930 17:28:55.474680 29123 slave.cpp:533] Agent resources: cpus(*):2;
>> mem(*):1024; disk(*):1024; ports(*):[31000-32000]
>> I0930 17:28:55.474781 29123 slave.cpp:541] Agent attributes: [  ]
>> I0930 17:28:55.474797 29123 slave.cpp:546] Agent hostname: 60dbce65f411
>> I0930 17:28:55.476287 29126 state.cpp:57] Recovering state from
>> '/tmp/Endpoint_SlaveEndpointTest_NoAuthorizer_1_3Q3jvC/meta'
>> I0930 17:28:55.476361 29123 process.cpp:3377] Handling HTTP event for
>> process 'slave(613)' with path: '/slave(613)/monitor/statistics.json'
>> I0930 17:28:55.476886 29120 status_update_manager.cpp:203] Recovering
>> status update manager
>> I0930 17:28:55.477128 29119 containerizer.cpp:580] Recovering containerizer
>> I0930 17:28:55.477499 29122 http.cpp:835] Authorizing principal
>> 'test-principal' to GET the '/monitor/statistics.json' endpoint
>> I0930 17:28:55.478744 29134 provisioner.cpp:253] Provisioner recovery
>> complete
>> I0930 17:28:55.479151 29122 slave.cpp:5256] Finished recovery
>> I0930 17:28:55.479667 29122 slave.cpp:5428] Querying resource estimator
>> for oversubscribable resources
>> I0930 17:28:55.480100 29125 slave.cpp:5442] Received oversubscribable
>> resources {} from the resource estimator
>> I0930 17:28:55.481637 29127 slave.cpp:787] Agent terminating
>> [       OK ] Endpoint/SlaveEndpointTest.NoAuthorizer/1 (24 ms)
>> [ RUN      ] Endpoint/SlaveEndpointTest.NoAuthorizer/2
>> I0930 17:28:55.492769 29100 containerizer.cpp:226] Using isolation:
>> posix/cpu,posix/mem,filesystem/posix,network/cni
>> W0930 17:28:55.493484 29100 backend.cpp:75] Failed to create 'aufs'
>> backend: AufsBackend requires root privileges, but is running as user mesos
>> W0930 17:28:55.493652 29100 backend.cpp:75] Failed to create 'bind'
>> backend: BindBackend requires root privileges
>> I0930 17:28:55.495154 29100 cluster.cpp:435] Creating default 'local'
>> authorizer
>> I0930 17:28:55.497175 29123 slave.cpp:208] Mesos agent started on (614)@
>> 172.17.0.2:41028
>> I0930 17:28:55.497210 29123 slave.cpp:209] Flags at startup: --acls=""
>> --appc_simple_discovery_uri_prefix="http://"
>> --appc_store_dir="/tmp/mesos/store/appc" --authenticate_http_readonly="true"
>> --authenticate_http_readwrite="true" --authenticatee="crammd5"
>> --authentication_backoff_factor="1secs" --authorizer="local"
>> --cgroups_cpu_enable_pids_and_tids_count="false"
>> --cgroups_enable_cfs="false" --cgroups_hierarchy="/sys/fs/cgroup"
>> --cgroups_limit_swap="false" --cgroups_root="mesos"
>> --container_disk_watch_interval="15secs" --containerizers="mesos"
>> --credential="/tmp/Endpoint_SlaveEndpointTest_NoAuthorizer_2_dd4qfI/credential"
>> --default_role="*" --disk_watch_interval="1mins" --docker="docker"
>> --docker_kill_orphans="true" --docker_registry="https://reg
>> istry-1.docker.io" --docker_remove_delay="6hrs"
>> --docker_socket="/var/run/docker.sock" --docker_stop_timeout="0ns"
>> --docker_store_dir="/tmp/mesos/store/docker"
>> --docker_volume_checkpoint_dir="/var/run/mesos/isolators/docker/volume"
>> --enforce_container_disk_quota="false" --executor_registration_timeout="1mins"
>> --executor_shutdown_grace_period="5secs" --fetcher_cache_dir="/tmp/Endp
>> oint_SlaveEndpointTest_NoAuthorizer_2_dd4qfI/fetch"
>> --fetcher_cache_size="2GB" --frameworks_home="" --gc_delay="1weeks"
>> --gc_disk_headroom="0.1" --hadoop_home="" --help="false"
>> --hostname_lookup="true" --http_authenticators="basic"
>> --http_command_executor="false" --http_credentials="/tmp/Endpo
>> int_SlaveEndpointTest_NoAuthorizer_2_dd4qfI/http_credentials"
>> --image_provisioner_backend="copy" --initialize_driver_logging="true"
>> --isolation="posix/cpu,posix/mem" --launcher="posix"
>> --launcher_dir="/mesos/mesos-1.1.0/_build/src" --logbufsecs="0"
>> --logging_level="INFO" --oversubscribed_resources_interval="15secs"
>> --perf_duration="10secs" --perf_interval="1mins"
>> --qos_correction_interval_min="0ns" --quiet="false" --recover="reconnect"
>> --recovery_timeout="15mins" --registration_backoff_factor="10ms"
>> --resources="cpus:2;gpus:0;mem:1024;disk:1024;ports:[31000-32000]"
>> --revocable_cpu_low_priority="true" --runtime_dir="/tmp/Endpoint_S
>> laveEndpointTest_NoAuthorizer_2_dd4qfI" --sandbox_directory="/mnt/mesos/sandbox"
>> --strict="true" --switch_user="true" --systemd_enable_support="true"
>> --systemd_runtime_directory="/run/systemd/system" --version="false"
>> --work_dir="/tmp/Endpoint_SlaveEndpointTest_NoAuthorizer_2_Nq8NtT"
>> I0930 17:28:55.497767 29123 credentials.hpp:86] Loading credential for
>> authentication from '/tmp/Endpoint_SlaveEndpointTe
>> st_NoAuthorizer_2_dd4qfI/credential'
>> I0930 17:28:55.497938 29123 slave.cpp:346] Agent using credential for:
>> test-principal
>> I0930 17:28:55.498000 29123 credentials.hpp:37] Loading credentials for
>> authentication from '/tmp/Endpoint_SlaveEndpointTe
>> st_NoAuthorizer_2_dd4qfI/http_credentials'
>> I0930 17:28:55.498340 29123 http.cpp:883] Using default 'basic' HTTP
>> authenticator for realm 'mesos-agent-readonly'
>> I0930 17:28:55.498497 29123 http.cpp:883] Using default 'basic' HTTP
>> authenticator for realm 'mesos-agent-readwrite'
>> I0930 17:28:55.499799 29123 slave.cpp:533] Agent resources: cpus(*):2;
>> mem(*):1024; disk(*):1024; ports(*):[31000-32000]
>> I0930 17:28:55.499904 29123 slave.cpp:541] Agent attributes: [  ]
>> I0930 17:28:55.499929 29123 slave.cpp:546] Agent hostname: 60dbce65f411
>> I0930 17:28:55.501405 29130 state.cpp:57] Recovering state from
>> '/tmp/Endpoint_SlaveEndpointTest_NoAuthorizer_2_Nq8NtT/meta'
>> I0930 17:28:55.501489 29123 process.cpp:3377] Handling HTTP event for
>> process 'slave(614)' with path: '/slave(614)/containers'
>> I0930 17:28:55.502269 29126 status_update_manager.cpp:203] Recovering
>> status update manager
>> I0930 17:28:55.502706 29119 containerizer.cpp:580] Recovering containerizer
>> I0930 17:28:55.502941 29131 http.cpp:835] Authorizing principal
>> 'test-principal' to GET the '/containers' endpoint
>> I0930 17:28:55.504288 29119 provisioner.cpp:253] Provisioner recovery
>> complete
>> I0930 17:28:55.504583 29132 slave.cpp:5256] Finished recovery
>> I0930 17:28:55.505182 29132 slave.cpp:5428] Querying resource estimator
>> for oversubscribable resources
>> I0930 17:28:55.505406 29128 slave.cpp:5442] Received oversubscribable
>> resources {} from the resource estimator
>> I0930 17:28:55.506906 29130 slave.cpp:787] Agent terminating
>> [       OK ] Endpoint/SlaveEndpointTest.NoAuthorizer/2 (24 ms)
>> [----------] 9 tests from Endpoint/SlaveEndpointTest (188 ms total)
>>
>> [----------] Global test environment tear-down
>> [==========] 1339 tests from 152 test cases ran. (431899 ms total)
>> [  PASSED  ] 1338 tests.
>> [  FAILED  ] 1 test, listed below:
>> [  FAILED  ] ReconciliationTest.SlaveInTransition
>>
>>  1 FAILED TEST
>>   YOU HAVE 6 DISABLED TESTS
>>
>> make[4]: Leaving directory `/mesos/mesos-1.1.0/_build/src'
>> make[4]: *** [check-local] Error 1
>> make[3]: *** [check-am] Error 2
>> make[3]: Leaving directory `/mesos/mesos-1.1.0/_build/src'
>> make[2]: *** [check] Error 2
>> make[2]: Leaving directory `/mesos/mesos-1.1.0/_build/src'
>> make[1]: *** [check-recursive] Error 1
>> make[1]: Leaving directory `/mesos/mesos-1.1.0/_build'
>> make: *** [distcheck] Error 1
>> + docker rmi mesos-1475254408-6330
>> Untagged: mesos-1475254408-6330:latest
>> Deleted: sha256:4cc589dc298080b62acb515504cde6a3ccfce64aa633dea18269a
>> 03340ce21a0
>> Deleted: sha256:8fa89048b11485bf8a2687c5cae84a70034af7c99ef950932ea4f
>> 0ba9f2ce7c2
>> Deleted: sha256:5390e5e568f082a39366e003ce8d8412175f47fe86a35d8d39e18
>> fe0055d0103
>> Deleted: sha256:fd68419b536bc798a81ab680751327522f9c440bd6f5c65c9edd1
>> e9c14585843
>> Deleted: sha256:2398d853216191a122a59c7206c3c822632cbe6f8df40863371ad
>> b00069ff337
>> Deleted: sha256:6865abd399a95b45b449bfdcb5e9d9bd620879c4f148e91779a8f
>> 64ba49b9c41
>> Deleted: sha256:3a4b171f4e4c3de475ac501baab270b5ea3d21d70f13426c20c2c
>> 9520a7e96b9
>> Deleted: sha256:eef12568c56dbd51317e2523f387d09f8d52508859535d04c9bc0
>> 3142b3e234a
>> Deleted: sha256:59de0a2cb81cc905b87861a5d9c674a0df722e186779606578a1f
>> 0be7ae35abe
>> Deleted: sha256:446f6679cd80246b40c2ac12d4d27f131f6ae49c7ff86ced3e135
>> afdca6652af
>> Deleted: sha256:0a91cc7060e6f24abda31d6b6a725b7f0706f4d632fbd70f65db0
>> 320abe264dc
>> Deleted: sha256:cef24bcaadb37d4142fd908ca51a953826099ebc6c43bc4d7477a
>> 10d49651490
>> Deleted: sha256:03daa76a0f344210551d45aa039c349f171ab1a579199e17ceddd
>> e1b23201f64
>> Deleted: sha256:3924f20c815b361acc6df25ca6ddc1b11ff3fba5175c15b50c2c5
>> 9563c3d4d35
>> Deleted: sha256:a85b91f18a5c0039746feddbc014c7cc47866c8022af5b6c5475b
>> c064a75fc3f
>> Deleted: sha256:6b0a02bd13af9f66c8ed8334e4edf069fc55152481141adc74e50
>> f8bf21e9e26
>> Deleted: sha256:cbc6a674f5e9e9de18cc5ffca020ed31121449654aa4960fd5afd
>> 71cc24dfd0a
>> Deleted: sha256:0a3630ba832e2826ad9016c2604273b57a6af3838ebe7420ea6b0
>> 5936b4a113f
>> Deleted: sha256:3414d95cb9cc716c3aafab0253536f1f0dbf24bfa5cc37c00809a
>> a96d1ba535f
>> Deleted: sha256:e74366c58dd72f7e040a9464e17ed921377b76ae946a8729c9f57
>> fb8a059872b
>> Deleted: sha256:c64a9643720ec14a3ebf8077af62dcab825569a5ae0a4a74470f9
>> 395a2e4decd
>> Deleted: sha256:478de2464acef777de19819774eba733771a5f6eba2d9f5ceac6c
>> 3edcaaadb09
>> Deleted: sha256:ffb194b67a51e6450c801fd33395ce6e3c29b669dbb0f7013cd94
>> 80d7dbea274
>> Deleted: sha256:e222735e12b7b67f72d8f180cdaea6fea1d3c1aabe190b2cbf952
>> 1a6a72fc703
>> Build step 'Execute shell' marked build as failure
>>


Mime
View raw message