mesos-builds mailing list archives

Site index · List index
Message view « Date » · « Thread »
Top « Date » · « Thread »
From Apache Jenkins Server <jenk...@builds.apache.org>
Subject Build failed in Jenkins: mesos-reviewbot #15508
Date Mon, 03 Oct 2016 18:41:56 GMT
See <https://builds.apache.org/job/mesos-reviewbot/15508/>

------------------------------------------
[...truncated 206202 lines...]
[       OK ] Endpoint/SlaveEndpointTest.AuthorizedRequest/0 (24 ms)
[ RUN      ] Endpoint/SlaveEndpointTest.AuthorizedRequest/1
I1003 18:40:11.483538 29109 containerizer.cpp:227] Using isolation: posix/cpu,posix/mem,filesystem/posix,network/cni
W1003 18:40:11.484266 29109 backend.cpp:75] Failed to create 'aufs' backend: AufsBackend requires
root privileges, but is running as user mesos
W1003 18:40:11.484470 29109 backend.cpp:75] Failed to create 'bind' backend: BindBackend requires
root privileges
I1003 18:40:11.488332 29134 slave.cpp:208] Mesos agent started on (608)@172.17.0.2:37320
I1003 18:40:11.488368 29134 slave.cpp:209] Flags at startup: --acls="" --appc_simple_discovery_uri_prefix="http://"
--appc_store_dir="/tmp/mesos/store/appc" --authenticate_http_readonly="true" --authenticate_http_readwrite="true"
--authenticatee="crammd5" --authentication_backoff_factor="1secs" --authorizer="local" --cgroups_cpu_enable_pids_and_tids_count="false"
--cgroups_enable_cfs="false" --cgroups_hierarchy="/sys/fs/cgroup" --cgroups_limit_swap="false"
--cgroups_root="mesos" --container_disk_watch_interval="15secs" --containerizers="mesos" --credential="/tmp/Endpoint_SlaveEndpointTest_AuthorizedRequest_1_MccH6H/credential"
--default_role="*" --disk_watch_interval="1mins" --docker="docker" --docker_kill_orphans="true"
--docker_registry="https://registry-1.docker.io" --docker_remove_delay="6hrs" --docker_socket="/var/run/docker.sock"
--docker_stop_timeout="0ns" --docker_store_dir="/tmp/mesos/store/docker" --docker_volume_checkpoint_dir="/var/run/mesos/isolators/docker/volume"
--enforce_container_disk_quota="false" --executor_registration_timeout="1mins" --executor_shutdown_grace_period="5secs"
--fetcher_cache_dir="/tmp/Endpoint_SlaveEndpointTest_AuthorizedRequest_1_MccH6H/fetch" --fetcher_cache_size="2GB"
--frameworks_home="" --gc_delay="1weeks" --gc_disk_headroom="0.1" --hadoop_home="" --help="true"
--hostname_lookup="true" --http_authenticators="basic" --http_command_executor="false" --http_credentials="/tmp/Endpoint_SlaveEndpointTest_AuthorizedRequest_1_MccH6H/http_credentials"
--image_provisioner_backend="copy" --initialize_driver_logging="true" --isolation="posix/cpu,posix/mem"
--launcher="posix" --launcher_dir="/mesos/mesos-1.1.0/_build/src" --logbufsecs="0" --logging_level="INFO"
--oversubscribed_resources_interval="15secs" --perf_duration="10secs" --perf_interval="1mins"
--qos_correction_interval_min="0ns" --quiet="false" --recover="reconnect" --recovery_timeout="15mins"
--registration_backoff_factor="10ms" --resources="cpus:2;gpus:0;mem:1024;disk:1024;ports:[31000-32000]"
--revocable_cpu_low_priority="true" --runtime_dir="/tmp/Endpoint_SlaveEndpointTest_AuthorizedRequest_1_MccH6H"
--sandbox_directory="/mnt/mesos/sandbox" --strict="true" --switch_user="true" --systemd_enable_support="true"
--systemd_runtime_directory="/run/systemd/system" --version="false" --work_dir="/tmp/Endpoint_SlaveEndpointTest_AuthorizedRequest_1_rxsuWX"
I1003 18:40:11.488807 29134 credentials.hpp:86] Loading credential for authentication from
'/tmp/Endpoint_SlaveEndpointTest_AuthorizedRequest_1_MccH6H/credential'
I1003 18:40:11.489006 29134 slave.cpp:346] Agent using credential for: test-principal
I1003 18:40:11.489027 29134 credentials.hpp:37] Loading credentials for authentication from
'/tmp/Endpoint_SlaveEndpointTest_AuthorizedRequest_1_MccH6H/http_credentials'
I1003 18:40:11.489302 29134 http.cpp:883] Using default 'basic' HTTP authenticator for realm
'mesos-agent-readonly'
I1003 18:40:11.489447 29134 http.cpp:883] Using default 'basic' HTTP authenticator for realm
'mesos-agent-readwrite'
I1003 18:40:11.490967 29134 slave.cpp:533] Agent resources: cpus(*):2; mem(*):1024; disk(*):1024;
ports(*):[31000-32000]
I1003 18:40:11.491086 29134 slave.cpp:541] Agent attributes: [  ]
I1003 18:40:11.491106 29134 slave.cpp:546] Agent hostname: 32fadd80554c
I1003 18:40:11.493036 29134 process.cpp:3377] Handling HTTP event for process 'slave(608)'
with path: '/slave(608)/monitor/statistics.json'
I1003 18:40:11.493113 29135 state.cpp:57] Recovering state from '/tmp/Endpoint_SlaveEndpointTest_AuthorizedRequest_1_rxsuWX/meta'
I1003 18:40:11.493546 29135 status_update_manager.cpp:203] Recovering status update manager
I1003 18:40:11.493768 29135 containerizer.cpp:581] Recovering containerizer
I1003 18:40:11.494519 29135 http.cpp:835] Authorizing principal 'test-principal' to GET the
'/monitor/statistics.json' endpoint
I1003 18:40:11.495486 29129 provisioner.cpp:253] Provisioner recovery complete
I1003 18:40:11.496090 29135 slave.cpp:5256] Finished recovery
I1003 18:40:11.496647 29135 slave.cpp:5428] Querying resource estimator for oversubscribable
resources
I1003 18:40:11.496959 29135 slave.cpp:5442] Received oversubscribable resources {} from the
resource estimator
I1003 18:40:11.499617 29143 slave.cpp:787] Agent terminating
[       OK ] Endpoint/SlaveEndpointTest.AuthorizedRequest/1 (26 ms)
[ RUN      ] Endpoint/SlaveEndpointTest.AuthorizedRequest/2
I1003 18:40:11.509943 29109 containerizer.cpp:227] Using isolation: posix/cpu,posix/mem,filesystem/posix,network/cni
W1003 18:40:11.510637 29109 backend.cpp:75] Failed to create 'aufs' backend: AufsBackend requires
root privileges, but is running as user mesos
W1003 18:40:11.510790 29109 backend.cpp:75] Failed to create 'bind' backend: BindBackend requires
root privileges
I1003 18:40:11.513876 29141 slave.cpp:208] Mesos agent started on (609)@172.17.0.2:37320
I1003 18:40:11.513913 29141 slave.cpp:209] Flags at startup: --acls="" --appc_simple_discovery_uri_prefix="http://"
--appc_store_dir="/tmp/mesos/store/appc" --authenticate_http_readonly="true" --authenticate_http_readwrite="true"
--authenticatee="crammd5" --authentication_backoff_factor="1secs" --authorizer="local" --cgroups_cpu_enable_pids_and_tids_count="false"
--cgroups_enable_cfs="false" --cgroups_hierarchy="/sys/fs/cgroup" --cgroups_limit_swap="false"
--cgroups_root="mesos" --container_disk_watch_interval="15secs" --containerizers="mesos" --credential="/tmp/Endpoint_SlaveEndpointTest_AuthorizedRequest_2_KR4o0G/credential"
--default_role="*" --disk_watch_interval="1mins" --docker="docker" --docker_kill_orphans="true"
--docker_registry="https://registry-1.docker.io" --docker_remove_delay="6hrs" --docker_socket="/var/run/docker.sock"
--docker_stop_timeout="0ns" --docker_store_dir="/tmp/mesos/store/docker" --docker_volume_checkpoint_dir="/var/run/mesos/isolators/docker/volume"
--enforce_container_disk_quota="false" --executor_registration_timeout="1mins" --executor_shutdown_grace_period="5secs"
--fetcher_cache_dir="/tmp/Endpoint_SlaveEndpointTest_AuthorizedRequest_2_KR4o0G/fetch" --fetcher_cache_size="2GB"
--frameworks_home="" --gc_delay="1weeks" --gc_disk_headroom="0.1" --hadoop_home="" --help="true"
--hostname_lookup="true" --http_authenticators="basic" --http_command_executor="false" --http_credentials="/tmp/Endpoint_SlaveEndpointTest_AuthorizedRequest_2_KR4o0G/http_credentials"
--image_provisioner_backend="copy" --initialize_driver_logging="true" --isolation="posix/cpu,posix/mem"
--launcher="posix" --launcher_dir="/mesos/mesos-1.1.0/_build/src" --logbufsecs="0" --logging_level="INFO"
--oversubscribed_resources_interval="15secs" --perf_duration="10secs" --perf_interval="1mins"
--qos_correction_interval_min="0ns" --quiet="false" --recover="reconnect" --recovery_timeout="15mins"
--registration_backoff_factor="10ms" --resources="cpus:2;gpus:0;mem:1024;disk:1024;ports:[31000-32000]"
--revocable_cpu_low_priority="true" --runtime_dir="/tmp/Endpoint_SlaveEndpointTest_AuthorizedRequest_2_KR4o0G"
--sandbox_directory="/mnt/mesos/sandbox" --strict="true" --switch_user="true" --systemd_enable_support="true"
--systemd_runtime_directory="/run/systemd/system" --version="false" --work_dir="/tmp/Endpoint_SlaveEndpointTest_AuthorizedRequest_2_PwQVLW"
I1003 18:40:11.514399 29141 credentials.hpp:86] Loading credential for authentication from
'/tmp/Endpoint_SlaveEndpointTest_AuthorizedRequest_2_KR4o0G/credential'
I1003 18:40:11.514588 29141 slave.cpp:346] Agent using credential for: test-principal
I1003 18:40:11.514613 29141 credentials.hpp:37] Loading credentials for authentication from
'/tmp/Endpoint_SlaveEndpointTest_AuthorizedRequest_2_KR4o0G/http_credentials'
I1003 18:40:11.514864 29141 http.cpp:883] Using default 'basic' HTTP authenticator for realm
'mesos-agent-readonly'
I1003 18:40:11.515002 29141 http.cpp:883] Using default 'basic' HTTP authenticator for realm
'mesos-agent-readwrite'
I1003 18:40:11.516155 29141 slave.cpp:533] Agent resources: cpus(*):2; mem(*):1024; disk(*):1024;
ports(*):[31000-32000]
I1003 18:40:11.516235 29141 slave.cpp:541] Agent attributes: [  ]
I1003 18:40:11.516247 29141 slave.cpp:546] Agent hostname: 32fadd80554c
I1003 18:40:11.517742 29139 state.cpp:57] Recovering state from '/tmp/Endpoint_SlaveEndpointTest_AuthorizedRequest_2_PwQVLW/meta'
I1003 18:40:11.517885 29141 process.cpp:3377] Handling HTTP event for process 'slave(609)'
with path: '/slave(609)/containers'
I1003 18:40:11.518376 29140 status_update_manager.cpp:203] Recovering status update manager
I1003 18:40:11.518671 29140 containerizer.cpp:581] Recovering containerizer
I1003 18:40:11.519305 29132 http.cpp:835] Authorizing principal 'test-principal' to GET the
'/containers' endpoint
I1003 18:40:11.520222 29140 provisioner.cpp:253] Provisioner recovery complete
I1003 18:40:11.520474 29129 slave.cpp:5256] Finished recovery
I1003 18:40:11.521045 29129 slave.cpp:5428] Querying resource estimator for oversubscribable
resources
I1003 18:40:11.521378 29137 slave.cpp:5442] Received oversubscribable resources {} from the
resource estimator
I1003 18:40:11.522917 29135 slave.cpp:787] Agent terminating
[       OK ] Endpoint/SlaveEndpointTest.AuthorizedRequest/2 (23 ms)
[ RUN      ] Endpoint/SlaveEndpointTest.UnauthorizedRequest/0
I1003 18:40:11.535274 29109 containerizer.cpp:227] Using isolation: posix/cpu,posix/mem,filesystem/posix,network/cni
W1003 18:40:11.535938 29109 backend.cpp:75] Failed to create 'aufs' backend: AufsBackend requires
root privileges, but is running as user mesos
W1003 18:40:11.536108 29109 backend.cpp:75] Failed to create 'bind' backend: BindBackend requires
root privileges
I1003 18:40:11.539551 29129 slave.cpp:208] Mesos agent started on (610)@172.17.0.2:37320
I1003 18:40:11.539575 29129 slave.cpp:209] Flags at startup: --acls="" --appc_simple_discovery_uri_prefix="http://"
--appc_store_dir="/tmp/mesos/store/appc" --authenticate_http_readonly="true" --authenticate_http_readwrite="true"
--authenticatee="crammd5" --authentication_backoff_factor="1secs" --authorizer="local" --cgroups_cpu_enable_pids_and_tids_count="false"
--cgroups_enable_cfs="false" --cgroups_hierarchy="/sys/fs/cgroup" --cgroups_limit_swap="false"
--cgroups_root="mesos" --container_disk_watch_interval="15secs" --containerizers="mesos" --credential="/tmp/Endpoint_SlaveEndpointTest_UnauthorizedRequest_0_UdY99F/credential"
--default_role="*" --disk_watch_interval="1mins" --docker="docker" --docker_kill_orphans="true"
--docker_registry="https://registry-1.docker.io" --docker_remove_delay="6hrs" --docker_socket="/var/run/docker.sock"
--docker_stop_timeout="0ns" --docker_store_dir="/tmp/mesos/store/docker" --docker_volume_checkpoint_dir="/var/run/mesos/isolators/docker/volume"
--enforce_container_disk_quota="false" --executor_registration_timeout="1mins" --executor_shutdown_grace_period="5secs"
--fetcher_cache_dir="/tmp/Endpoint_SlaveEndpointTest_UnauthorizedRequest_0_UdY99F/fetch" --fetcher_cache_size="2GB"
--frameworks_home="" --gc_delay="1weeks" --gc_disk_headroom="0.1" --hadoop_home="" --help="true"
--hostname_lookup="true" --http_authenticators="basic" --http_command_executor="false" --http_credentials="/tmp/Endpoint_SlaveEndpointTest_UnauthorizedRequest_0_UdY99F/http_credentials"
--image_provisioner_backend="copy" --initialize_driver_logging="true" --isolation="posix/cpu,posix/mem"
--launcher="posix" --launcher_dir="/mesos/mesos-1.1.0/_build/src" --logbufsecs="0" --logging_level="INFO"
--oversubscribed_resources_interval="15secs" --perf_duration="10secs" --perf_interval="1mins"
--qos_correction_interval_min="0ns" --quiet="false" --recover="reconnect" --recovery_timeout="15mins"
--registration_backoff_factor="10ms" --resources="cpus:2;gpus:0;mem:1024;disk:1024;ports:[31000-32000]"
--revocable_cpu_low_priority="true" --runtime_dir="/tmp/Endpoint_SlaveEndpointTest_UnauthorizedRequest_0_UdY99F"
--sandbox_directory="/mnt/mesos/sandbox" --strict="true" --switch_user="true" --systemd_enable_support="true"
--systemd_runtime_directory="/run/systemd/system" --version="false" --work_dir="/tmp/Endpoint_SlaveEndpointTest_UnauthorizedRequest_0_n3gzRV"
I1003 18:40:11.540169 29129 credentials.hpp:86] Loading credential for authentication from
'/tmp/Endpoint_SlaveEndpointTest_UnauthorizedRequest_0_UdY99F/credential'
I1003 18:40:11.540366 29129 slave.cpp:346] Agent using credential for: test-principal
I1003 18:40:11.540391 29129 credentials.hpp:37] Loading credentials for authentication from
'/tmp/Endpoint_SlaveEndpointTest_UnauthorizedRequest_0_UdY99F/http_credentials'
I1003 18:40:11.540704 29129 http.cpp:883] Using default 'basic' HTTP authenticator for realm
'mesos-agent-readonly'
I1003 18:40:11.540865 29129 http.cpp:883] Using default 'basic' HTTP authenticator for realm
'mesos-agent-readwrite'
I1003 18:40:11.542213 29129 slave.cpp:533] Agent resources: cpus(*):2; mem(*):1024; disk(*):1024;
ports(*):[31000-32000]
I1003 18:40:11.542330 29129 slave.cpp:541] Agent attributes: [  ]
I1003 18:40:11.542353 29129 slave.cpp:546] Agent hostname: 32fadd80554c
I1003 18:40:11.544572 29129 process.cpp:3377] Handling HTTP event for process 'slave(610)'
with path: '/slave(610)/monitor/statistics'
I1003 18:40:11.545881 29129 state.cpp:57] Recovering state from '/tmp/Endpoint_SlaveEndpointTest_UnauthorizedRequest_0_n3gzRV/meta'
I1003 18:40:11.546418 29142 status_update_manager.cpp:203] Recovering status update manager
I1003 18:40:11.546691 29138 containerizer.cpp:581] Recovering containerizer
I1003 18:40:11.547390 29141 http.cpp:835] Authorizing principal 'test-principal' to GET the
'/monitor/statistics' endpoint
I1003 18:40:11.548641 29137 provisioner.cpp:253] Provisioner recovery complete
I1003 18:40:11.548993 29142 slave.cpp:5256] Finished recovery
I1003 18:40:11.549573 29142 slave.cpp:5428] Querying resource estimator for oversubscribable
resources
I1003 18:40:11.550300 29142 slave.cpp:5442] Received oversubscribable resources {} from the
resource estimator
I1003 18:40:11.552907 29133 slave.cpp:787] Agent terminating
[       OK ] Endpoint/SlaveEndpointTest.UnauthorizedRequest/0 (38 ms)
[ RUN      ] Endpoint/SlaveEndpointTest.UnauthorizedRequest/1
I1003 18:40:11.572942 29109 containerizer.cpp:227] Using isolation: posix/cpu,posix/mem,filesystem/posix,network/cni
W1003 18:40:11.573930 29109 backend.cpp:75] Failed to create 'aufs' backend: AufsBackend requires
root privileges, but is running as user mesos
W1003 18:40:11.574136 29109 backend.cpp:75] Failed to create 'bind' backend: BindBackend requires
root privileges
I1003 18:40:11.578552 29139 slave.cpp:208] Mesos agent started on (611)@172.17.0.2:37320
I1003 18:40:11.578593 29139 slave.cpp:209] Flags at startup: --acls="" --appc_simple_discovery_uri_prefix="http://"
--appc_store_dir="/tmp/mesos/store/appc" --authenticate_http_readonly="true" --authenticate_http_readwrite="true"
--authenticatee="crammd5" --authentication_backoff_factor="1secs" --authorizer="local" --cgroups_cpu_enable_pids_and_tids_count="false"
--cgroups_enable_cfs="false" --cgroups_hierarchy="/sys/fs/cgroup" --cgroups_limit_swap="false"
--cgroups_root="mesos" --container_disk_watch_interval="15secs" --containerizers="mesos" --credential="/tmp/Endpoint_SlaveEndpointTest_UnauthorizedRequest_1_8kvUGF/credential"
--default_role="*" --disk_watch_interval="1mins" --docker="docker" --docker_kill_orphans="true"
--docker_registry="https://registry-1.docker.io" --docker_remove_delay="6hrs" --docker_socket="/var/run/docker.sock"
--docker_stop_timeout="0ns" --docker_store_dir="/tmp/mesos/store/docker" --docker_volume_checkpoint_dir="/var/run/mesos/isolators/docker/volume"
--enforce_container_disk_quota="false" --executor_registration_timeout="1mins" --executor_shutdown_grace_period="5secs"
--fetcher_cache_dir="/tmp/Endpoint_SlaveEndpointTest_UnauthorizedRequest_1_8kvUGF/fetch" --fetcher_cache_size="2GB"
--frameworks_home="" --gc_delay="1weeks" --gc_disk_headroom="0.1" --hadoop_home="" --help="true"
--hostname_lookup="true" --http_authenticators="basic" --http_command_executor="false" --http_credentials="/tmp/Endpoint_SlaveEndpointTest_UnauthorizedRequest_1_8kvUGF/http_credentials"
--image_provisioner_backend="copy" --initialize_driver_logging="true" --isolation="posix/cpu,posix/mem"
--launcher="posix" --launcher_dir="/mesos/mesos-1.1.0/_build/src" --logbufsecs="0" --logging_level="INFO"
--oversubscribed_resources_interval="15secs" --perf_duration="10secs" --perf_interval="1mins"
--qos_correction_interval_min="0ns" --quiet="false" --recover="reconnect" --recovery_timeout="15mins"
--registration_backoff_factor="10ms" --resources="cpus:2;gpus:0;mem:1024;disk:1024;ports:[31000-32000]"
--revocable_cpu_low_priority="true" --runtime_dir="/tmp/Endpoint_SlaveEndpointTest_UnauthorizedRequest_1_8kvUGF"
--sandbox_directory="/mnt/mesos/sandbox" --strict="true" --switch_user="true" --systemd_enable_support="true"
--systemd_runtime_directory="/run/systemd/system" --version="false" --work_dir="/tmp/Endpoint_SlaveEndpointTest_UnauthorizedRequest_1_b4ChiV"
I1003 18:40:11.579325 29139 credentials.hpp:86] Loading credential for authentication from
'/tmp/Endpoint_SlaveEndpointTest_UnauthorizedRequest_1_8kvUGF/credential'
I1003 18:40:11.579583 29139 slave.cpp:346] Agent using credential for: test-principal
I1003 18:40:11.579612 29139 credentials.hpp:37] Loading credentials for authentication from
'/tmp/Endpoint_SlaveEndpointTest_UnauthorizedRequest_1_8kvUGF/http_credentials'
I1003 18:40:11.579941 29139 http.cpp:883] Using default 'basic' HTTP authenticator for realm
'mesos-agent-readonly'
I1003 18:40:11.580109 29139 http.cpp:883] Using default 'basic' HTTP authenticator for realm
'mesos-agent-readwrite'
I1003 18:40:11.581614 29139 slave.cpp:533] Agent resources: cpus(*):2; mem(*):1024; disk(*):1024;
ports(*):[31000-32000]
I1003 18:40:11.581738 29139 slave.cpp:541] Agent attributes: [  ]
I1003 18:40:11.581760 29139 slave.cpp:546] Agent hostname: 32fadd80554c
I1003 18:40:11.583865 29132 state.cpp:57] Recovering state from '/tmp/Endpoint_SlaveEndpointTest_UnauthorizedRequest_1_b4ChiV/meta'
I1003 18:40:11.583988 29139 process.cpp:3377] Handling HTTP event for process 'slave(611)'
with path: '/slave(611)/monitor/statistics.json'
I1003 18:40:11.584812 29136 status_update_manager.cpp:203] Recovering status update manager
I1003 18:40:11.584995 29129 containerizer.cpp:581] Recovering containerizer
I1003 18:40:11.585629 29140 http.cpp:835] Authorizing principal 'test-principal' to GET the
'/monitor/statistics.json' endpoint
I1003 18:40:11.587352 29134 provisioner.cpp:253] Provisioner recovery complete
I1003 18:40:11.588089 29140 slave.cpp:5256] Finished recovery
I1003 18:40:11.588832 29140 slave.cpp:5428] Querying resource estimator for oversubscribable
resources
I1003 18:40:11.589243 29140 slave.cpp:787] Agent terminating
[       OK ] Endpoint/SlaveEndpointTest.UnauthorizedRequest/1 (27 ms)
[ RUN      ] Endpoint/SlaveEndpointTest.UnauthorizedRequest/2
I1003 18:40:11.599922 29109 containerizer.cpp:227] Using isolation: posix/cpu,posix/mem,filesystem/posix,network/cni
W1003 18:40:11.600569 29109 backend.cpp:75] Failed to create 'aufs' backend: AufsBackend requires
root privileges, but is running as user mesos
W1003 18:40:11.600734 29109 backend.cpp:75] Failed to create 'bind' backend: BindBackend requires
root privileges
I1003 18:40:11.604063 29134 slave.cpp:208] Mesos agent started on (612)@172.17.0.2:37320
I1003 18:40:11.604105 29134 slave.cpp:209] Flags at startup: --acls="" --appc_simple_discovery_uri_prefix="http://"
--appc_store_dir="/tmp/mesos/store/appc" --authenticate_http_readonly="true" --authenticate_http_readwrite="true"
--authenticatee="crammd5" --authentication_backoff_factor="1secs" --authorizer="local" --cgroups_cpu_enable_pids_and_tids_count="false"
--cgroups_enable_cfs="false" --cgroups_hierarchy="/sys/fs/cgroup" --cgroups_limit_swap="false"
--cgroups_root="mesos" --container_disk_watch_interval="15secs" --containerizers="mesos" --credential="/tmp/Endpoint_SlaveEndpointTest_UnauthorizedRequest_2_6F7wxF/credential"
--default_role="*" --disk_watch_interval="1mins" --docker="docker" --docker_kill_orphans="true"
--docker_registry="https://registry-1.docker.io" --docker_remove_delay="6hrs" --docker_socket="/var/run/docker.sock"
--docker_stop_timeout="0ns" --docker_store_dir="/tmp/mesos/store/docker" --docker_volume_checkpoint_dir="/var/run/mesos/isolators/docker/volume"
--enforce_container_disk_quota="false" --executor_registration_timeout="1mins" --executor_shutdown_grace_period="5secs"
--fetcher_cache_dir="/tmp/Endpoint_SlaveEndpointTest_UnauthorizedRequest_2_6F7wxF/fetch" --fetcher_cache_size="2GB"
--frameworks_home="" --gc_delay="1weeks" --gc_disk_headroom="0.1" --hadoop_home="" --help="true"
--hostname_lookup="true" --http_authenticators="basic" --http_command_executor="false" --http_credentials="/tmp/Endpoint_SlaveEndpointTest_UnauthorizedRequest_2_6F7wxF/http_credentials"
--image_provisioner_backend="copy" --initialize_driver_logging="true" --isolation="posix/cpu,posix/mem"
--launcher="posix" --launcher_dir="/mesos/mesos-1.1.0/_build/src" --logbufsecs="0" --logging_level="INFO"
--oversubscribed_resources_interval="15secs" --perf_duration="10secs" --perf_interval="1mins"
--qos_correction_interval_min="0ns" --quiet="false" --recover="reconnect" --recovery_timeout="15mins"
--registration_backoff_factor="10ms" --resources="cpus:2;gpus:0;mem:1024;disk:1024;ports:[31000-32000]"
--revocable_cpu_low_priority="true" --runtime_dir="/tmp/Endpoint_SlaveEndpointTest_UnauthorizedRequest_2_6F7wxF"
--sandbox_directory="/mnt/mesos/sandbox" --strict="true" --switch_user="true" --systemd_enable_support="true"
--systemd_runtime_directory="/run/systemd/system" --version="false" --work_dir="/tmp/Endpoint_SlaveEndpointTest_UnauthorizedRequest_2_loqr4U"
I1003 18:40:11.604825 29134 credentials.hpp:86] Loading credential for authentication from
'/tmp/Endpoint_SlaveEndpointTest_UnauthorizedRequest_2_6F7wxF/credential'
I1003 18:40:11.605062 29134 slave.cpp:346] Agent using credential for: test-principal
I1003 18:40:11.605084 29134 credentials.hpp:37] Loading credentials for authentication from
'/tmp/Endpoint_SlaveEndpointTest_UnauthorizedRequest_2_6F7wxF/http_credentials'
I1003 18:40:11.605404 29134 http.cpp:883] Using default 'basic' HTTP authenticator for realm
'mesos-agent-readonly'
I1003 18:40:11.605569 29134 http.cpp:883] Using default 'basic' HTTP authenticator for realm
'mesos-agent-readwrite'
I1003 18:40:11.607110 29134 slave.cpp:533] Agent resources: cpus(*):2; mem(*):1024; disk(*):1024;
ports(*):[31000-32000]
I1003 18:40:11.607199 29134 slave.cpp:541] Agent attributes: [  ]
I1003 18:40:11.607221 29134 slave.cpp:546] Agent hostname: 32fadd80554c
I1003 18:40:11.608731 29129 state.cpp:57] Recovering state from '/tmp/Endpoint_SlaveEndpointTest_UnauthorizedRequest_2_loqr4U/meta'
I1003 18:40:11.608964 29135 status_update_manager.cpp:203] Recovering status update manager
I1003 18:40:11.609172 29132 containerizer.cpp:581] Recovering containerizer
I1003 18:40:11.610395 29136 provisioner.cpp:253] Provisioner recovery complete
I1003 18:40:11.610755 29142 slave.cpp:5256] Finished recovery
I1003 18:40:11.611419 29142 slave.cpp:5428] Querying resource estimator for oversubscribable
resources
I1003 18:40:11.611693 29139 slave.cpp:5442] Received oversubscribable resources {} from the
resource estimator
I1003 18:40:11.614795 29143 process.cpp:3377] Handling HTTP event for process 'slave(612)'
with path: '/slave(612)/containers'
I1003 18:40:11.615753 29135 http.cpp:835] Authorizing principal 'test-principal' to GET the
'/containers' endpoint
I1003 18:40:11.623451 29141 slave.cpp:787] Agent terminating
[       OK ] Endpoint/SlaveEndpointTest.UnauthorizedRequest/2 (34 ms)
[ RUN      ] Endpoint/SlaveEndpointTest.NoAuthorizer/0
I1003 18:40:11.634011 29109 containerizer.cpp:227] Using isolation: posix/cpu,posix/mem,filesystem/posix,network/cni
W1003 18:40:11.634671 29109 backend.cpp:75] Failed to create 'aufs' backend: AufsBackend requires
root privileges, but is running as user mesos
W1003 18:40:11.634832 29109 backend.cpp:75] Failed to create 'bind' backend: BindBackend requires
root privileges
I1003 18:40:11.636209 29109 cluster.cpp:435] Creating default 'local' authorizer
I1003 18:40:11.638280 29138 slave.cpp:208] Mesos agent started on (613)@172.17.0.2:37320
I1003 18:40:11.638310 29138 slave.cpp:209] Flags at startup: --acls="" --appc_simple_discovery_uri_prefix="http://"
--appc_store_dir="/tmp/mesos/store/appc" --authenticate_http_readonly="true" --authenticate_http_readwrite="true"
--authenticatee="crammd5" --authentication_backoff_factor="1secs" --authorizer="local" --cgroups_cpu_enable_pids_and_tids_count="false"
--cgroups_enable_cfs="false" --cgroups_hierarchy="/sys/fs/cgroup" --cgroups_limit_swap="false"
--cgroups_root="mesos" --container_disk_watch_interval="15secs" --containerizers="mesos" --credential="/tmp/Endpoint_SlaveEndpointTest_NoAuthorizer_0_gFVvIF/credential"
--default_role="*" --disk_watch_interval="1mins" --docker="docker" --docker_kill_orphans="true"
--docker_registry="https://registry-1.docker.io" --docker_remove_delay="6hrs" --docker_socket="/var/run/docker.sock"
--docker_stop_timeout="0ns" --docker_store_dir="/tmp/mesos/store/docker" --docker_volume_checkpoint_dir="/var/run/mesos/isolators/docker/volume"
--enforce_container_disk_quota="false" --executor_registration_timeout="1mins" --executor_shutdown_grace_period="5secs"
--fetcher_cache_dir="/tmp/Endpoint_SlaveEndpointTest_NoAuthorizer_0_gFVvIF/fetch" --fetcher_cache_size="2GB"
--frameworks_home="" --gc_delay="1weeks" --gc_disk_headroom="0.1" --hadoop_home="" --help="false"
--hostname_lookup="true" --http_authenticators="basic" --http_command_executor="false" --http_credentials="/tmp/Endpoint_SlaveEndpointTest_NoAuthorizer_0_gFVvIF/http_credentials"
--image_provisioner_backend="copy" --initialize_driver_logging="true" --isolation="posix/cpu,posix/mem"
--launcher="posix" --launcher_dir="/mesos/mesos-1.1.0/_build/src" --logbufsecs="0" --logging_level="INFO"
--oversubscribed_resources_interval="15secs" --perf_duration="10secs" --perf_interval="1mins"
--qos_correction_interval_min="0ns" --quiet="false" --recover="reconnect" --recovery_timeout="15mins"
--registration_backoff_factor="10ms" --resources="cpus:2;gpus:0;mem:1024;disk:1024;ports:[31000-32000]"
--revocable_cpu_low_priority="true" --runtime_dir="/tmp/Endpoint_SlaveEndpointTest_NoAuthorizer_0_gFVvIF"
--sandbox_directory="/mnt/mesos/sandbox" --strict="true" --switch_user="true" --systemd_enable_support="true"
--systemd_runtime_directory="/run/systemd/system" --version="false" --work_dir="/tmp/Endpoint_SlaveEndpointTest_NoAuthorizer_0_3puR9U"
I1003 18:40:11.639027 29138 credentials.hpp:86] Loading credential for authentication from
'/tmp/Endpoint_SlaveEndpointTest_NoAuthorizer_0_gFVvIF/credential'
I1003 18:40:11.639276 29138 slave.cpp:346] Agent using credential for: test-principal
I1003 18:40:11.639353 29138 credentials.hpp:37] Loading credentials for authentication from
'/tmp/Endpoint_SlaveEndpointTest_NoAuthorizer_0_gFVvIF/http_credentials'
I1003 18:40:11.639684 29138 http.cpp:883] Using default 'basic' HTTP authenticator for realm
'mesos-agent-readonly'
I1003 18:40:11.647146 29138 http.cpp:883] Using default 'basic' HTTP authenticator for realm
'mesos-agent-readwrite'
I1003 18:40:11.648792 29138 slave.cpp:533] Agent resources: cpus(*):2; mem(*):1024; disk(*):1024;
ports(*):[31000-32000]
I1003 18:40:11.648890 29138 slave.cpp:541] Agent attributes: [  ]
I1003 18:40:11.648913 29138 slave.cpp:546] Agent hostname: 32fadd80554c
I1003 18:40:11.650650 29128 state.cpp:57] Recovering state from '/tmp/Endpoint_SlaveEndpointTest_NoAuthorizer_0_3puR9U/meta'
I1003 18:40:11.650714 29138 process.cpp:3377] Handling HTTP event for process 'slave(613)'
with path: '/slave(613)/monitor/statistics'
I1003 18:40:11.651324 29128 status_update_manager.cpp:203] Recovering status update manager
I1003 18:40:11.651558 29138 containerizer.cpp:581] Recovering containerizer
I1003 18:40:11.651928 29141 http.cpp:835] Authorizing principal 'test-principal' to GET the
'/monitor/statistics' endpoint
I1003 18:40:11.654474 29143 provisioner.cpp:253] Provisioner recovery complete
I1003 18:40:11.655166 29138 slave.cpp:5256] Finished recovery
I1003 18:40:11.657250 29138 slave.cpp:5428] Querying resource estimator for oversubscribable
resources
I1003 18:40:11.657388 29138 slave.cpp:787] Agent terminating
[       OK ] Endpoint/SlaveEndpointTest.NoAuthorizer/0 (33 ms)
[ RUN      ] Endpoint/SlaveEndpointTest.NoAuthorizer/1
I1003 18:40:11.667862 29109 containerizer.cpp:227] Using isolation: posix/cpu,posix/mem,filesystem/posix,network/cni
W1003 18:40:11.669163 29109 backend.cpp:75] Failed to create 'aufs' backend: AufsBackend requires
root privileges, but is running as user mesos
W1003 18:40:11.669334 29109 backend.cpp:75] Failed to create 'bind' backend: BindBackend requires
root privileges
I1003 18:40:11.670855 29109 cluster.cpp:435] Creating default 'local' authorizer
I1003 18:40:11.672991 29135 slave.cpp:208] Mesos agent started on (614)@172.17.0.2:37320
I1003 18:40:11.673022 29135 slave.cpp:209] Flags at startup: --acls="" --appc_simple_discovery_uri_prefix="http://"
--appc_store_dir="/tmp/mesos/store/appc" --authenticate_http_readonly="true" --authenticate_http_readwrite="true"
--authenticatee="crammd5" --authentication_backoff_factor="1secs" --authorizer="local" --cgroups_cpu_enable_pids_and_tids_count="false"
--cgroups_enable_cfs="false" --cgroups_hierarchy="/sys/fs/cgroup" --cgroups_limit_swap="false"
--cgroups_root="mesos" --container_disk_watch_interval="15secs" --containerizers="mesos" --credential="/tmp/Endpoint_SlaveEndpointTest_NoAuthorizer_1_wpfPgG/credential"
--default_role="*" --disk_watch_interval="1mins" --docker="docker" --docker_kill_orphans="true"
--docker_registry="https://registry-1.docker.io" --docker_remove_delay="6hrs" --docker_socket="/var/run/docker.sock"
--docker_stop_timeout="0ns" --docker_store_dir="/tmp/mesos/store/docker" --docker_volume_checkpoint_dir="/var/run/mesos/isolators/docker/volume"
--enforce_container_disk_quota="false" --executor_registration_timeout="1mins" --executor_shutdown_grace_period="5secs"
--fetcher_cache_dir="/tmp/Endpoint_SlaveEndpointTest_NoAuthorizer_1_wpfPgG/fetch" --fetcher_cache_size="2GB"
--frameworks_home="" --gc_delay="1weeks" --gc_disk_headroom="0.1" --hadoop_home="" --help="false"
--hostname_lookup="true" --http_authenticators="basic" --http_command_executor="false" --http_credentials="/tmp/Endpoint_SlaveEndpointTest_NoAuthorizer_1_wpfPgG/http_credentials"
--image_provisioner_backend="copy" --initialize_driver_logging="true" --isolation="posix/cpu,posix/mem"
--launcher="posix" --launcher_dir="/mesos/mesos-1.1.0/_build/src" --logbufsecs="0" --logging_level="INFO"
--oversubscribed_resources_interval="15secs" --perf_duration="10secs" --perf_interval="1mins"
--qos_correction_interval_min="0ns" --quiet="false" --recover="reconnect" --recovery_timeout="15mins"
--registration_backoff_factor="10ms" --resources="cpus:2;gpus:0;mem:1024;disk:1024;ports:[31000-32000]"
--revocable_cpu_low_priority="true" --runtime_dir="/tmp/Endpoint_SlaveEndpointTest_NoAuthorizer_1_wpfPgG"
--sandbox_directory="/mnt/mesos/sandbox" --strict="true" --switch_user="true" --systemd_enable_support="true"
--systemd_runtime_directory="/run/systemd/system" --version="false" --work_dir="/tmp/Endpoint_SlaveEndpointTest_NoAuthorizer_1_naoNCV"
I1003 18:40:11.673671 29135 credentials.hpp:86] Loading credential for authentication from
'/tmp/Endpoint_SlaveEndpointTest_NoAuthorizer_1_wpfPgG/credential'
I1003 18:40:11.673918 29135 slave.cpp:346] Agent using credential for: test-principal
I1003 18:40:11.673946 29135 credentials.hpp:37] Loading credentials for authentication from
'/tmp/Endpoint_SlaveEndpointTest_NoAuthorizer_1_wpfPgG/http_credentials'
I1003 18:40:11.674260 29135 http.cpp:883] Using default 'basic' HTTP authenticator for realm
'mesos-agent-readonly'
I1003 18:40:11.674453 29135 http.cpp:883] Using default 'basic' HTTP authenticator for realm
'mesos-agent-readwrite'
I1003 18:40:11.675889 29135 slave.cpp:533] Agent resources: cpus(*):2; mem(*):1024; disk(*):1024;
ports(*):[31000-32000]
I1003 18:40:11.676012 29135 slave.cpp:541] Agent attributes: [  ]
I1003 18:40:11.676034 29135 slave.cpp:546] Agent hostname: 32fadd80554c
I1003 18:40:11.678603 29133 state.cpp:57] Recovering state from '/tmp/Endpoint_SlaveEndpointTest_NoAuthorizer_1_naoNCV/meta'
I1003 18:40:11.678900 29135 process.cpp:3377] Handling HTTP event for process 'slave(614)'
with path: '/slave(614)/monitor/statistics.json'
I1003 18:40:11.680115 29129 status_update_manager.cpp:203] Recovering status update manager
I1003 18:40:11.680330 29129 containerizer.cpp:581] Recovering containerizer
I1003 18:40:11.681352 29143 http.cpp:835] Authorizing principal 'test-principal' to GET the
'/monitor/statistics.json' endpoint
I1003 18:40:11.684259 29143 provisioner.cpp:253] Provisioner recovery complete
I1003 18:40:11.684852 29128 slave.cpp:5256] Finished recovery
I1003 18:40:11.685542 29128 slave.cpp:5428] Querying resource estimator for oversubscribable
resources
I1003 18:40:11.685853 29128 slave.cpp:5442] Received oversubscribable resources {} from the
resource estimator
I1003 18:40:11.689481 29109 slave.cpp:787] Agent terminating
[       OK ] Endpoint/SlaveEndpointTest.NoAuthorizer/1 (35 ms)
[ RUN      ] Endpoint/SlaveEndpointTest.NoAuthorizer/2
I1003 18:40:11.704617 29109 containerizer.cpp:227] Using isolation: posix/cpu,posix/mem,filesystem/posix,network/cni
W1003 18:40:11.705545 29109 backend.cpp:75] Failed to create 'aufs' backend: AufsBackend requires
root privileges, but is running as user mesos
W1003 18:40:11.705720 29109 backend.cpp:75] Failed to create 'bind' backend: BindBackend requires
root privileges
I1003 18:40:11.712499 29109 cluster.cpp:435] Creating default 'local' authorizer
I1003 18:40:11.714408 29131 slave.cpp:208] Mesos agent started on (615)@172.17.0.2:37320
I1003 18:40:11.714435 29131 slave.cpp:209] Flags at startup: --acls="" --appc_simple_discovery_uri_prefix="http://"
--appc_store_dir="/tmp/mesos/store/appc" --authenticate_http_readonly="true" --authenticate_http_readwrite="true"
--authenticatee="crammd5" --authentication_backoff_factor="1secs" --authorizer="local" --cgroups_cpu_enable_pids_and_tids_count="false"
--cgroups_enable_cfs="false" --cgroups_hierarchy="/sys/fs/cgroup" --cgroups_limit_swap="false"
--cgroups_root="mesos" --container_disk_watch_interval="15secs" --containerizers="mesos" --credential="/tmp/Endpoint_SlaveEndpointTest_NoAuthorizer_2_APqobH/credential"
--default_role="*" --disk_watch_interval="1mins" --docker="docker" --docker_kill_orphans="true"
--docker_registry="https://registry-1.docker.io" --docker_remove_delay="6hrs" --docker_socket="/var/run/docker.sock"
--docker_stop_timeout="0ns" --docker_store_dir="/tmp/mesos/store/docker" --docker_volume_checkpoint_dir="/var/run/mesos/isolators/docker/volume"
--enforce_container_disk_quota="false" --executor_registration_timeout="1mins" --executor_shutdown_grace_period="5secs"
--fetcher_cache_dir="/tmp/Endpoint_SlaveEndpointTest_NoAuthorizer_2_APqobH/fetch" --fetcher_cache_size="2GB"
--frameworks_home="" --gc_delay="1weeks" --gc_disk_headroom="0.1" --hadoop_home="" --help="false"
--hostname_lookup="true" --http_authenticators="basic" --http_command_executor="false" --http_credentials="/tmp/Endpoint_SlaveEndpointTest_NoAuthorizer_2_APqobH/http_credentials"
--image_provisioner_backend="copy" --initialize_driver_logging="true" --isolation="posix/cpu,posix/mem"
--launcher="posix" --launcher_dir="/mesos/mesos-1.1.0/_build/src" --logbufsecs="0" --logging_level="INFO"
--oversubscribed_resources_interval="15secs" --perf_duration="10secs" --perf_interval="1mins"
--qos_correction_interval_min="0ns" --quiet="false" --recover="reconnect" --recovery_timeout="15mins"
--registration_backoff_factor="10ms" --resources="cpus:2;gpus:0;mem:1024;disk:1024;ports:[31000-32000]"
--revocable_cpu_low_priority="true" --runtime_dir="/tmp/Endpoint_SlaveEndpointTest_NoAuthorizer_2_APqobH"
--sandbox_directory="/mnt/mesos/sandbox" --strict="true" --switch_user="true" --systemd_enable_support="true"
--systemd_runtime_directory="/run/systemd/system" --version="false" --work_dir="/tmp/Endpoint_SlaveEndpointTest_NoAuthorizer_2_58swrW"
I1003 18:40:11.714917 29131 credentials.hpp:86] Loading credential for authentication from
'/tmp/Endpoint_SlaveEndpointTest_NoAuthorizer_2_APqobH/credential'
I1003 18:40:11.715188 29131 slave.cpp:346] Agent using credential for: test-principal
I1003 18:40:11.715214 29131 credentials.hpp:37] Loading credentials for authentication from
'/tmp/Endpoint_SlaveEndpointTest_NoAuthorizer_2_APqobH/http_credentials'
I1003 18:40:11.715514 29131 http.cpp:883] Using default 'basic' HTTP authenticator for realm
'mesos-agent-readonly'
I1003 18:40:11.715683 29131 http.cpp:883] Using default 'basic' HTTP authenticator for realm
'mesos-agent-readwrite'
I1003 18:40:11.716783 29131 slave.cpp:533] Agent resources: cpus(*):2; mem(*):1024; disk(*):1024;
ports(*):[31000-32000]
I1003 18:40:11.716897 29131 slave.cpp:541] Agent attributes: [  ]
I1003 18:40:11.716920 29131 slave.cpp:546] Agent hostname: 32fadd80554c
I1003 18:40:11.718811 29135 state.cpp:57] Recovering state from '/tmp/Endpoint_SlaveEndpointTest_NoAuthorizer_2_58swrW/meta'
I1003 18:40:11.718865 29131 process.cpp:3377] Handling HTTP event for process 'slave(615)'
with path: '/slave(615)/containers'
I1003 18:40:11.719472 29128 status_update_manager.cpp:203] Recovering status update manager
I1003 18:40:11.719827 29130 containerizer.cpp:581] Recovering containerizer
I1003 18:40:11.719993 29143 http.cpp:835] Authorizing principal 'test-principal' to GET the
'/containers' endpoint
I1003 18:40:11.721272 29143 provisioner.cpp:253] Provisioner recovery complete
I1003 18:40:11.721601 29130 slave.cpp:5256] Finished recovery
I1003 18:40:11.722591 29130 slave.cpp:5428] Querying resource estimator for oversubscribable
resources
I1003 18:40:11.723209 29130 slave.cpp:5442] Received oversubscribable resources {} from the
resource estimator
I1003 18:40:11.724912 29139 slave.cpp:787] Agent terminating
[       OK ] Endpoint/SlaveEndpointTest.NoAuthorizer/2 (33 ms)
[----------] 9 tests from Endpoint/SlaveEndpointTest (277 ms total)

[----------] Global test environment tear-down
[==========] 1342 tests from 153 test cases ran. (467902 ms total)
[  PASSED  ] 1341 tests.
[  FAILED  ] 1 test, listed below:
[  FAILED  ] MasterTest.MaxCompletedTasksPerFrameworkFlag

 1 FAILED TEST
  YOU HAVE 6 DISABLED TESTS

make[4]: *** [check-local] Error 1
make[4]: Leaving directory `/mesos/mesos-1.1.0/_build/src'
make[3]: *** [check-am] Error 2
make[3]: Leaving directory `/mesos/mesos-1.1.0/_build/src'
make[2]: *** [check] Error 2
make[2]: Leaving directory `/mesos/mesos-1.1.0/_build/src'
make[1]: *** [check-recursive] Error 1
make[1]: Leaving directory `/mesos/mesos-1.1.0/_build'
make: *** [distcheck] Error 1
+ docker rmi mesos-1475517233-24221
Untagged: mesos-1475517233-24221:latest
Deleted: sha256:e01bdbc24f2623fe3e60e39e22555f3fe1eeba4888be47d834a5bf6d50cb27b4
Deleted: sha256:8db07cafbc3f34dd1741fffeb551e935628ba5be0487d8f1f2438470cc3faf4f
Deleted: sha256:b69993f77eaf6fdc09b1353a5428cb5bb20d8939c8fd05df5b87cde26e240129
Deleted: sha256:77abfe2c94333efbcbd61c968fe2bcbee40718f57a62e4bde0a2cf5d8704ca85
Deleted: sha256:b4c7537990a02c293e74fe42178342d533fc27d04f62d0b0502177694fbdaa4b
Deleted: sha256:9c5613ea3b12da356602e86bfb81eb845ee3070afbd0cacd31ad6bd71c8b8a41
Deleted: sha256:804eacd87c7d52ff212f76deeeddf1496134cb0515aed646770d9b4dc8973496
Deleted: sha256:cc4205e16513f5175ccea49940be90ef92b88df218bc80dd8da11a23ed9d10c8
Deleted: sha256:06a3ebc2256a900a45ce9ec327595eeac743b887eacdda61bb5427e06816b4ae
Deleted: sha256:a0be2d29e5d363e1bd831545b1410ad8e0ccc1b8a85bf10e40412a55de82a35b
Deleted: sha256:fa749f94f70bb875cefed7f350bc7f19c5dea11749c6d9775c49aa0662770f2e
Deleted: sha256:17269f9191c02aef2ec33a0e0c8f9c272792c6ff03949592ce2ae000ffca9a33
Deleted: sha256:8139dc041d048d33c282c5b893b4380685ffa28e076c67a2ea8cccdf569eaefc
Deleted: sha256:5e1d6f222a613474d5cfba4955101af0f87bc7b1f5e7d7ed4d36f674e43aace8
Deleted: sha256:81aa3b6bd23685fe682a997aca053cdb9a165a69032a177808ff746a6c426ec3
Deleted: sha256:0b3b5e317b532dbf45e071c4ebbf738dac05498e2e81d0a9b19fe0b48f32c4af
Deleted: sha256:f3a705703620b9a8a93e6cea1cb8c99f45a0c002fe6da4a27f5a0bff6d3a2730
Deleted: sha256:f08025647d79034a319f2e43196b3ae5df519e5a184444c92e4402adf5b33bd0
Deleted: sha256:35821f9b8b1c14973917a1b90fd0da955bf9025bd89b413cfc1dd8a0a3b60efa
Deleted: sha256:052188a2b6004fed48a862f3117014720cff21215d622c576c5e6b41c1afadec
Deleted: sha256:b5037d5eb6fa132fbec3969424613ec5e41a54be5db32ac8bb0bbc8157c95464
Deleted: sha256:d6cf8e2fdcd794d05e62cc77f5f56166f251ac47409276701a824ef09ea99083
Deleted: sha256:715cd9399e917347f9f58c8eaa07bb100524027fd67dd61ad006aec429bcf10c
Deleted: sha256:48362df717f5637d6978f849539f02a231237f8ffd04605677f13013e9b493f6
Build step 'Execute shell' marked build as failure

Mime
View raw message