mesos-builds mailing list archives

Site index · List index
Message view « Date » · « Thread »
Top « Date » · « Thread »
From Apache Jenkins Server <jenk...@builds.apache.org>
Subject Build failed in Jenkins: Mesos » autotools,clang,--verbose --enable-libevent --enable-ssl,GLOG_v=1 MESOS_VERBOSE=1,ubuntu:14.04,(docker||Hadoop)&&(!ubuntu-us1)&&(!ubuntu-6) #2770
Date Wed, 12 Oct 2016 19:55:31 GMT
See <https://builds.apache.org/job/Mesos/BUILDTOOL=autotools,COMPILER=clang,CONFIGURATION=--verbose%20--enable-libevent%20--enable-ssl,ENVIRONMENT=GLOG_v=1%20MESOS_VERBOSE=1,OS=ubuntu%3A14.04,label_exp=(docker%7C%7CHadoop)&&(!ubuntu-us1)&&(!ubuntu-6)/2770/changes>

Changes:

[yujie.jay] Added fields `chain` and `excludeDevices` to `PortMapper`.

[yujie.jay] Added `PluginError` to simplify error reporting for CNI plugins.

[yujie.jay] Added the 'name' and 'args' field to the 'delegate' plugin's CNI config.

[yujie.jay] Added constants for CNI commands.

[yujie.jay] Updated signature of `delegate` and `execute` method.

------------------------------------------
[...truncated 213921 lines...]
W1012 19:54:17.351639 28879 backend.cpp:75] Failed to create 'aufs' backend: AufsBackend requires
root privileges, but is running as user mesos
W1012 19:54:17.351814 28879 backend.cpp:75] Failed to create 'bind' backend: BindBackend requires
root privileges
I1012 19:54:17.356647 28909 slave.cpp:208] Mesos agent started on (620)@172.17.0.2:59289
I1012 19:54:17.356710 28909 slave.cpp:209] Flags at startup: --acls="" --appc_simple_discovery_uri_prefix="http://"
--appc_store_dir="/tmp/mesos/store/appc" --authenticate_http_readonly="true" --authenticate_http_readwrite="true"
--authenticatee="crammd5" --authentication_backoff_factor="1secs" --authorizer="local" --cgroups_cpu_enable_pids_and_tids_count="false"
--cgroups_enable_cfs="false" --cgroups_hierarchy="/sys/fs/cgroup" --cgroups_limit_swap="false"
--cgroups_root="mesos" --container_disk_watch_interval="15secs" --containerizers="mesos" --credential="/tmp/Endpoint_SlaveEndpointTest_AuthorizedRequest_1_ovgPNE/credential"
--default_role="*" --disk_watch_interval="1mins" --docker="docker" --docker_kill_orphans="true"
--docker_registry="https://registry-1.docker.io" --docker_remove_delay="6hrs" --docker_socket="/var/run/docker.sock"
--docker_stop_timeout="0ns" --docker_store_dir="/tmp/mesos/store/docker" --docker_volume_checkpoint_dir="/var/run/mesos/isolators/docker/volume"
--enforce_container_disk_quota="false" --executor_registration_timeout="1mins" --executor_shutdown_grace_period="5secs"
--fetcher_cache_dir="/tmp/Endpoint_SlaveEndpointTest_AuthorizedRequest_1_ovgPNE/fetch" --fetcher_cache_size="2GB"
--frameworks_home="" --gc_delay="1weeks" --gc_disk_headroom="0.1" --hadoop_home="" --help="false"
--hostname_lookup="true" --http_authenticators="basic" --http_command_executor="false" --http_credentials="/tmp/Endpoint_SlaveEndpointTest_AuthorizedRequest_1_ovgPNE/http_credentials"
--image_provisioner_backend="copy" --initialize_driver_logging="true" --isolation="posix/cpu,posix/mem"
--launcher="posix" --launcher_dir="/mesos/mesos-1.1.0/_build/src" --logbufsecs="0" --logging_level="INFO"
--max_completed_executors_per_framework="150" --oversubscribed_resources_interval="15secs"
--perf_duration="10secs" --perf_interval="1mins" --qos_correction_interval_min="0ns" --quiet="false"
--recover="reconnect" --recovery_timeout="15mins" --registration_backoff_factor="10ms" --resources="cpus:2;gpus:0;mem:1024;disk:1024;ports:[31000-32000]"
--revocable_cpu_low_priority="true" --runtime_dir="/tmp/Endpoint_SlaveEndpointTest_AuthorizedRequest_1_ovgPNE"
--sandbox_directory="/mnt/mesos/sandbox" --strict="true" --switch_user="true" --systemd_enable_support="true"
--systemd_runtime_directory="/run/systemd/system" --version="false" --work_dir="/tmp/Endpoint_SlaveEndpointTest_AuthorizedRequest_1_0HNqIn"
I1012 19:54:17.357249 28909 credentials.hpp:86] Loading credential for authentication from
'/tmp/Endpoint_SlaveEndpointTest_AuthorizedRequest_1_ovgPNE/credential'
I1012 19:54:17.357656 28909 slave.cpp:346] Agent using credential for: test-principal
I1012 19:54:17.357681 28909 credentials.hpp:37] Loading credentials for authentication from
'/tmp/Endpoint_SlaveEndpointTest_AuthorizedRequest_1_ovgPNE/http_credentials'
I1012 19:54:17.358063 28909 http.cpp:883] Using default 'basic' HTTP authenticator for realm
'mesos-agent-readonly'
I1012 19:54:17.358255 28909 http.cpp:883] Using default 'basic' HTTP authenticator for realm
'mesos-agent-readwrite'
I1012 19:54:17.359628 28909 slave.cpp:533] Agent resources: cpus(*):2; mem(*):1024; disk(*):1024;
ports(*):[31000-32000]
I1012 19:54:17.359709 28909 slave.cpp:541] Agent attributes: [  ]
I1012 19:54:17.359747 28909 slave.cpp:546] Agent hostname: 14f5c996bf27
I1012 19:54:17.361416 28898 state.cpp:57] Recovering state from '/tmp/Endpoint_SlaveEndpointTest_AuthorizedRequest_1_0HNqIn/meta'
I1012 19:54:17.361636 28909 process.cpp:3377] Handling HTTP event for process 'slave(620)'
with path: '/slave(620)/monitor/statistics.json'
I1012 19:54:17.362390 28898 status_update_manager.cpp:203] Recovering status update manager
I1012 19:54:17.362838 28898 containerizer.cpp:557] Recovering containerizer
I1012 19:54:17.363101 28912 http.cpp:835] Authorizing principal 'test-principal' to GET the
'/monitor/statistics.json' endpoint
I1012 19:54:17.364605 28906 provisioner.cpp:253] Provisioner recovery complete
I1012 19:54:17.365375 28912 slave.cpp:5281] Finished recovery
I1012 19:54:17.366590 28912 slave.cpp:5455] Querying resource estimator for oversubscribable
resources
I1012 19:54:17.367107 28905 slave.cpp:5469] Received oversubscribable resources {} from the
resource estimator
I1012 19:54:17.368499 28898 slave.cpp:787] Agent terminating
[       OK ] Endpoint/SlaveEndpointTest.AuthorizedRequest/1 (31 ms)
[ RUN      ] Endpoint/SlaveEndpointTest.AuthorizedRequest/2
I1012 19:54:17.380214 28879 containerizer.cpp:202] Using isolation: posix/cpu,posix/mem,filesystem/posix,network/cni
W1012 19:54:17.380914 28879 backend.cpp:75] Failed to create 'aufs' backend: AufsBackend requires
root privileges, but is running as user mesos
W1012 19:54:17.381098 28879 backend.cpp:75] Failed to create 'bind' backend: BindBackend requires
root privileges
I1012 19:54:17.385826 28908 slave.cpp:208] Mesos agent started on (621)@172.17.0.2:59289
I1012 19:54:17.385888 28908 slave.cpp:209] Flags at startup: --acls="" --appc_simple_discovery_uri_prefix="http://"
--appc_store_dir="/tmp/mesos/store/appc" --authenticate_http_readonly="true" --authenticate_http_readwrite="true"
--authenticatee="crammd5" --authentication_backoff_factor="1secs" --authorizer="local" --cgroups_cpu_enable_pids_and_tids_count="false"
--cgroups_enable_cfs="false" --cgroups_hierarchy="/sys/fs/cgroup" --cgroups_limit_swap="false"
--cgroups_root="mesos" --container_disk_watch_interval="15secs" --containerizers="mesos" --credential="/tmp/Endpoint_SlaveEndpointTest_AuthorizedRequest_2_4vSIqL/credential"
--default_role="*" --disk_watch_interval="1mins" --docker="docker" --docker_kill_orphans="true"
--docker_registry="https://registry-1.docker.io" --docker_remove_delay="6hrs" --docker_socket="/var/run/docker.sock"
--docker_stop_timeout="0ns" --docker_store_dir="/tmp/mesos/store/docker" --docker_volume_checkpoint_dir="/var/run/mesos/isolators/docker/volume"
--enforce_container_disk_quota="false" --executor_registration_timeout="1mins" --executor_shutdown_grace_period="5secs"
--fetcher_cache_dir="/tmp/Endpoint_SlaveEndpointTest_AuthorizedRequest_2_4vSIqL/fetch" --fetcher_cache_size="2GB"
--frameworks_home="" --gc_delay="1weeks" --gc_disk_headroom="0.1" --hadoop_home="" --help="false"
--hostname_lookup="true" --http_authenticators="basic" --http_command_executor="false" --http_credentials="/tmp/Endpoint_SlaveEndpointTest_AuthorizedRequest_2_4vSIqL/http_credentials"
--image_provisioner_backend="copy" --initialize_driver_logging="true" --isolation="posix/cpu,posix/mem"
--launcher="posix" --launcher_dir="/mesos/mesos-1.1.0/_build/src" --logbufsecs="0" --logging_level="INFO"
--max_completed_executors_per_framework="150" --oversubscribed_resources_interval="15secs"
--perf_duration="10secs" --perf_interval="1mins" --qos_correction_interval_min="0ns" --quiet="false"
--recover="reconnect" --recovery_timeout="15mins" --registration_backoff_factor="10ms" --resources="cpus:2;gpus:0;mem:1024;disk:1024;ports:[31000-32000]"
--revocable_cpu_low_priority="true" --runtime_dir="/tmp/Endpoint_SlaveEndpointTest_AuthorizedRequest_2_4vSIqL"
--sandbox_directory="/mnt/mesos/sandbox" --strict="true" --switch_user="true" --systemd_enable_support="true"
--systemd_runtime_directory="/run/systemd/system" --version="false" --work_dir="/tmp/Endpoint_SlaveEndpointTest_AuthorizedRequest_2_n4eqgu"
I1012 19:54:17.386718 28908 credentials.hpp:86] Loading credential for authentication from
'/tmp/Endpoint_SlaveEndpointTest_AuthorizedRequest_2_4vSIqL/credential'
I1012 19:54:17.387034 28908 slave.cpp:346] Agent using credential for: test-principal
I1012 19:54:17.387203 28908 credentials.hpp:37] Loading credentials for authentication from
'/tmp/Endpoint_SlaveEndpointTest_AuthorizedRequest_2_4vSIqL/http_credentials'
I1012 19:54:17.387698 28908 http.cpp:883] Using default 'basic' HTTP authenticator for realm
'mesos-agent-readonly'
I1012 19:54:17.388062 28908 http.cpp:883] Using default 'basic' HTTP authenticator for realm
'mesos-agent-readwrite'
I1012 19:54:17.390099 28908 slave.cpp:533] Agent resources: cpus(*):2; mem(*):1024; disk(*):1024;
ports(*):[31000-32000]
I1012 19:54:17.390244 28908 slave.cpp:541] Agent attributes: [  ]
I1012 19:54:17.390343 28908 slave.cpp:546] Agent hostname: 14f5c996bf27
I1012 19:54:17.392012 28901 state.cpp:57] Recovering state from '/tmp/Endpoint_SlaveEndpointTest_AuthorizedRequest_2_n4eqgu/meta'
I1012 19:54:17.392189 28908 process.cpp:3377] Handling HTTP event for process 'slave(621)'
with path: '/slave(621)/containers'
I1012 19:54:17.392916 28897 status_update_manager.cpp:203] Recovering status update manager
I1012 19:54:17.393090 28903 containerizer.cpp:557] Recovering containerizer
I1012 19:54:17.394425 28897 provisioner.cpp:253] Provisioner recovery complete
I1012 19:54:17.394857 28912 http.cpp:835] Authorizing principal 'test-principal' to GET the
'/containers' endpoint
I1012 19:54:17.395804 28912 slave.cpp:5281] Finished recovery
I1012 19:54:17.396363 28912 slave.cpp:5455] Querying resource estimator for oversubscribable
resources
I1012 19:54:17.398746 28901 slave.cpp:5469] Received oversubscribable resources {} from the
resource estimator
I1012 19:54:17.398967 28901 slave.cpp:787] Agent terminating
[       OK ] Endpoint/SlaveEndpointTest.AuthorizedRequest/2 (31 ms)
[ RUN      ] Endpoint/SlaveEndpointTest.UnauthorizedRequest/0
I1012 19:54:17.413687 28879 containerizer.cpp:202] Using isolation: posix/cpu,posix/mem,filesystem/posix,network/cni
W1012 19:54:17.414494 28879 backend.cpp:75] Failed to create 'aufs' backend: AufsBackend requires
root privileges, but is running as user mesos
W1012 19:54:17.414690 28879 backend.cpp:75] Failed to create 'bind' backend: BindBackend requires
root privileges
I1012 19:54:17.419253 28908 slave.cpp:208] Mesos agent started on (622)@172.17.0.2:59289
I1012 19:54:17.419291 28908 slave.cpp:209] Flags at startup: --acls="" --appc_simple_discovery_uri_prefix="http://"
--appc_store_dir="/tmp/mesos/store/appc" --authenticate_http_readonly="true" --authenticate_http_readwrite="true"
--authenticatee="crammd5" --authentication_backoff_factor="1secs" --authorizer="local" --cgroups_cpu_enable_pids_and_tids_count="false"
--cgroups_enable_cfs="false" --cgroups_hierarchy="/sys/fs/cgroup" --cgroups_limit_swap="false"
--cgroups_root="mesos" --container_disk_watch_interval="15secs" --containerizers="mesos" --credential="/tmp/Endpoint_SlaveEndpointTest_UnauthorizedRequest_0_QkbxoS/credential"
--default_role="*" --disk_watch_interval="1mins" --docker="docker" --docker_kill_orphans="true"
--docker_registry="https://registry-1.docker.io" --docker_remove_delay="6hrs" --docker_socket="/var/run/docker.sock"
--docker_stop_timeout="0ns" --docker_store_dir="/tmp/mesos/store/docker" --docker_volume_checkpoint_dir="/var/run/mesos/isolators/docker/volume"
--enforce_container_disk_quota="false" --executor_registration_timeout="1mins" --executor_shutdown_grace_period="5secs"
--fetcher_cache_dir="/tmp/Endpoint_SlaveEndpointTest_UnauthorizedRequest_0_QkbxoS/fetch" --fetcher_cache_size="2GB"
--frameworks_home="" --gc_delay="1weeks" --gc_disk_headroom="0.1" --hadoop_home="" --help="false"
--hostname_lookup="true" --http_authenticators="basic" --http_command_executor="false" --http_credentials="/tmp/Endpoint_SlaveEndpointTest_UnauthorizedRequest_0_QkbxoS/http_credentials"
--image_provisioner_backend="copy" --initialize_driver_logging="true" --isolation="posix/cpu,posix/mem"
--launcher="posix" --launcher_dir="/mesos/mesos-1.1.0/_build/src" --logbufsecs="0" --logging_level="INFO"
--max_completed_executors_per_framework="150" --oversubscribed_resources_interval="15secs"
--perf_duration="10secs" --perf_interval="1mins" --qos_correction_interval_min="0ns" --quiet="false"
--recover="reconnect" --recovery_timeout="15mins" --registration_backoff_factor="10ms" --resources="cpus:2;gpus:0;mem:1024;disk:1024;ports:[31000-32000]"
--revocable_cpu_low_priority="true" --runtime_dir="/tmp/Endpoint_SlaveEndpointTest_UnauthorizedRequest_0_QkbxoS"
--sandbox_directory="/mnt/mesos/sandbox" --strict="true" --switch_user="true" --systemd_enable_support="true"
--systemd_runtime_directory="/run/systemd/system" --version="false" --work_dir="/tmp/Endpoint_SlaveEndpointTest_UnauthorizedRequest_0_MaHS8A"
I1012 19:54:17.419787 28908 credentials.hpp:86] Loading credential for authentication from
'/tmp/Endpoint_SlaveEndpointTest_UnauthorizedRequest_0_QkbxoS/credential'
I1012 19:54:17.420289 28908 slave.cpp:346] Agent using credential for: test-principal
I1012 19:54:17.420316 28908 credentials.hpp:37] Loading credentials for authentication from
'/tmp/Endpoint_SlaveEndpointTest_UnauthorizedRequest_0_QkbxoS/http_credentials'
I1012 19:54:17.420594 28908 http.cpp:883] Using default 'basic' HTTP authenticator for realm
'mesos-agent-readonly'
I1012 19:54:17.420873 28908 http.cpp:883] Using default 'basic' HTTP authenticator for realm
'mesos-agent-readwrite'
I1012 19:54:17.422282 28908 slave.cpp:533] Agent resources: cpus(*):2; mem(*):1024; disk(*):1024;
ports(*):[31000-32000]
I1012 19:54:17.422361 28908 slave.cpp:541] Agent attributes: [  ]
I1012 19:54:17.422399 28908 slave.cpp:546] Agent hostname: 14f5c996bf27
I1012 19:54:17.423799 28911 state.cpp:57] Recovering state from '/tmp/Endpoint_SlaveEndpointTest_UnauthorizedRequest_0_MaHS8A/meta'
I1012 19:54:17.423936 28908 process.cpp:3377] Handling HTTP event for process 'slave(622)'
with path: '/slave(622)/monitor/statistics'
I1012 19:54:17.424700 28907 status_update_manager.cpp:203] Recovering status update manager
I1012 19:54:17.424949 28907 containerizer.cpp:557] Recovering containerizer
I1012 19:54:17.425098 28908 http.cpp:835] Authorizing principal 'test-principal' to GET the
'/monitor/statistics' endpoint
I1012 19:54:17.426944 28898 provisioner.cpp:253] Provisioner recovery complete
I1012 19:54:17.427327 28912 slave.cpp:5281] Finished recovery
I1012 19:54:17.428047 28912 slave.cpp:5455] Querying resource estimator for oversubscribable
resources
I1012 19:54:17.428315 28912 slave.cpp:5469] Received oversubscribable resources {} from the
resource estimator
I1012 19:54:17.429824 28910 slave.cpp:787] Agent terminating
[       OK ] Endpoint/SlaveEndpointTest.UnauthorizedRequest/0 (31 ms)
[ RUN      ] Endpoint/SlaveEndpointTest.UnauthorizedRequest/1
I1012 19:54:17.443753 28879 containerizer.cpp:202] Using isolation: posix/cpu,posix/mem,filesystem/posix,network/cni
W1012 19:54:17.444389 28879 backend.cpp:75] Failed to create 'aufs' backend: AufsBackend requires
root privileges, but is running as user mesos
W1012 19:54:17.444558 28879 backend.cpp:75] Failed to create 'bind' backend: BindBackend requires
root privileges
I1012 19:54:17.449940 28905 slave.cpp:208] Mesos agent started on (623)@172.17.0.2:59289
I1012 19:54:17.449980 28905 slave.cpp:209] Flags at startup: --acls="" --appc_simple_discovery_uri_prefix="http://"
--appc_store_dir="/tmp/mesos/store/appc" --authenticate_http_readonly="true" --authenticate_http_readwrite="true"
--authenticatee="crammd5" --authentication_backoff_factor="1secs" --authorizer="local" --cgroups_cpu_enable_pids_and_tids_count="false"
--cgroups_enable_cfs="false" --cgroups_hierarchy="/sys/fs/cgroup" --cgroups_limit_swap="false"
--cgroups_root="mesos" --container_disk_watch_interval="15secs" --containerizers="mesos" --credential="/tmp/Endpoint_SlaveEndpointTest_UnauthorizedRequest_1_ILHxGZ/credential"
--default_role="*" --disk_watch_interval="1mins" --docker="docker" --docker_kill_orphans="true"
--docker_registry="https://registry-1.docker.io" --docker_remove_delay="6hrs" --docker_socket="/var/run/docker.sock"
--docker_stop_timeout="0ns" --docker_store_dir="/tmp/mesos/store/docker" --docker_volume_checkpoint_dir="/var/run/mesos/isolators/docker/volume"
--enforce_container_disk_quota="false" --executor_registration_timeout="1mins" --executor_shutdown_grace_period="5secs"
--fetcher_cache_dir="/tmp/Endpoint_SlaveEndpointTest_UnauthorizedRequest_1_ILHxGZ/fetch" --fetcher_cache_size="2GB"
--frameworks_home="" --gc_delay="1weeks" --gc_disk_headroom="0.1" --hadoop_home="" --help="false"
--hostname_lookup="true" --http_authenticators="basic" --http_command_executor="false" --http_credentials="/tmp/Endpoint_SlaveEndpointTest_UnauthorizedRequest_1_ILHxGZ/http_credentials"
--image_provisioner_backend="copy" --initialize_driver_logging="true" --isolation="posix/cpu,posix/mem"
--launcher="posix" --launcher_dir="/mesos/mesos-1.1.0/_build/src" --logbufsecs="0" --logging_level="INFO"
--max_completed_executors_per_framework="150" --oversubscribed_resources_interval="15secs"
--perf_duration="10secs" --perf_interval="1mins" --qos_correction_interval_min="0ns" --quiet="false"
--recover="reconnect" --recovery_timeout="15mins" --registration_backoff_factor="10ms" --resources="cpus:2;gpus:0;mem:1024;disk:1024;ports:[31000-32000]"
--revocable_cpu_low_priority="true" --runtime_dir="/tmp/Endpoint_SlaveEndpointTest_UnauthorizedRequest_1_ILHxGZ"
--sandbox_directory="/mnt/mesos/sandbox" --strict="true" --switch_user="true" --systemd_enable_support="true"
--systemd_runtime_directory="/run/systemd/system" --version="false" --work_dir="/tmp/Endpoint_SlaveEndpointTest_UnauthorizedRequest_1_gbuUlI"
I1012 19:54:17.450531 28905 credentials.hpp:86] Loading credential for authentication from
'/tmp/Endpoint_SlaveEndpointTest_UnauthorizedRequest_1_ILHxGZ/credential'
I1012 19:54:17.450772 28905 slave.cpp:346] Agent using credential for: test-principal
I1012 19:54:17.450799 28905 credentials.hpp:37] Loading credentials for authentication from
'/tmp/Endpoint_SlaveEndpointTest_UnauthorizedRequest_1_ILHxGZ/http_credentials'
I1012 19:54:17.451093 28905 http.cpp:883] Using default 'basic' HTTP authenticator for realm
'mesos-agent-readonly'
I1012 19:54:17.451321 28905 http.cpp:883] Using default 'basic' HTTP authenticator for realm
'mesos-agent-readwrite'
I1012 19:54:17.452711 28905 slave.cpp:533] Agent resources: cpus(*):2; mem(*):1024; disk(*):1024;
ports(*):[31000-32000]
I1012 19:54:17.452831 28905 slave.cpp:541] Agent attributes: [  ]
I1012 19:54:17.452852 28905 slave.cpp:546] Agent hostname: 14f5c996bf27
I1012 19:54:17.454591 28899 state.cpp:57] Recovering state from '/tmp/Endpoint_SlaveEndpointTest_UnauthorizedRequest_1_gbuUlI/meta'
I1012 19:54:17.454735 28905 process.cpp:3377] Handling HTTP event for process 'slave(623)'
with path: '/slave(623)/monitor/statistics.json'
I1012 19:54:17.455273 28912 status_update_manager.cpp:203] Recovering status update manager
I1012 19:54:17.455605 28911 containerizer.cpp:557] Recovering containerizer
I1012 19:54:17.456012 28912 http.cpp:835] Authorizing principal 'test-principal' to GET the
'/monitor/statistics.json' endpoint
I1012 19:54:17.457144 28911 provisioner.cpp:253] Provisioner recovery complete
I1012 19:54:17.457561 28911 slave.cpp:5281] Finished recovery
I1012 19:54:17.458385 28911 slave.cpp:5455] Querying resource estimator for oversubscribable
resources
I1012 19:54:17.458855 28899 slave.cpp:5469] Received oversubscribable resources {} from the
resource estimator
I1012 19:54:17.459748 28898 slave.cpp:787] Agent terminating
[       OK ] Endpoint/SlaveEndpointTest.UnauthorizedRequest/1 (27 ms)
[ RUN      ] Endpoint/SlaveEndpointTest.UnauthorizedRequest/2
I1012 19:54:17.471227 28879 containerizer.cpp:202] Using isolation: posix/cpu,posix/mem,filesystem/posix,network/cni
W1012 19:54:17.471956 28879 backend.cpp:75] Failed to create 'aufs' backend: AufsBackend requires
root privileges, but is running as user mesos
W1012 19:54:17.472151 28879 backend.cpp:75] Failed to create 'bind' backend: BindBackend requires
root privileges
I1012 19:54:17.475778 28903 slave.cpp:208] Mesos agent started on (624)@172.17.0.2:59289
I1012 19:54:17.475850 28903 slave.cpp:209] Flags at startup: --acls="" --appc_simple_discovery_uri_prefix="http://"
--appc_store_dir="/tmp/mesos/store/appc" --authenticate_http_readonly="true" --authenticate_http_readwrite="true"
--authenticatee="crammd5" --authentication_backoff_factor="1secs" --authorizer="local" --cgroups_cpu_enable_pids_and_tids_count="false"
--cgroups_enable_cfs="false" --cgroups_hierarchy="/sys/fs/cgroup" --cgroups_limit_swap="false"
--cgroups_root="mesos" --container_disk_watch_interval="15secs" --containerizers="mesos" --credential="/tmp/Endpoint_SlaveEndpointTest_UnauthorizedRequest_2_co3xg7/credential"
--default_role="*" --disk_watch_interval="1mins" --docker="docker" --docker_kill_orphans="true"
--docker_registry="https://registry-1.docker.io" --docker_remove_delay="6hrs" --docker_socket="/var/run/docker.sock"
--docker_stop_timeout="0ns" --docker_store_dir="/tmp/mesos/store/docker" --docker_volume_checkpoint_dir="/var/run/mesos/isolators/docker/volume"
--enforce_container_disk_quota="false" --executor_registration_timeout="1mins" --executor_shutdown_grace_period="5secs"
--fetcher_cache_dir="/tmp/Endpoint_SlaveEndpointTest_UnauthorizedRequest_2_co3xg7/fetch" --fetcher_cache_size="2GB"
--frameworks_home="" --gc_delay="1weeks" --gc_disk_headroom="0.1" --hadoop_home="" --help="false"
--hostname_lookup="true" --http_authenticators="basic" --http_command_executor="false" --http_credentials="/tmp/Endpoint_SlaveEndpointTest_UnauthorizedRequest_2_co3xg7/http_credentials"
--image_provisioner_backend="copy" --initialize_driver_logging="true" --isolation="posix/cpu,posix/mem"
--launcher="posix" --launcher_dir="/mesos/mesos-1.1.0/_build/src" --logbufsecs="0" --logging_level="INFO"
--max_completed_executors_per_framework="150" --oversubscribed_resources_interval="15secs"
--perf_duration="10secs" --perf_interval="1mins" --qos_correction_interval_min="0ns" --quiet="false"
--recover="reconnect" --recovery_timeout="15mins" --registration_backoff_factor="10ms" --resources="cpus:2;gpus:0;mem:1024;disk:1024;ports:[31000-32000]"
--revocable_cpu_low_priority="true" --runtime_dir="/tmp/Endpoint_SlaveEndpointTest_UnauthorizedRequest_2_co3xg7"
--sandbox_directory="/mnt/mesos/sandbox" --strict="true" --switch_user="true" --systemd_enable_support="true"
--systemd_runtime_directory="/run/systemd/system" --version="false" --work_dir="/tmp/Endpoint_SlaveEndpointTest_UnauthorizedRequest_2_bUTwRP"
I1012 19:54:17.476527 28903 credentials.hpp:86] Loading credential for authentication from
'/tmp/Endpoint_SlaveEndpointTest_UnauthorizedRequest_2_co3xg7/credential'
I1012 19:54:17.476768 28903 slave.cpp:346] Agent using credential for: test-principal
I1012 19:54:17.476795 28903 credentials.hpp:37] Loading credentials for authentication from
'/tmp/Endpoint_SlaveEndpointTest_UnauthorizedRequest_2_co3xg7/http_credentials'
I1012 19:54:17.477075 28903 http.cpp:883] Using default 'basic' HTTP authenticator for realm
'mesos-agent-readonly'
I1012 19:54:17.477246 28903 http.cpp:883] Using default 'basic' HTTP authenticator for realm
'mesos-agent-readwrite'
I1012 19:54:17.478716 28903 slave.cpp:533] Agent resources: cpus(*):2; mem(*):1024; disk(*):1024;
ports(*):[31000-32000]
I1012 19:54:17.478829 28903 slave.cpp:541] Agent attributes: [  ]
I1012 19:54:17.478845 28903 slave.cpp:546] Agent hostname: 14f5c996bf27
I1012 19:54:17.480587 28903 process.cpp:3377] Handling HTTP event for process 'slave(624)'
with path: '/slave(624)/containers'
I1012 19:54:17.481382 28903 state.cpp:57] Recovering state from '/tmp/Endpoint_SlaveEndpointTest_UnauthorizedRequest_2_bUTwRP/meta'
I1012 19:54:17.482442 28903 status_update_manager.cpp:203] Recovering status update manager
I1012 19:54:17.482877 28903 containerizer.cpp:557] Recovering containerizer
I1012 19:54:17.483435 28903 http.cpp:835] Authorizing principal 'test-principal' to GET the
'/containers' endpoint
I1012 19:54:17.486309 28906 provisioner.cpp:253] Provisioner recovery complete
I1012 19:54:17.487033 28899 slave.cpp:5281] Finished recovery
I1012 19:54:17.487622 28899 slave.cpp:5455] Querying resource estimator for oversubscribable
resources
I1012 19:54:17.487887 28908 slave.cpp:5469] Received oversubscribable resources {} from the
resource estimator
I1012 19:54:17.488402 28897 slave.cpp:787] Agent terminating
[       OK ] Endpoint/SlaveEndpointTest.UnauthorizedRequest/2 (33 ms)
[ RUN      ] Endpoint/SlaveEndpointTest.NoAuthorizer/0
I1012 19:54:17.505141 28879 containerizer.cpp:202] Using isolation: posix/cpu,posix/mem,filesystem/posix,network/cni
W1012 19:54:17.505888 28879 backend.cpp:75] Failed to create 'aufs' backend: AufsBackend requires
root privileges, but is running as user mesos
W1012 19:54:17.506055 28879 backend.cpp:75] Failed to create 'bind' backend: BindBackend requires
root privileges
I1012 19:54:17.507632 28879 cluster.cpp:435] Creating default 'local' authorizer
I1012 19:54:17.510725 28904 slave.cpp:208] Mesos agent started on (625)@172.17.0.2:59289
I1012 19:54:17.510758 28904 slave.cpp:209] Flags at startup: --acls="" --appc_simple_discovery_uri_prefix="http://"
--appc_store_dir="/tmp/mesos/store/appc" --authenticate_http_readonly="true" --authenticate_http_readwrite="true"
--authenticatee="crammd5" --authentication_backoff_factor="1secs" --authorizer="local" --cgroups_cpu_enable_pids_and_tids_count="false"
--cgroups_enable_cfs="false" --cgroups_hierarchy="/sys/fs/cgroup" --cgroups_limit_swap="false"
--cgroups_root="mesos" --container_disk_watch_interval="15secs" --containerizers="mesos" --credential="/tmp/Endpoint_SlaveEndpointTest_NoAuthorizer_0_DWHDbf/credential"
--default_role="*" --disk_watch_interval="1mins" --docker="docker" --docker_kill_orphans="true"
--docker_registry="https://registry-1.docker.io" --docker_remove_delay="6hrs" --docker_socket="/var/run/docker.sock"
--docker_stop_timeout="0ns" --docker_store_dir="/tmp/mesos/store/docker" --docker_volume_checkpoint_dir="/var/run/mesos/isolators/docker/volume"
--enforce_container_disk_quota="false" --executor_registration_timeout="1mins" --executor_shutdown_grace_period="5secs"
--fetcher_cache_dir="/tmp/Endpoint_SlaveEndpointTest_NoAuthorizer_0_DWHDbf/fetch" --fetcher_cache_size="2GB"
--frameworks_home="" --gc_delay="1weeks" --gc_disk_headroom="0.1" --hadoop_home="" --help="false"
--hostname_lookup="true" --http_authenticators="basic" --http_command_executor="false" --http_credentials="/tmp/Endpoint_SlaveEndpointTest_NoAuthorizer_0_DWHDbf/http_credentials"
--image_provisioner_backend="copy" --initialize_driver_logging="true" --isolation="posix/cpu,posix/mem"
--launcher="posix" --launcher_dir="/mesos/mesos-1.1.0/_build/src" --logbufsecs="0" --logging_level="INFO"
--max_completed_executors_per_framework="150" --oversubscribed_resources_interval="15secs"
--perf_duration="10secs" --perf_interval="1mins" --qos_correction_interval_min="0ns" --quiet="false"
--recover="reconnect" --recovery_timeout="15mins" --registration_backoff_factor="10ms" --resources="cpus:2;gpus:0;mem:1024;disk:1024;ports:[31000-32000]"
--revocable_cpu_low_priority="true" --runtime_dir="/tmp/Endpoint_SlaveEndpointTest_NoAuthorizer_0_DWHDbf"
--sandbox_directory="/mnt/mesos/sandbox" --strict="true" --switch_user="true" --systemd_enable_support="true"
--systemd_runtime_directory="/run/systemd/system" --version="false" --work_dir="/tmp/Endpoint_SlaveEndpointTest_NoAuthorizer_0_toZaHX"
I1012 19:54:17.511224 28904 credentials.hpp:86] Loading credential for authentication from
'/tmp/Endpoint_SlaveEndpointTest_NoAuthorizer_0_DWHDbf/credential'
I1012 19:54:17.511443 28904 slave.cpp:346] Agent using credential for: test-principal
I1012 19:54:17.511471 28904 credentials.hpp:37] Loading credentials for authentication from
'/tmp/Endpoint_SlaveEndpointTest_NoAuthorizer_0_DWHDbf/http_credentials'
I1012 19:54:17.511747 28904 http.cpp:883] Using default 'basic' HTTP authenticator for realm
'mesos-agent-readonly'
I1012 19:54:17.511900 28904 http.cpp:883] Using default 'basic' HTTP authenticator for realm
'mesos-agent-readwrite'
I1012 19:54:17.513124 28904 slave.cpp:533] Agent resources: cpus(*):2; mem(*):1024; disk(*):1024;
ports(*):[31000-32000]
I1012 19:54:17.513222 28904 slave.cpp:541] Agent attributes: [  ]
I1012 19:54:17.513243 28904 slave.cpp:546] Agent hostname: 14f5c996bf27
I1012 19:54:17.514684 28900 state.cpp:57] Recovering state from '/tmp/Endpoint_SlaveEndpointTest_NoAuthorizer_0_toZaHX/meta'
I1012 19:54:17.514777 28904 process.cpp:3377] Handling HTTP event for process 'slave(625)'
with path: '/slave(625)/monitor/statistics'
I1012 19:54:17.515413 28904 status_update_manager.cpp:203] Recovering status update manager
I1012 19:54:17.515573 28911 containerizer.cpp:557] Recovering containerizer
I1012 19:54:17.517071 28900 http.cpp:835] Authorizing principal 'test-principal' to GET the
'/monitor/statistics' endpoint
I1012 19:54:17.517194 28898 provisioner.cpp:253] Provisioner recovery complete
I1012 19:54:17.517556 28900 slave.cpp:5281] Finished recovery
I1012 19:54:17.518234 28900 slave.cpp:5455] Querying resource estimator for oversubscribable
resources
I1012 19:54:17.518767 28900 slave.cpp:5469] Received oversubscribable resources {} from the
resource estimator
I1012 19:54:17.522316 28907 slave.cpp:787] Agent terminating
[       OK ] Endpoint/SlaveEndpointTest.NoAuthorizer/0 (27 ms)
[ RUN      ] Endpoint/SlaveEndpointTest.NoAuthorizer/1
I1012 19:54:17.530910 28879 containerizer.cpp:202] Using isolation: posix/cpu,posix/mem,filesystem/posix,network/cni
W1012 19:54:17.531500 28879 backend.cpp:75] Failed to create 'aufs' backend: AufsBackend requires
root privileges, but is running as user mesos
W1012 19:54:17.531680 28879 backend.cpp:75] Failed to create 'bind' backend: BindBackend requires
root privileges
I1012 19:54:17.533025 28879 cluster.cpp:435] Creating default 'local' authorizer
I1012 19:54:17.535233 28905 slave.cpp:208] Mesos agent started on (626)@172.17.0.2:59289
I1012 19:54:17.535272 28905 slave.cpp:209] Flags at startup: --acls="" --appc_simple_discovery_uri_prefix="http://"
--appc_store_dir="/tmp/mesos/store/appc" --authenticate_http_readonly="true" --authenticate_http_readwrite="true"
--authenticatee="crammd5" --authentication_backoff_factor="1secs" --authorizer="local" --cgroups_cpu_enable_pids_and_tids_count="false"
--cgroups_enable_cfs="false" --cgroups_hierarchy="/sys/fs/cgroup" --cgroups_limit_swap="false"
--cgroups_root="mesos" --container_disk_watch_interval="15secs" --containerizers="mesos" --credential="/tmp/Endpoint_SlaveEndpointTest_NoAuthorizer_1_OKQHon/credential"
--default_role="*" --disk_watch_interval="1mins" --docker="docker" --docker_kill_orphans="true"
--docker_registry="https://registry-1.docker.io" --docker_remove_delay="6hrs" --docker_socket="/var/run/docker.sock"
--docker_stop_timeout="0ns" --docker_store_dir="/tmp/mesos/store/docker" --docker_volume_checkpoint_dir="/var/run/mesos/isolators/docker/volume"
--enforce_container_disk_quota="false" --executor_registration_timeout="1mins" --executor_shutdown_grace_period="5secs"
--fetcher_cache_dir="/tmp/Endpoint_SlaveEndpointTest_NoAuthorizer_1_OKQHon/fetch" --fetcher_cache_size="2GB"
--frameworks_home="" --gc_delay="1weeks" --gc_disk_headroom="0.1" --hadoop_home="" --help="false"
--hostname_lookup="true" --http_authenticators="basic" --http_command_executor="false" --http_credentials="/tmp/Endpoint_SlaveEndpointTest_NoAuthorizer_1_OKQHon/http_credentials"
--image_provisioner_backend="copy" --initialize_driver_logging="true" --isolation="posix/cpu,posix/mem"
--launcher="posix" --launcher_dir="/mesos/mesos-1.1.0/_build/src" --logbufsecs="0" --logging_level="INFO"
--max_completed_executors_per_framework="150" --oversubscribed_resources_interval="15secs"
--perf_duration="10secs" --perf_interval="1mins" --qos_correction_interval_min="0ns" --quiet="false"
--recover="reconnect" --recovery_timeout="15mins" --registration_backoff_factor="10ms" --resources="cpus:2;gpus:0;mem:1024;disk:1024;ports:[31000-32000]"
--revocable_cpu_low_priority="true" --runtime_dir="/tmp/Endpoint_SlaveEndpointTest_NoAuthorizer_1_OKQHon"
--sandbox_directory="/mnt/mesos/sandbox" --strict="true" --switch_user="true" --systemd_enable_support="true"
--systemd_runtime_directory="/run/systemd/system" --version="false" --work_dir="/tmp/Endpoint_SlaveEndpointTest_NoAuthorizer_1_olkWP5"
I1012 19:54:17.535919 28905 credentials.hpp:86] Loading credential for authentication from
'/tmp/Endpoint_SlaveEndpointTest_NoAuthorizer_1_OKQHon/credential'
I1012 19:54:17.536108 28905 slave.cpp:346] Agent using credential for: test-principal
I1012 19:54:17.536139 28905 credentials.hpp:37] Loading credentials for authentication from
'/tmp/Endpoint_SlaveEndpointTest_NoAuthorizer_1_OKQHon/http_credentials'
I1012 19:54:17.536417 28905 http.cpp:883] Using default 'basic' HTTP authenticator for realm
'mesos-agent-readonly'
I1012 19:54:17.536556 28905 http.cpp:883] Using default 'basic' HTTP authenticator for realm
'mesos-agent-readwrite'
I1012 19:54:17.537931 28905 slave.cpp:533] Agent resources: cpus(*):2; mem(*):1024; disk(*):1024;
ports(*):[31000-32000]
I1012 19:54:17.538040 28905 slave.cpp:541] Agent attributes: [  ]
I1012 19:54:17.538059 28905 slave.cpp:546] Agent hostname: 14f5c996bf27
I1012 19:54:17.539906 28903 state.cpp:57] Recovering state from '/tmp/Endpoint_SlaveEndpointTest_NoAuthorizer_1_olkWP5/meta'
I1012 19:54:17.540017 28905 process.cpp:3377] Handling HTTP event for process 'slave(626)'
with path: '/slave(626)/monitor/statistics.json'
I1012 19:54:17.540669 28911 status_update_manager.cpp:203] Recovering status update manager
I1012 19:54:17.541012 28911 containerizer.cpp:557] Recovering containerizer
I1012 19:54:17.541067 28901 http.cpp:835] Authorizing principal 'test-principal' to GET the
'/monitor/statistics.json' endpoint
I1012 19:54:17.543645 28902 provisioner.cpp:253] Provisioner recovery complete
I1012 19:54:17.544128 28902 slave.cpp:5281] Finished recovery
I1012 19:54:17.544837 28902 slave.cpp:5455] Querying resource estimator for oversubscribable
resources
I1012 19:54:17.545058 28897 slave.cpp:5469] Received oversubscribable resources {} from the
resource estimator
I1012 19:54:17.546241 28904 slave.cpp:787] Agent terminating
[       OK ] Endpoint/SlaveEndpointTest.NoAuthorizer/1 (23 ms)
[ RUN      ] Endpoint/SlaveEndpointTest.NoAuthorizer/2
I1012 19:54:17.554360 28879 containerizer.cpp:202] Using isolation: posix/cpu,posix/mem,filesystem/posix,network/cni
W1012 19:54:17.555018 28879 backend.cpp:75] Failed to create 'aufs' backend: AufsBackend requires
root privileges, but is running as user mesos
W1012 19:54:17.555196 28879 backend.cpp:75] Failed to create 'bind' backend: BindBackend requires
root privileges
I1012 19:54:17.556612 28879 cluster.cpp:435] Creating default 'local' authorizer
I1012 19:54:17.559183 28910 slave.cpp:208] Mesos agent started on (627)@172.17.0.2:59289
I1012 19:54:17.559381 28910 slave.cpp:209] Flags at startup: --acls="" --appc_simple_discovery_uri_prefix="http://"
--appc_store_dir="/tmp/mesos/store/appc" --authenticate_http_readonly="true" --authenticate_http_readwrite="true"
--authenticatee="crammd5" --authentication_backoff_factor="1secs" --authorizer="local" --cgroups_cpu_enable_pids_and_tids_count="false"
--cgroups_enable_cfs="false" --cgroups_hierarchy="/sys/fs/cgroup" --cgroups_limit_swap="false"
--cgroups_root="mesos" --container_disk_watch_interval="15secs" --containerizers="mesos" --credential="/tmp/Endpoint_SlaveEndpointTest_NoAuthorizer_2_Pv8wRv/credential"
--default_role="*" --disk_watch_interval="1mins" --docker="docker" --docker_kill_orphans="true"
--docker_registry="https://registry-1.docker.io" --docker_remove_delay="6hrs" --docker_socket="/var/run/docker.sock"
--docker_stop_timeout="0ns" --docker_store_dir="/tmp/mesos/store/docker" --docker_volume_checkpoint_dir="/var/run/mesos/isolators/docker/volume"
--enforce_container_disk_quota="false" --executor_registration_timeout="1mins" --executor_shutdown_grace_period="5secs"
--fetcher_cache_dir="/tmp/Endpoint_SlaveEndpointTest_NoAuthorizer_2_Pv8wRv/fetch" --fetcher_cache_size="2GB"
--frameworks_home="" --gc_delay="1weeks" --gc_disk_headroom="0.1" --hadoop_home="" --help="false"
--hostname_lookup="true" --http_authenticators="basic" --http_command_executor="false" --http_credentials="/tmp/Endpoint_SlaveEndpointTest_NoAuthorizer_2_Pv8wRv/http_credentials"
--image_provisioner_backend="copy" --initialize_driver_logging="true" --isolation="posix/cpu,posix/mem"
--launcher="posix" --launcher_dir="/mesos/mesos-1.1.0/_build/src" --logbufsecs="0" --logging_level="INFO"
--max_completed_executors_per_framework="150" --oversubscribed_resources_interval="15secs"
--perf_duration="10secs" --perf_interval="1mins" --qos_correction_interval_min="0ns" --quiet="false"
--recover="reconnect" --recovery_timeout="15mins" --registration_backoff_factor="10ms" --resources="cpus:2;gpus:0;mem:1024;disk:1024;ports:[31000-32000]"
--revocable_cpu_low_priority="true" --runtime_dir="/tmp/Endpoint_SlaveEndpointTest_NoAuthorizer_2_Pv8wRv"
--sandbox_directory="/mnt/mesos/sandbox" --strict="true" --switch_user="true" --systemd_enable_support="true"
--systemd_runtime_directory="/run/systemd/system" --version="false" --work_dir="/tmp/Endpoint_SlaveEndpointTest_NoAuthorizer_2_51OWee"
I1012 19:54:17.561604 28910 credentials.hpp:86] Loading credential for authentication from
'/tmp/Endpoint_SlaveEndpointTest_NoAuthorizer_2_Pv8wRv/credential'
I1012 19:54:17.561811 28910 slave.cpp:346] Agent using credential for: test-principal
I1012 19:54:17.561836 28910 credentials.hpp:37] Loading credentials for authentication from
'/tmp/Endpoint_SlaveEndpointTest_NoAuthorizer_2_Pv8wRv/http_credentials'
I1012 19:54:17.562094 28910 http.cpp:883] Using default 'basic' HTTP authenticator for realm
'mesos-agent-readonly'
I1012 19:54:17.562264 28910 http.cpp:883] Using default 'basic' HTTP authenticator for realm
'mesos-agent-readwrite'
I1012 19:54:17.563266 28910 slave.cpp:533] Agent resources: cpus(*):2; mem(*):1024; disk(*):1024;
ports(*):[31000-32000]
I1012 19:54:17.563344 28910 slave.cpp:541] Agent attributes: [  ]
I1012 19:54:17.563365 28910 slave.cpp:546] Agent hostname: 14f5c996bf27
I1012 19:54:17.564987 28897 state.cpp:57] Recovering state from '/tmp/Endpoint_SlaveEndpointTest_NoAuthorizer_2_51OWee/meta'
I1012 19:54:17.565059 28910 process.cpp:3377] Handling HTTP event for process 'slave(627)'
with path: '/slave(627)/containers'
I1012 19:54:17.566624 28909 status_update_manager.cpp:203] Recovering status update manager
I1012 19:54:17.566969 28910 containerizer.cpp:557] Recovering containerizer
I1012 19:54:17.567291 28899 http.cpp:835] Authorizing principal 'test-principal' to GET the
'/containers' endpoint
I1012 19:54:17.569473 28906 provisioner.cpp:253] Provisioner recovery complete
I1012 19:54:17.570250 28908 slave.cpp:5281] Finished recovery
I1012 19:54:17.570703 28908 slave.cpp:5455] Querying resource estimator for oversubscribable
resources
I1012 19:54:17.571717 28908 slave.cpp:5469] Received oversubscribable resources {} from the
resource estimator
I1012 19:54:17.573282 28897 slave.cpp:787] Agent terminating
[       OK ] Endpoint/SlaveEndpointTest.NoAuthorizer/2 (32 ms)
[----------] 9 tests from Endpoint/SlaveEndpointTest (271 ms total)

[----------] Global test environment tear-down
[==========] 1354 tests from 154 test cases ran. (455719 ms total)
[  PASSED  ] 1352 tests.
[  FAILED  ] 2 tests, listed below:
[  FAILED  ] DiskResource/PersistentVolumeTest.SharedPersistentVolumeRescindOnDestroy/0, where
GetParam() = 0
[  FAILED  ] DiskResource/PersistentVolumeTest.SharedPersistentVolumeRescindOnDestroy/1, where
GetParam() = 1

 2 FAILED TESTS
  YOU HAVE 5 DISABLED TESTS

make[4]: *** [check-local] Error 1
make[4]: Leaving directory `/mesos/mesos-1.1.0/_build/src'
make[3]: *** [check-am] Error 2
make[3]: Leaving directory `/mesos/mesos-1.1.0/_build/src'
make[2]: *** [check] Error 2
make[2]: Leaving directory `/mesos/mesos-1.1.0/_build/src'
make[1]: *** [check-recursive] Error 1
make[1]: Leaving directory `/mesos/mesos-1.1.0/_build'
make: *** [distcheck] Error 1
+ docker rmi mesos-1476299888-32142
Untagged: mesos-1476299888-32142:latest
Deleted: sha256:8857da606f38314749749882cefd0ac861ae8e26b0799ffe9b5a3b5df3c4b762
Deleted: sha256:6a733f15038ed807b0c536ba5e1e557b1b4d3d8dc05a1ddd5a714ee23b6ab840
Deleted: sha256:2b9d5445d75615bef61bebee19be42a131ac1eac79e05e60539a26388dc1ee8e
Deleted: sha256:7c0b8cf7f7cd33a9102084a8ba1e2b11db43a7b9e9c89cbea1f68790eeb352da
Deleted: sha256:2bb87a71b9e68aa35af1fe4bb50fd722a4bbea7313f2c9dca01d054e7478fd1a
Deleted: sha256:6c5fd9d07bca9c717e2b3d04e436760fbfe56299728c950aba7620f63b89e89c
Deleted: sha256:b9e4d17d80b471cf42906d3cdd6d61a7f0c67ab4a342d5075650857b1a314b98
Deleted: sha256:e727d964b5e55fd6a7660034f5c8178cf8137f03b81847731bfd445c918610ee
Deleted: sha256:a0587b5600c436262299d27eb31890d523cbe9cca43d7d3d0cb917d61f4e2738
Deleted: sha256:90f3f160b3b8fd38c60ae5cb567cd2b8f24bee6045720e9519b5301af257bbc3
Deleted: sha256:d640f2b77d00dd0e2892a443898749cac0f51d64bead95bf0ae4cd49231ea14a
Deleted: sha256:4e9ff45831f659730ce533f768c9982f6fbd804b79ebc68fd3a190497a7e9dff
Deleted: sha256:6e2afe6c792d5f1f0cfa201902ab829816c305f64218a8a9e85bd21fbf781583
Deleted: sha256:c81bef0d46ab8d2ac09ca2568d20fcca1a43d92b97313eab7fcb1aa80747bae1
Deleted: sha256:34410c8f649078c2d13f4b6756be51b0cd738bd1067ea30d8dc929b8f6940e08
Deleted: sha256:de5fcf25bcf30426d637a98dcd619949453d93aa6859b522f9d922916ea72083
Deleted: sha256:785e26e997a5cc4a1e71fd11dc3e9b7cb201af003908498ed8a2842176928f6f
Deleted: sha256:340a1962dd16ee79130dbed7b6b1e1744844696169ba1028080fec693fac99c2
Deleted: sha256:47315170e3035a95abf958734d3459d9ad66488d350ee93c93888fcb00b74d55
Deleted: sha256:7f1c1bbd553e4ce4022b8604dfcfdc04411b03e813fd6a9eafb0de5718ea7eaf
Deleted: sha256:7b8952d3e56a19b19b1c02e6aa5fae526d09ef974d419237197a3d98b4078688
Deleted: sha256:698e2fc37c20c632aeb7895856cbe75eeffd26c22ec81db4ebdb271d03643c08
Deleted: sha256:d2c051c9c31824df2632a9c881d73793727509b256b12728c79766f95b9962e6
Deleted: sha256:dd739ed57dd9ca055e8ff8bc0c0f8cc2226221f74f97beafed1b372c63060b17
Build step 'Execute shell' marked build as failure

Mime
View raw message