mesos-builds mailing list archives

Site index · List index
Message view « Date » · « Thread »
Top « Date » · « Thread »
From Anand Mazumdar <an...@mesosphere.io>
Subject Re: Build failed in Jenkins: Mesos » autotools,gcc,--verbose --enable-libevent --enable-ssl,GLOG_v=1 MESOS_VERBOSE=1,ubuntu:14.04,(docker||Hadoop)&&(!ubuntu-us1)&&(!ubuntu-6) #2835
Date Fri, 28 Oct 2016 02:08:33 GMT
Anindya, looks like you added this test. Can you triage?

-anand

> On Oct 27, 2016, at 6:22 PM, Apache Jenkins Server <jenkins@builds.apache.org>
wrote:
> 
> See <https://builds.apache.org/job/Mesos/BUILDTOOL=autotools,COMPILER=gcc,CONFIGURATION=--verbose%20--enable-libevent%20--enable-ssl,ENVIRONMENT=GLOG_v=1%20MESOS_VERBOSE=1,OS=ubuntu%3A14.04,label_exp=(docker%7C%7CHadoop)&&(!ubuntu-us1)&&(!ubuntu-6)/2835/changes>
> 
> Changes:
> 
> [vinodkone] Added MESOS-6446 to CHANGELOG for 1.0.2.
> 
> [vinodkone] Added MESOS-6446 to 1.0.2 CHANGELOG.
> 
> [vinodkone] Revert "Added MESOS-6446 to 1.0.2 CHANGELOG."
> 
> [vinodkone] Added MESOS-6446 to 1.1.0 CHANGELOG.
> 
> [xujyan] Fixed master that leaks empty entries in its hashmaps.
> 
> [xujyan] Avoided CHECK failure with pre-1.0 agents.
> 
> [anand] Added MESOS-6212 to 1.0.2 CHANGELOG.
> 
> ------------------------------------------
> [...truncated 219814 lines...]
> I1028 01:21:24.108597 30664 containerizer.cpp:201] Using isolation: posix/cpu,posix/mem,filesystem/posix,network/cni
> W1028 01:21:24.109261 30664 backend.cpp:76] Failed to create 'aufs' backend: AufsBackend
requires root privileges, but is running as user mesos
> W1028 01:21:24.109421 30664 backend.cpp:76] Failed to create 'bind' backend: BindBackend
requires root privileges
> I1028 01:21:24.112342 30687 slave.cpp:208] Mesos agent started on (635)@172.17.0.2:49160
> I1028 01:21:24.112375 30687 slave.cpp:209] Flags at startup: --acls="" --appc_simple_discovery_uri_prefix="http://"
--appc_store_dir="/tmp/mesos/store/appc" --authenticate_http_readonly="true" --authenticate_http_readwrite="true"
--authenticatee="crammd5" --authentication_backoff_factor="1secs" --authorizer="local" --cgroups_cpu_enable_pids_and_tids_count="false"
--cgroups_enable_cfs="false" --cgroups_hierarchy="/sys/fs/cgroup" --cgroups_limit_swap="false"
--cgroups_root="mesos" --container_disk_watch_interval="15secs" --containerizers="mesos" --credential="/tmp/Endpoint_SlaveEndpointTest_AuthorizedRequest_1_I36Vc7/credential"
--default_role="*" --disk_watch_interval="1mins" --docker="docker" --docker_kill_orphans="true"
--docker_registry="https://registry-1.docker.io" --docker_remove_delay="6hrs" --docker_socket="/var/run/docker.sock"
--docker_stop_timeout="0ns" --docker_store_dir="/tmp/mesos/store/docker" --docker_volume_checkpoint_dir="/var/run/mesos/isolators/docker/volume"
--enforce_container_disk_quota="false" --executor_registration_timeout="1mins" --executor_shutdown_grace_period="5secs"
--fetcher_cache_dir="/tmp/Endpoint_SlaveEndpointTest_AuthorizedRequest_1_I36Vc7/fetch" --fetcher_cache_size="2GB"
--frameworks_home="" --gc_delay="1weeks" --gc_disk_headroom="0.1" --hadoop_home="" --help="false"
--hostname_lookup="true" --http_authenticators="basic" --http_command_executor="false" --http_credentials="/tmp/Endpoint_SlaveEndpointTest_AuthorizedRequest_1_I36Vc7/http_credentials"
--image_provisioner_backend="copy" --initialize_driver_logging="true" --isolation="posix/cpu,posix/mem"
--launcher="posix" --launcher_dir="/mesos/mesos-1.2.0/_build/src" --logbufsecs="0" --logging_level="INFO"
--max_completed_executors_per_framework="150" --oversubscribed_resources_interval="15secs"
--perf_duration="10secs" --perf_interval="1mins" --qos_correction_interval_min="0ns" --quiet="false"
--recover="reconnect" --recovery_timeout="15mins" --registration_backoff_factor="10ms" --resources="cpus:2;gpus:0;mem:1024;disk:1024;ports:[31000-32000]"
--revocable_cpu_low_priority="true" --runtime_dir="/tmp/Endpoint_SlaveEndpointTest_AuthorizedRequest_1_I36Vc7"
--sandbox_directory="/mnt/mesos/sandbox" --strict="true" --switch_user="true" --systemd_enable_support="true"
--systemd_runtime_directory="/run/systemd/system" --version="false" --work_dir="/tmp/Endpoint_SlaveEndpointTest_AuthorizedRequest_1_GA9VWE"
> I1028 01:21:24.113023 30687 credentials.hpp:86] Loading credential for authentication
from '/tmp/Endpoint_SlaveEndpointTest_AuthorizedRequest_1_I36Vc7/credential'
> I1028 01:21:24.113243 30687 slave.cpp:346] Agent using credential for: test-principal
> I1028 01:21:24.113268 30687 credentials.hpp:37] Loading credentials for authentication
from '/tmp/Endpoint_SlaveEndpointTest_AuthorizedRequest_1_I36Vc7/http_credentials'
> I1028 01:21:24.113555 30687 http.cpp:887] Using default 'basic' HTTP authenticator for
realm 'mesos-agent-readonly'
> I1028 01:21:24.113713 30687 http.cpp:887] Using default 'basic' HTTP authenticator for
realm 'mesos-agent-readwrite'
> I1028 01:21:24.115023 30687 slave.cpp:533] Agent resources: cpus(*):2; mem(*):1024; disk(*):1024;
ports(*):[31000-32000]
> I1028 01:21:24.115106 30687 slave.cpp:541] Agent attributes: [  ]
> I1028 01:21:24.115119 30687 slave.cpp:546] Agent hostname: 63e2446152a4
> I1028 01:21:24.116739 30684 state.cpp:57] Recovering state from '/tmp/Endpoint_SlaveEndpointTest_AuthorizedRequest_1_GA9VWE/meta'
> I1028 01:21:24.117059 30694 status_update_manager.cpp:203] Recovering status update manager
> I1028 01:21:24.117277 30689 containerizer.cpp:557] Recovering containerizer
> I1028 01:21:24.118590 30691 provisioner.cpp:253] Provisioner recovery complete
> I1028 01:21:24.118975 30686 slave.cpp:5399] Finished recovery
> I1028 01:21:24.119604 30686 slave.cpp:5573] Querying resource estimator for oversubscribable
resources
> I1028 01:21:24.119933 30694 slave.cpp:5587] Received oversubscribable resources {} from
the resource estimator
> I1028 01:21:24.121840 30697 process.cpp:3570] Handling HTTP event for process 'slave(635)'
with path: '/slave(635)/monitor/statistics.json'
> I1028 01:21:24.122767 30684 http.cpp:839] Authorizing principal 'test-principal' to GET
the '/monitor/statistics.json' endpoint
> I1028 01:21:24.125783 30695 slave.cpp:787] Agent terminating
> [       OK ] Endpoint/SlaveEndpointTest.AuthorizedRequest/1 (27 ms)
> [ RUN      ] Endpoint/SlaveEndpointTest.AuthorizedRequest/2
> I1028 01:21:24.135639 30664 containerizer.cpp:201] Using isolation: posix/cpu,posix/mem,filesystem/posix,network/cni
> W1028 01:21:24.136282 30664 backend.cpp:76] Failed to create 'aufs' backend: AufsBackend
requires root privileges, but is running as user mesos
> W1028 01:21:24.136443 30664 backend.cpp:76] Failed to create 'bind' backend: BindBackend
requires root privileges
> I1028 01:21:24.139462 30692 slave.cpp:208] Mesos agent started on (636)@172.17.0.2:49160
> I1028 01:21:24.139493 30692 slave.cpp:209] Flags at startup: --acls="" --appc_simple_discovery_uri_prefix="http://"
--appc_store_dir="/tmp/mesos/store/appc" --authenticate_http_readonly="true" --authenticate_http_readwrite="true"
--authenticatee="crammd5" --authentication_backoff_factor="1secs" --authorizer="local" --cgroups_cpu_enable_pids_and_tids_count="false"
--cgroups_enable_cfs="false" --cgroups_hierarchy="/sys/fs/cgroup" --cgroups_limit_swap="false"
--cgroups_root="mesos" --container_disk_watch_interval="15secs" --containerizers="mesos" --credential="/tmp/Endpoint_SlaveEndpointTest_AuthorizedRequest_2_6ulZtW/credential"
--default_role="*" --disk_watch_interval="1mins" --docker="docker" --docker_kill_orphans="true"
--docker_registry="https://registry-1.docker.io" --docker_remove_delay="6hrs" --docker_socket="/var/run/docker.sock"
--docker_stop_timeout="0ns" --docker_store_dir="/tmp/mesos/store/docker" --docker_volume_checkpoint_dir="/var/run/mesos/isolators/docker/volume"
--enforce_container_disk_quota="false" --executor_registration_timeout="1mins" --executor_shutdown_grace_period="5secs"
--fetcher_cache_dir="/tmp/Endpoint_SlaveEndpointTest_AuthorizedRequest_2_6ulZtW/fetch" --fetcher_cache_size="2GB"
--frameworks_home="" --gc_delay="1weeks" --gc_disk_headroom="0.1" --hadoop_home="" --help="false"
--hostname_lookup="true" --http_authenticators="basic" --http_command_executor="false" --http_credentials="/tmp/Endpoint_SlaveEndpointTest_AuthorizedRequest_2_6ulZtW/http_credentials"
--image_provisioner_backend="copy" --initialize_driver_logging="true" --isolation="posix/cpu,posix/mem"
--launcher="posix" --launcher_dir="/mesos/mesos-1.2.0/_build/src" --logbufsecs="0" --logging_level="INFO"
--max_completed_executors_per_framework="150" --oversubscribed_resources_interval="15secs"
--perf_duration="10secs" --perf_interval="1mins" --qos_correction_interval_min="0ns" --quiet="false"
--recover="reconnect" --recovery_timeout="15mins" --registration_backoff_factor="10ms" --resources="cpus:2;gpus:0;mem:1024;disk:1024;ports:[31000-32000]"
--revocable_cpu_low_priority="true" --runtime_dir="/tmp/Endpoint_SlaveEndpointTest_AuthorizedRequest_2_6ulZtW"
--sandbox_directory="/mnt/mesos/sandbox" --strict="true" --switch_user="true" --systemd_enable_support="true"
--systemd_runtime_directory="/run/systemd/system" --version="false" --work_dir="/tmp/Endpoint_SlaveEndpointTest_AuthorizedRequest_2_qE8z9t"
> I1028 01:21:24.140095 30692 credentials.hpp:86] Loading credential for authentication
from '/tmp/Endpoint_SlaveEndpointTest_AuthorizedRequest_2_6ulZtW/credential'
> I1028 01:21:24.140373 30692 slave.cpp:346] Agent using credential for: test-principal
> I1028 01:21:24.140398 30692 credentials.hpp:37] Loading credentials for authentication
from '/tmp/Endpoint_SlaveEndpointTest_AuthorizedRequest_2_6ulZtW/http_credentials'
> I1028 01:21:24.140647 30692 http.cpp:887] Using default 'basic' HTTP authenticator for
realm 'mesos-agent-readonly'
> I1028 01:21:24.140800 30692 http.cpp:887] Using default 'basic' HTTP authenticator for
realm 'mesos-agent-readwrite'
> I1028 01:21:24.142349 30692 slave.cpp:533] Agent resources: cpus(*):2; mem(*):1024; disk(*):1024;
ports(*):[31000-32000]
> I1028 01:21:24.142432 30692 slave.cpp:541] Agent attributes: [  ]
> I1028 01:21:24.142447 30692 slave.cpp:546] Agent hostname: 63e2446152a4
> I1028 01:21:24.144052 30685 state.cpp:57] Recovering state from '/tmp/Endpoint_SlaveEndpointTest_AuthorizedRequest_2_qE8z9t/meta'
> I1028 01:21:24.144420 30695 status_update_manager.cpp:203] Recovering status update manager
> I1028 01:21:24.144700 30696 containerizer.cpp:557] Recovering containerizer
> I1028 01:21:24.146144 30686 provisioner.cpp:253] Provisioner recovery complete
> I1028 01:21:24.146697 30685 slave.cpp:5399] Finished recovery
> I1028 01:21:24.147238 30685 slave.cpp:5573] Querying resource estimator for oversubscribable
resources
> I1028 01:21:24.147513 30696 slave.cpp:5587] Received oversubscribable resources {} from
the resource estimator
> I1028 01:21:24.149405 30694 process.cpp:3570] Handling HTTP event for process 'slave(636)'
with path: '/slave(636)/containers'
> I1028 01:21:24.150315 30695 http.cpp:839] Authorizing principal 'test-principal' to GET
the '/containers' endpoint
> I1028 01:21:24.153540 30695 slave.cpp:787] Agent terminating
> [       OK ] Endpoint/SlaveEndpointTest.AuthorizedRequest/2 (28 ms)
> [ RUN      ] Endpoint/SlaveEndpointTest.UnauthorizedRequest/0
> I1028 01:21:24.163161 30664 containerizer.cpp:201] Using isolation: posix/cpu,posix/mem,filesystem/posix,network/cni
> W1028 01:21:24.163774 30664 backend.cpp:76] Failed to create 'aufs' backend: AufsBackend
requires root privileges, but is running as user mesos
> W1028 01:21:24.163935 30664 backend.cpp:76] Failed to create 'bind' backend: BindBackend
requires root privileges
> I1028 01:21:24.166837 30689 slave.cpp:208] Mesos agent started on (637)@172.17.0.2:49160
> I1028 01:21:24.166872 30689 slave.cpp:209] Flags at startup: --acls="" --appc_simple_discovery_uri_prefix="http://"
--appc_store_dir="/tmp/mesos/store/appc" --authenticate_http_readonly="true" --authenticate_http_readwrite="true"
--authenticatee="crammd5" --authentication_backoff_factor="1secs" --authorizer="local" --cgroups_cpu_enable_pids_and_tids_count="false"
--cgroups_enable_cfs="false" --cgroups_hierarchy="/sys/fs/cgroup" --cgroups_limit_swap="false"
--cgroups_root="mesos" --container_disk_watch_interval="15secs" --containerizers="mesos" --credential="/tmp/Endpoint_SlaveEndpointTest_UnauthorizedRequest_0_g3o42L/credential"
--default_role="*" --disk_watch_interval="1mins" --docker="docker" --docker_kill_orphans="true"
--docker_registry="https://registry-1.docker.io" --docker_remove_delay="6hrs" --docker_socket="/var/run/docker.sock"
--docker_stop_timeout="0ns" --docker_store_dir="/tmp/mesos/store/docker" --docker_volume_checkpoint_dir="/var/run/mesos/isolators/docker/volume"
--enforce_container_disk_quota="false" --executor_registration_timeout="1mins" --executor_shutdown_grace_period="5secs"
--fetcher_cache_dir="/tmp/Endpoint_SlaveEndpointTest_UnauthorizedRequest_0_g3o42L/fetch" --fetcher_cache_size="2GB"
--frameworks_home="" --gc_delay="1weeks" --gc_disk_headroom="0.1" --hadoop_home="" --help="false"
--hostname_lookup="true" --http_authenticators="basic" --http_command_executor="false" --http_credentials="/tmp/Endpoint_SlaveEndpointTest_UnauthorizedRequest_0_g3o42L/http_credentials"
--image_provisioner_backend="copy" --initialize_driver_logging="true" --isolation="posix/cpu,posix/mem"
--launcher="posix" --launcher_dir="/mesos/mesos-1.2.0/_build/src" --logbufsecs="0" --logging_level="INFO"
--max_completed_executors_per_framework="150" --oversubscribed_resources_interval="15secs"
--perf_duration="10secs" --perf_interval="1mins" --qos_correction_interval_min="0ns" --quiet="false"
--recover="reconnect" --recovery_timeout="15mins" --registration_backoff_factor="10ms" --resources="cpus:2;gpus:0;mem:1024;disk:1024;ports:[31000-32000]"
--revocable_cpu_low_priority="true" --runtime_dir="/tmp/Endpoint_SlaveEndpointTest_UnauthorizedRequest_0_g3o42L"
--sandbox_directory="/mnt/mesos/sandbox" --strict="true" --switch_user="true" --systemd_enable_support="true"
--systemd_runtime_directory="/run/systemd/system" --version="false" --work_dir="/tmp/Endpoint_SlaveEndpointTest_UnauthorizedRequest_0_OFF9Dj"
> I1028 01:21:24.167441 30689 credentials.hpp:86] Loading credential for authentication
from '/tmp/Endpoint_SlaveEndpointTest_UnauthorizedRequest_0_g3o42L/credential'
> I1028 01:21:24.167680 30689 slave.cpp:346] Agent using credential for: test-principal
> I1028 01:21:24.167703 30689 credentials.hpp:37] Loading credentials for authentication
from '/tmp/Endpoint_SlaveEndpointTest_UnauthorizedRequest_0_g3o42L/http_credentials'
> I1028 01:21:24.167969 30689 http.cpp:887] Using default 'basic' HTTP authenticator for
realm 'mesos-agent-readonly'
> I1028 01:21:24.168131 30689 http.cpp:887] Using default 'basic' HTTP authenticator for
realm 'mesos-agent-readwrite'
> I1028 01:21:24.169304 30689 slave.cpp:533] Agent resources: cpus(*):2; mem(*):1024; disk(*):1024;
ports(*):[31000-32000]
> I1028 01:21:24.169387 30689 slave.cpp:541] Agent attributes: [  ]
> I1028 01:21:24.169409 30689 slave.cpp:546] Agent hostname: 63e2446152a4
> I1028 01:21:24.171085 30695 state.cpp:57] Recovering state from '/tmp/Endpoint_SlaveEndpointTest_UnauthorizedRequest_0_OFF9Dj/meta'
> I1028 01:21:24.171412 30696 status_update_manager.cpp:203] Recovering status update manager
> I1028 01:21:24.171694 30685 containerizer.cpp:557] Recovering containerizer
> I1028 01:21:24.173089 30696 provisioner.cpp:253] Provisioner recovery complete
> I1028 01:21:24.173554 30684 slave.cpp:5399] Finished recovery
> I1028 01:21:24.174238 30684 slave.cpp:5573] Querying resource estimator for oversubscribable
resources
> I1028 01:21:24.174512 30689 slave.cpp:5587] Received oversubscribable resources {} from
the resource estimator
> I1028 01:21:24.176306 30694 process.cpp:3570] Handling HTTP event for process 'slave(637)'
with path: '/slave(637)/monitor/statistics'
> I1028 01:21:24.177603 30688 http.cpp:839] Authorizing principal 'test-principal' to GET
the '/monitor/statistics' endpoint
> I1028 01:21:24.179911 30683 slave.cpp:787] Agent terminating
> [       OK ] Endpoint/SlaveEndpointTest.UnauthorizedRequest/0 (26 ms)
> [ RUN      ] Endpoint/SlaveEndpointTest.UnauthorizedRequest/1
> I1028 01:21:24.189281 30664 containerizer.cpp:201] Using isolation: posix/cpu,posix/mem,filesystem/posix,network/cni
> W1028 01:21:24.189898 30664 backend.cpp:76] Failed to create 'aufs' backend: AufsBackend
requires root privileges, but is running as user mesos
> W1028 01:21:24.190047 30664 backend.cpp:76] Failed to create 'bind' backend: BindBackend
requires root privileges
> I1028 01:21:24.192890 30696 slave.cpp:208] Mesos agent started on (638)@172.17.0.2:49160
> I1028 01:21:24.192919 30696 slave.cpp:209] Flags at startup: --acls="" --appc_simple_discovery_uri_prefix="http://"
--appc_store_dir="/tmp/mesos/store/appc" --authenticate_http_readonly="true" --authenticate_http_readwrite="true"
--authenticatee="crammd5" --authentication_backoff_factor="1secs" --authorizer="local" --cgroups_cpu_enable_pids_and_tids_count="false"
--cgroups_enable_cfs="false" --cgroups_hierarchy="/sys/fs/cgroup" --cgroups_limit_swap="false"
--cgroups_root="mesos" --container_disk_watch_interval="15secs" --containerizers="mesos" --credential="/tmp/Endpoint_SlaveEndpointTest_UnauthorizedRequest_1_m7IlTB/credential"
--default_role="*" --disk_watch_interval="1mins" --docker="docker" --docker_kill_orphans="true"
--docker_registry="https://registry-1.docker.io" --docker_remove_delay="6hrs" --docker_socket="/var/run/docker.sock"
--docker_stop_timeout="0ns" --docker_store_dir="/tmp/mesos/store/docker" --docker_volume_checkpoint_dir="/var/run/mesos/isolators/docker/volume"
--enforce_container_disk_quota="false" --executor_registration_timeout="1mins" --executor_shutdown_grace_period="5secs"
--fetcher_cache_dir="/tmp/Endpoint_SlaveEndpointTest_UnauthorizedRequest_1_m7IlTB/fetch" --fetcher_cache_size="2GB"
--frameworks_home="" --gc_delay="1weeks" --gc_disk_headroom="0.1" --hadoop_home="" --help="false"
--hostname_lookup="true" --http_authenticators="basic" --http_command_executor="false" --http_credentials="/tmp/Endpoint_SlaveEndpointTest_UnauthorizedRequest_1_m7IlTB/http_credentials"
--image_provisioner_backend="copy" --initialize_driver_logging="true" --isolation="posix/cpu,posix/mem"
--launcher="posix" --launcher_dir="/mesos/mesos-1.2.0/_build/src" --logbufsecs="0" --logging_level="INFO"
--max_completed_executors_per_framework="150" --oversubscribed_resources_interval="15secs"
--perf_duration="10secs" --perf_interval="1mins" --qos_correction_interval_min="0ns" --quiet="false"
--recover="reconnect" --recovery_timeout="15mins" --registration_backoff_factor="10ms" --resources="cpus:2;gpus:0;mem:1024;disk:1024;ports:[31000-32000]"
--revocable_cpu_low_priority="true" --runtime_dir="/tmp/Endpoint_SlaveEndpointTest_UnauthorizedRequest_1_m7IlTB"
--sandbox_directory="/mnt/mesos/sandbox" --strict="true" --switch_user="true" --systemd_enable_support="true"
--systemd_runtime_directory="/run/systemd/system" --version="false" --work_dir="/tmp/Endpoint_SlaveEndpointTest_UnauthorizedRequest_1_6r29p9"
> I1028 01:21:24.193481 30696 credentials.hpp:86] Loading credential for authentication
from '/tmp/Endpoint_SlaveEndpointTest_UnauthorizedRequest_1_m7IlTB/credential'
> I1028 01:21:24.193752 30696 slave.cpp:346] Agent using credential for: test-principal
> I1028 01:21:24.193774 30696 credentials.hpp:37] Loading credentials for authentication
from '/tmp/Endpoint_SlaveEndpointTest_UnauthorizedRequest_1_m7IlTB/http_credentials'
> I1028 01:21:24.194052 30696 http.cpp:887] Using default 'basic' HTTP authenticator for
realm 'mesos-agent-readonly'
> I1028 01:21:24.194222 30696 http.cpp:887] Using default 'basic' HTTP authenticator for
realm 'mesos-agent-readwrite'
> I1028 01:21:24.195874 30696 slave.cpp:533] Agent resources: cpus(*):2; mem(*):1024; disk(*):1024;
ports(*):[31000-32000]
> I1028 01:21:24.195958 30696 slave.cpp:541] Agent attributes: [  ]
> I1028 01:21:24.195971 30696 slave.cpp:546] Agent hostname: 63e2446152a4
> I1028 01:21:24.197737 30683 state.cpp:57] Recovering state from '/tmp/Endpoint_SlaveEndpointTest_UnauthorizedRequest_1_6r29p9/meta'
> I1028 01:21:24.198007 30698 status_update_manager.cpp:203] Recovering status update manager
> I1028 01:21:24.198220 30696 containerizer.cpp:557] Recovering containerizer
> I1028 01:21:24.199546 30689 provisioner.cpp:253] Provisioner recovery complete
> I1028 01:21:24.200000 30684 slave.cpp:5399] Finished recovery
> I1028 01:21:24.200645 30684 slave.cpp:5573] Querying resource estimator for oversubscribable
resources
> I1028 01:21:24.201005 30692 slave.cpp:5587] Received oversubscribable resources {} from
the resource estimator
> I1028 01:21:24.202781 30697 process.cpp:3570] Handling HTTP event for process 'slave(638)'
with path: '/slave(638)/monitor/statistics.json'
> I1028 01:21:24.203836 30687 http.cpp:839] Authorizing principal 'test-principal' to GET
the '/monitor/statistics.json' endpoint
> I1028 01:21:24.206117 30683 slave.cpp:787] Agent terminating
> [       OK ] Endpoint/SlaveEndpointTest.UnauthorizedRequest/1 (26 ms)
> [ RUN      ] Endpoint/SlaveEndpointTest.UnauthorizedRequest/2
> I1028 01:21:24.216498 30664 containerizer.cpp:201] Using isolation: posix/cpu,posix/mem,filesystem/posix,network/cni
> W1028 01:21:24.217176 30664 backend.cpp:76] Failed to create 'aufs' backend: AufsBackend
requires root privileges, but is running as user mesos
> W1028 01:21:24.217324 30664 backend.cpp:76] Failed to create 'bind' backend: BindBackend
requires root privileges
> I1028 01:21:24.220237 30697 slave.cpp:208] Mesos agent started on (639)@172.17.0.2:49160
> I1028 01:21:24.220258 30697 slave.cpp:209] Flags at startup: --acls="" --appc_simple_discovery_uri_prefix="http://"
--appc_store_dir="/tmp/mesos/store/appc" --authenticate_http_readonly="true" --authenticate_http_readwrite="true"
--authenticatee="crammd5" --authentication_backoff_factor="1secs" --authorizer="local" --cgroups_cpu_enable_pids_and_tids_count="false"
--cgroups_enable_cfs="false" --cgroups_hierarchy="/sys/fs/cgroup" --cgroups_limit_swap="false"
--cgroups_root="mesos" --container_disk_watch_interval="15secs" --containerizers="mesos" --credential="/tmp/Endpoint_SlaveEndpointTest_UnauthorizedRequest_2_Ur360r/credential"
--default_role="*" --disk_watch_interval="1mins" --docker="docker" --docker_kill_orphans="true"
--docker_registry="https://registry-1.docker.io" --docker_remove_delay="6hrs" --docker_socket="/var/run/docker.sock"
--docker_stop_timeout="0ns" --docker_store_dir="/tmp/mesos/store/docker" --docker_volume_checkpoint_dir="/var/run/mesos/isolators/docker/volume"
--enforce_container_disk_quota="false" --executor_registration_timeout="1mins" --executor_shutdown_grace_period="5secs"
--fetcher_cache_dir="/tmp/Endpoint_SlaveEndpointTest_UnauthorizedRequest_2_Ur360r/fetch" --fetcher_cache_size="2GB"
--frameworks_home="" --gc_delay="1weeks" --gc_disk_headroom="0.1" --hadoop_home="" --help="false"
--hostname_lookup="true" --http_authenticators="basic" --http_command_executor="false" --http_credentials="/tmp/Endpoint_SlaveEndpointTest_UnauthorizedRequest_2_Ur360r/http_credentials"
--image_provisioner_backend="copy" --initialize_driver_logging="true" --isolation="posix/cpu,posix/mem"
--launcher="posix" --launcher_dir="/mesos/mesos-1.2.0/_build/src" --logbufsecs="0" --logging_level="INFO"
--max_completed_executors_per_framework="150" --oversubscribed_resources_interval="15secs"
--perf_duration="10secs" --perf_interval="1mins" --qos_correction_interval_min="0ns" --quiet="false"
--recover="reconnect" --recovery_timeout="15mins" --registration_backoff_factor="10ms" --resources="cpus:2;gpus:0;mem:1024;disk:1024;ports:[31000-32000]"
--revocable_cpu_low_priority="true" --runtime_dir="/tmp/Endpoint_SlaveEndpointTest_UnauthorizedRequest_2_Ur360r"
--sandbox_directory="/mnt/mesos/sandbox" --strict="true" --switch_user="true" --systemd_enable_support="true"
--systemd_runtime_directory="/run/systemd/system" --version="false" --work_dir="/tmp/Endpoint_SlaveEndpointTest_UnauthorizedRequest_2_U1BwtZ"
> I1028 01:21:24.220819 30697 credentials.hpp:86] Loading credential for authentication
from '/tmp/Endpoint_SlaveEndpointTest_UnauthorizedRequest_2_Ur360r/credential'
> I1028 01:21:24.221040 30697 slave.cpp:346] Agent using credential for: test-principal
> I1028 01:21:24.221062 30697 credentials.hpp:37] Loading credentials for authentication
from '/tmp/Endpoint_SlaveEndpointTest_UnauthorizedRequest_2_Ur360r/http_credentials'
> I1028 01:21:24.221312 30697 http.cpp:887] Using default 'basic' HTTP authenticator for
realm 'mesos-agent-readonly'
> I1028 01:21:24.221459 30697 http.cpp:887] Using default 'basic' HTTP authenticator for
realm 'mesos-agent-readwrite'
> I1028 01:21:24.222522 30697 slave.cpp:533] Agent resources: cpus(*):2; mem(*):1024; disk(*):1024;
ports(*):[31000-32000]
> I1028 01:21:24.222599 30697 slave.cpp:541] Agent attributes: [  ]
> I1028 01:21:24.222611 30697 slave.cpp:546] Agent hostname: 63e2446152a4
> I1028 01:21:24.224133 30695 state.cpp:57] Recovering state from '/tmp/Endpoint_SlaveEndpointTest_UnauthorizedRequest_2_U1BwtZ/meta'
> I1028 01:21:24.224458 30694 status_update_manager.cpp:203] Recovering status update manager
> I1028 01:21:24.224748 30684 containerizer.cpp:557] Recovering containerizer
> I1028 01:21:24.226119 30697 provisioner.cpp:253] Provisioner recovery complete
> I1028 01:21:24.226533 30690 slave.cpp:5399] Finished recovery
> I1028 01:21:24.227156 30690 slave.cpp:5573] Querying resource estimator for oversubscribable
resources
> I1028 01:21:24.227442 30687 slave.cpp:5587] Received oversubscribable resources {} from
the resource estimator
> I1028 01:21:24.228785 30689 process.cpp:3570] Handling HTTP event for process 'slave(639)'
with path: '/slave(639)/containers'
> I1028 01:21:24.229677 30698 http.cpp:839] Authorizing principal 'test-principal' to GET
the '/containers' endpoint
> I1028 01:21:24.232013 30692 slave.cpp:787] Agent terminating
> [       OK ] Endpoint/SlaveEndpointTest.UnauthorizedRequest/2 (24 ms)
> [ RUN      ] Endpoint/SlaveEndpointTest.NoAuthorizer/0
> I1028 01:21:24.241032 30664 containerizer.cpp:201] Using isolation: posix/cpu,posix/mem,filesystem/posix,network/cni
> W1028 01:21:24.241601 30664 backend.cpp:76] Failed to create 'aufs' backend: AufsBackend
requires root privileges, but is running as user mesos
> W1028 01:21:24.241767 30664 backend.cpp:76] Failed to create 'bind' backend: BindBackend
requires root privileges
> I1028 01:21:24.243165 30664 cluster.cpp:435] Creating default 'local' authorizer
> I1028 01:21:24.244730 30690 slave.cpp:208] Mesos agent started on (640)@172.17.0.2:49160
> I1028 01:21:24.244752 30690 slave.cpp:209] Flags at startup: --acls="" --appc_simple_discovery_uri_prefix="http://"
--appc_store_dir="/tmp/mesos/store/appc" --authenticate_http_readonly="true" --authenticate_http_readwrite="true"
--authenticatee="crammd5" --authentication_backoff_factor="1secs" --authorizer="local" --cgroups_cpu_enable_pids_and_tids_count="false"
--cgroups_enable_cfs="false" --cgroups_hierarchy="/sys/fs/cgroup" --cgroups_limit_swap="false"
--cgroups_root="mesos" --container_disk_watch_interval="15secs" --containerizers="mesos" --credential="/tmp/Endpoint_SlaveEndpointTest_NoAuthorizer_0_Gg4dpi/credential"
--default_role="*" --disk_watch_interval="1mins" --docker="docker" --docker_kill_orphans="true"
--docker_registry="https://registry-1.docker.io" --docker_remove_delay="6hrs" --docker_socket="/var/run/docker.sock"
--docker_stop_timeout="0ns" --docker_store_dir="/tmp/mesos/store/docker" --docker_volume_checkpoint_dir="/var/run/mesos/isolators/docker/volume"
--enforce_container_disk_quota="false" --executor_registration_timeout="1mins" --executor_shutdown_grace_period="5secs"
--fetcher_cache_dir="/tmp/Endpoint_SlaveEndpointTest_NoAuthorizer_0_Gg4dpi/fetch" --fetcher_cache_size="2GB"
--frameworks_home="" --gc_delay="1weeks" --gc_disk_headroom="0.1" --hadoop_home="" --help="false"
--hostname_lookup="true" --http_authenticators="basic" --http_command_executor="false" --http_credentials="/tmp/Endpoint_SlaveEndpointTest_NoAuthorizer_0_Gg4dpi/http_credentials"
--image_provisioner_backend="copy" --initialize_driver_logging="true" --isolation="posix/cpu,posix/mem"
--launcher="posix" --launcher_dir="/mesos/mesos-1.2.0/_build/src" --logbufsecs="0" --logging_level="INFO"
--max_completed_executors_per_framework="150" --oversubscribed_resources_interval="15secs"
--perf_duration="10secs" --perf_interval="1mins" --qos_correction_interval_min="0ns" --quiet="false"
--recover="reconnect" --recovery_timeout="15mins" --registration_backoff_factor="10ms" --resources="cpus:2;gpus:0;mem:1024;disk:1024;ports:[31000-32000]"
--revocable_cpu_low_priority="true" --runtime_dir="/tmp/Endpoint_SlaveEndpointTest_NoAuthorizer_0_Gg4dpi"
--sandbox_directory="/mnt/mesos/sandbox" --strict="true" --switch_user="true" --systemd_enable_support="true"
--systemd_runtime_directory="/run/systemd/system" --version="false" --work_dir="/tmp/Endpoint_SlaveEndpointTest_NoAuthorizer_0_YWSDNP"
> I1028 01:21:24.245337 30690 credentials.hpp:86] Loading credential for authentication
from '/tmp/Endpoint_SlaveEndpointTest_NoAuthorizer_0_Gg4dpi/credential'
> I1028 01:21:24.245473 30690 slave.cpp:346] Agent using credential for: test-principal
> I1028 01:21:24.245493 30690 credentials.hpp:37] Loading credentials for authentication
from '/tmp/Endpoint_SlaveEndpointTest_NoAuthorizer_0_Gg4dpi/http_credentials'
> I1028 01:21:24.245693 30690 http.cpp:887] Using default 'basic' HTTP authenticator for
realm 'mesos-agent-readonly'
> I1028 01:21:24.245810 30690 http.cpp:887] Using default 'basic' HTTP authenticator for
realm 'mesos-agent-readwrite'
> I1028 01:21:24.246927 30690 slave.cpp:533] Agent resources: cpus(*):2; mem(*):1024; disk(*):1024;
ports(*):[31000-32000]
> I1028 01:21:24.247023 30690 slave.cpp:541] Agent attributes: [  ]
> I1028 01:21:24.247042 30690 slave.cpp:546] Agent hostname: 63e2446152a4
> I1028 01:21:24.248394 30685 state.cpp:57] Recovering state from '/tmp/Endpoint_SlaveEndpointTest_NoAuthorizer_0_YWSDNP/meta'
> I1028 01:21:24.248726 30696 status_update_manager.cpp:203] Recovering status update manager
> I1028 01:21:24.249018 30696 containerizer.cpp:557] Recovering containerizer
> I1028 01:21:24.250308 30692 provisioner.cpp:253] Provisioner recovery complete
> I1028 01:21:24.250685 30683 slave.cpp:5399] Finished recovery
> I1028 01:21:24.251184 30683 slave.cpp:5573] Querying resource estimator for oversubscribable
resources
> I1028 01:21:24.251512 30683 slave.cpp:5587] Received oversubscribable resources {} from
the resource estimator
> I1028 01:21:24.253015 30684 process.cpp:3570] Handling HTTP event for process 'slave(640)'
with path: '/slave(640)/monitor/statistics'
> I1028 01:21:24.253958 30697 http.cpp:839] Authorizing principal 'test-principal' to GET
the '/monitor/statistics' endpoint
> I1028 01:21:24.257179 30695 slave.cpp:787] Agent terminating
> [       OK ] Endpoint/SlaveEndpointTest.NoAuthorizer/0 (25 ms)
> [ RUN      ] Endpoint/SlaveEndpointTest.NoAuthorizer/1
> I1028 01:21:24.266252 30664 containerizer.cpp:201] Using isolation: posix/cpu,posix/mem,filesystem/posix,network/cni
> W1028 01:21:24.266780 30664 backend.cpp:76] Failed to create 'aufs' backend: AufsBackend
requires root privileges, but is running as user mesos
> W1028 01:21:24.266916 30664 backend.cpp:76] Failed to create 'bind' backend: BindBackend
requires root privileges
> I1028 01:21:24.268213 30664 cluster.cpp:435] Creating default 'local' authorizer
> I1028 01:21:24.269599 30688 slave.cpp:208] Mesos agent started on (641)@172.17.0.2:49160
> I1028 01:21:24.269619 30688 slave.cpp:209] Flags at startup: --acls="" --appc_simple_discovery_uri_prefix="http://"
--appc_store_dir="/tmp/mesos/store/appc" --authenticate_http_readonly="true" --authenticate_http_readwrite="true"
--authenticatee="crammd5" --authentication_backoff_factor="1secs" --authorizer="local" --cgroups_cpu_enable_pids_and_tids_count="false"
--cgroups_enable_cfs="false" --cgroups_hierarchy="/sys/fs/cgroup" --cgroups_limit_swap="false"
--cgroups_root="mesos" --container_disk_watch_interval="15secs" --containerizers="mesos" --credential="/tmp/Endpoint_SlaveEndpointTest_NoAuthorizer_1_YfPz38/credential"
--default_role="*" --disk_watch_interval="1mins" --docker="docker" --docker_kill_orphans="true"
--docker_registry="https://registry-1.docker.io" --docker_remove_delay="6hrs" --docker_socket="/var/run/docker.sock"
--docker_stop_timeout="0ns" --docker_store_dir="/tmp/mesos/store/docker" --docker_volume_checkpoint_dir="/var/run/mesos/isolators/docker/volume"
--enforce_container_disk_quota="false" --executor_registration_timeout="1mins" --executor_shutdown_grace_period="5secs"
--fetcher_cache_dir="/tmp/Endpoint_SlaveEndpointTest_NoAuthorizer_1_YfPz38/fetch" --fetcher_cache_size="2GB"
--frameworks_home="" --gc_delay="1weeks" --gc_disk_headroom="0.1" --hadoop_home="" --help="false"
--hostname_lookup="true" --http_authenticators="basic" --http_command_executor="false" --http_credentials="/tmp/Endpoint_SlaveEndpointTest_NoAuthorizer_1_YfPz38/http_credentials"
--image_provisioner_backend="copy" --initialize_driver_logging="true" --isolation="posix/cpu,posix/mem"
--launcher="posix" --launcher_dir="/mesos/mesos-1.2.0/_build/src" --logbufsecs="0" --logging_level="INFO"
--max_completed_executors_per_framework="150" --oversubscribed_resources_interval="15secs"
--perf_duration="10secs" --perf_interval="1mins" --qos_correction_interval_min="0ns" --quiet="false"
--recover="reconnect" --recovery_timeout="15mins" --registration_backoff_factor="10ms" --resources="cpus:2;gpus:0;mem:1024;disk:1024;ports:[31000-32000]"
--revocable_cpu_low_priority="true" --runtime_dir="/tmp/Endpoint_SlaveEndpointTest_NoAuthorizer_1_YfPz38"
--sandbox_directory="/mnt/mesos/sandbox" --strict="true" --switch_user="true" --systemd_enable_support="true"
--systemd_runtime_directory="/run/systemd/system" --version="false" --work_dir="/tmp/Endpoint_SlaveEndpointTest_NoAuthorizer_1_4k6SnG"
> I1028 01:21:24.270104 30688 credentials.hpp:86] Loading credential for authentication
from '/tmp/Endpoint_SlaveEndpointTest_NoAuthorizer_1_YfPz38/credential'
> I1028 01:21:24.270259 30688 slave.cpp:346] Agent using credential for: test-principal
> I1028 01:21:24.270282 30688 credentials.hpp:37] Loading credentials for authentication
from '/tmp/Endpoint_SlaveEndpointTest_NoAuthorizer_1_YfPz38/http_credentials'
> I1028 01:21:24.270498 30688 http.cpp:887] Using default 'basic' HTTP authenticator for
realm 'mesos-agent-readonly'
> I1028 01:21:24.270630 30688 http.cpp:887] Using default 'basic' HTTP authenticator for
realm 'mesos-agent-readwrite'
> I1028 01:21:24.271584 30688 slave.cpp:533] Agent resources: cpus(*):2; mem(*):1024; disk(*):1024;
ports(*):[31000-32000]
> I1028 01:21:24.271657 30688 slave.cpp:541] Agent attributes: [  ]
> I1028 01:21:24.271670 30688 slave.cpp:546] Agent hostname: 63e2446152a4
> I1028 01:21:24.272992 30687 state.cpp:57] Recovering state from '/tmp/Endpoint_SlaveEndpointTest_NoAuthorizer_1_4k6SnG/meta'
> I1028 01:21:24.273249 30693 status_update_manager.cpp:203] Recovering status update manager
> I1028 01:21:24.273442 30686 containerizer.cpp:557] Recovering containerizer
> I1028 01:21:24.274628 30687 provisioner.cpp:253] Provisioner recovery complete
> I1028 01:21:24.275050 30692 slave.cpp:5399] Finished recovery
> I1028 01:21:24.275539 30692 slave.cpp:5573] Querying resource estimator for oversubscribable
resources
> I1028 01:21:24.275836 30688 slave.cpp:5587] Received oversubscribable resources {} from
the resource estimator
> I1028 01:21:24.277413 30683 process.cpp:3570] Handling HTTP event for process 'slave(641)'
with path: '/slave(641)/monitor/statistics.json'
> I1028 01:21:24.278401 30684 http.cpp:839] Authorizing principal 'test-principal' to GET
the '/monitor/statistics.json' endpoint
> I1028 01:21:24.281721 30697 slave.cpp:787] Agent terminating
> [       OK ] Endpoint/SlaveEndpointTest.NoAuthorizer/1 (24 ms)
> [ RUN      ] Endpoint/SlaveEndpointTest.NoAuthorizer/2
> I1028 01:21:24.290940 30664 containerizer.cpp:201] Using isolation: posix/cpu,posix/mem,filesystem/posix,network/cni
> W1028 01:21:24.291592 30664 backend.cpp:76] Failed to create 'aufs' backend: AufsBackend
requires root privileges, but is running as user mesos
> W1028 01:21:24.291761 30664 backend.cpp:76] Failed to create 'bind' backend: BindBackend
requires root privileges
> I1028 01:21:24.293066 30664 cluster.cpp:435] Creating default 'local' authorizer
> I1028 01:21:24.294405 30693 slave.cpp:208] Mesos agent started on (642)@172.17.0.2:49160
> I1028 01:21:24.294505 30693 slave.cpp:209] Flags at startup: --acls="" --appc_simple_discovery_uri_prefix="http://"
--appc_store_dir="/tmp/mesos/store/appc" --authenticate_http_readonly="true" --authenticate_http_readwrite="true"
--authenticatee="crammd5" --authentication_backoff_factor="1secs" --authorizer="local" --cgroups_cpu_enable_pids_and_tids_count="false"
--cgroups_enable_cfs="false" --cgroups_hierarchy="/sys/fs/cgroup" --cgroups_limit_swap="false"
--cgroups_root="mesos" --container_disk_watch_interval="15secs" --containerizers="mesos" --credential="/tmp/Endpoint_SlaveEndpointTest_NoAuthorizer_2_IEcIXZ/credential"
--default_role="*" --disk_watch_interval="1mins" --docker="docker" --docker_kill_orphans="true"
--docker_registry="https://registry-1.docker.io" --docker_remove_delay="6hrs" --docker_socket="/var/run/docker.sock"
--docker_stop_timeout="0ns" --docker_store_dir="/tmp/mesos/store/docker" --docker_volume_checkpoint_dir="/var/run/mesos/isolators/docker/volume"
--enforce_container_disk_quota="false" --executor_registration_timeout="1mins" --executor_shutdown_grace_period="5secs"
--fetcher_cache_dir="/tmp/Endpoint_SlaveEndpointTest_NoAuthorizer_2_IEcIXZ/fetch" --fetcher_cache_size="2GB"
--frameworks_home="" --gc_delay="1weeks" --gc_disk_headroom="0.1" --hadoop_home="" --help="false"
--hostname_lookup="true" --http_authenticators="basic" --http_command_executor="false" --http_credentials="/tmp/Endpoint_SlaveEndpointTest_NoAuthorizer_2_IEcIXZ/http_credentials"
--image_provisioner_backend="copy" --initialize_driver_logging="true" --isolation="posix/cpu,posix/mem"
--launcher="posix" --launcher_dir="/mesos/mesos-1.2.0/_build/src" --logbufsecs="0" --logging_level="INFO"
--max_completed_executors_per_framework="150" --oversubscribed_resources_interval="15secs"
--perf_duration="10secs" --perf_interval="1mins" --qos_correction_interval_min="0ns" --quiet="false"
--recover="reconnect" --recovery_timeout="15mins" --registration_backoff_factor="10ms" --resources="cpus:2;gpus:0;mem:1024;disk:1024;ports:[31000-32000]"
--revocable_cpu_low_priority="true" --runtime_dir="/tmp/Endpoint_SlaveEndpointTest_NoAuthorizer_2_IEcIXZ"
--sandbox_directory="/mnt/mesos/sandbox" --strict="true" --switch_user="true" --systemd_enable_support="true"
--systemd_runtime_directory="/run/systemd/system" --version="false" --work_dir="/tmp/Endpoint_SlaveEndpointTest_NoAuthorizer_2_IRJ4dx"
> I1028 01:21:24.295017 30693 credentials.hpp:86] Loading credential for authentication
from '/tmp/Endpoint_SlaveEndpointTest_NoAuthorizer_2_IEcIXZ/credential'
> I1028 01:21:24.295166 30693 slave.cpp:346] Agent using credential for: test-principal
> I1028 01:21:24.295191 30693 credentials.hpp:37] Loading credentials for authentication
from '/tmp/Endpoint_SlaveEndpointTest_NoAuthorizer_2_IEcIXZ/http_credentials'
> I1028 01:21:24.295403 30693 http.cpp:887] Using default 'basic' HTTP authenticator for
realm 'mesos-agent-readonly'
> I1028 01:21:24.295524 30693 http.cpp:887] Using default 'basic' HTTP authenticator for
realm 'mesos-agent-readwrite'
> I1028 01:21:24.296461 30693 slave.cpp:533] Agent resources: cpus(*):2; mem(*):1024; disk(*):1024;
ports(*):[31000-32000]
> I1028 01:21:24.296540 30693 slave.cpp:541] Agent attributes: [  ]
> I1028 01:21:24.296562 30693 slave.cpp:546] Agent hostname: 63e2446152a4
> I1028 01:21:24.298050 30695 state.cpp:57] Recovering state from '/tmp/Endpoint_SlaveEndpointTest_NoAuthorizer_2_IRJ4dx/meta'
> I1028 01:21:24.298357 30697 status_update_manager.cpp:203] Recovering status update manager
> I1028 01:21:24.298537 30698 containerizer.cpp:557] Recovering containerizer
> I1028 01:21:24.299736 30694 provisioner.cpp:253] Provisioner recovery complete
> I1028 01:21:24.300050 30684 slave.cpp:5399] Finished recovery
> I1028 01:21:24.300515 30684 slave.cpp:5573] Querying resource estimator for oversubscribable
resources
> I1028 01:21:24.300763 30696 slave.cpp:5587] Received oversubscribable resources {} from
the resource estimator
> I1028 01:21:24.302147 30685 process.cpp:3570] Handling HTTP event for process 'slave(642)'
with path: '/slave(642)/containers'
> I1028 01:21:24.302913 30683 http.cpp:839] Authorizing principal 'test-principal' to GET
the '/containers' endpoint
> I1028 01:21:24.305778 30695 slave.cpp:787] Agent terminating
> [       OK ] Endpoint/SlaveEndpointTest.NoAuthorizer/2 (25 ms)
> [----------] 9 tests from Endpoint/SlaveEndpointTest (235 ms total)
> 
> [----------] Global test environment tear-down
> [==========] 1369 tests from 155 test cases ran. (444903 ms total)
> [  PASSED  ] 1368 tests.
> [  FAILED  ] 1 test, listed below:
> [  FAILED  ] DiskResource/PersistentVolumeTest.SharedPersistentVolumeMultipleTasks/1,
where GetParam() = 1
> 
> 1 FAILED TEST
>  YOU HAVE 5 DISABLED TESTS
> 
> make[4]: *** [check-local] Error 1
> make[4]: Leaving directory `/mesos/mesos-1.2.0/_build/src'
> make[3]: *** [check-am] Error 2
> make[3]: Leaving directory `/mesos/mesos-1.2.0/_build/src'
> make[2]: *** [check] Error 2
> make[2]: Leaving directory `/mesos/mesos-1.2.0/_build/src'
> make[1]: *** [check-recursive] Error 1
> make[1]: Leaving directory `/mesos/mesos-1.2.0/_build'
> make: *** [distcheck] Error 1
> + docker rmi mesos-1477615144-22687
> Untagged: mesos-1477615144-22687:latest
> Deleted: sha256:e937016c10a37cf3d32461f1bb38bc35634bb6854089cebacd5dde8c4d77371f
> Deleted: sha256:a4f9931e106338d9520873c8bad0e145b79c286ba8fb27a8940c67e05ad8752f
> Deleted: sha256:c8ad8dbc1f617a0b7ada95bd9076bce5a9ae97c4920c788562997ffda4be39a3
> Deleted: sha256:401418b307bc6b25aa03a54e99e81972656ac42ee3232bdc4776b165c6a277fc
> Deleted: sha256:0842f9d42264a6f148d6efca59ba72be8875460ff321d71c353e51613502ef84
> Deleted: sha256:4c79d7a55077bfb58e33d45f512a5393a5e1f0b7c2330e075de32c3522807767
> Deleted: sha256:7be91212978f7393ec7f2f4a274b441826be9af0b5324c50c59863be94965538
> Deleted: sha256:dc41be25ec236e53ae3cbe85a2268f1c7151604608cb1fc81dbc1cc6152029c0
> Deleted: sha256:49cfc049193e2d62cb98fd19d50cbebcab8f5a599475597005b66a17f04ddf68
> Deleted: sha256:3eac48ff0bb9316ed85f84ea78d49c448e3c50ccb863e9c98bb72ca38af896d8
> Deleted: sha256:c4d4c135735cfb3212655629345287a6da554234ddc879723743e6974bfc78d1
> Deleted: sha256:9baf77fbcd282208ba2ef35193fd3ca6cb77da543e6e66c19249c928c29ac3cf
> Deleted: sha256:df14d6ce4b82d8ad9e15400723a1e443f8d49a5ef5bca0386ad14b23ba5d7d7d
> Deleted: sha256:6cd4958a33bf428ff2b08dab89e5febf3e78f8eade3db56c62ea4a88c6b9e7be
> Deleted: sha256:8f143e6926cbea10d33dea0d709f94b6c35be00a69db7bb350b674dae3acd9fb
> Deleted: sha256:4fbf792da5201dd29f5fc2375a6a39cc1e8cc2ead5fce4e6d61f8cc0fdd188df
> Deleted: sha256:bd1a00117a11b397443f745de732cc8e2deff707ae05ead010030a6124764bd4
> Deleted: sha256:0a6674447cf35c1556e7d0a50935ce4f91f96c22868ef3213ebedc9ea93710df
> Deleted: sha256:8e3e2f2328048419327c1e7a9b5ec706d5ade310108806639b2157d3fa70f259
> Deleted: sha256:2b0f81b4e95839865b5574ef57cf2b41751e5957d873ba328d50fecb57b2ccaa
> Deleted: sha256:55a7e8c731bf7345d93355712e8b19d1fc71b7d8434a92410a7564dbf73d10fa
> Deleted: sha256:4f4525208fc74a78786d7a46ce4ba071aa4d69cb652a145f61d080a86904fad6
> Deleted: sha256:ce13c292748654f34b6271e91c71a463b3b064c9cbb9606eb4d0a7893b1b99e3
> Deleted: sha256:fd48b4241f74f3bf2674484304af9059159de7beff2b7500ed916916c595cd43
> Build step 'Execute shell' marked build as failure



Mime
View raw message