mesos-builds mailing list archives

Site index · List index
Message view « Date » · « Thread »
Top « Date » · « Thread »
From Apache Jenkins Server <jenk...@builds.apache.org>
Subject Build failed in Jenkins: Mesos » autotools,clang,--verbose,GLOG_v=1 MESOS_VERBOSE=1,ubuntu:14.04,(docker||Hadoop)&&(!ubuntu-us1)&&(!ubuntu-6) #2769
Date Wed, 12 Oct 2016 18:27:22 GMT
See <https://builds.apache.org/job/Mesos/BUILDTOOL=autotools,COMPILER=clang,CONFIGURATION=--verbose,ENVIRONMENT=GLOG_v=1%20MESOS_VERBOSE=1,OS=ubuntu%3A14.04,label_exp=(docker%7C%7CHadoop)&&(!ubuntu-us1)&&(!ubuntu-6)/2769/changes>

Changes:

[toenshoff] Added a parallel gtest runner.

[toenshoff] Added configure option for Mesos test runner.

[toenshoff] Enable Mesos test runner.

[toenshoff] Permitted specifying custom test driver in libprocess.

[toenshoff] Permitted specifying custom test driver in stout.

[xujyan] Recover resources when offer is rescinded on DESTROY of shared volume.

------------------------------------------
[...truncated 210801 lines...]
W1012 18:26:19.607139 27666 backend.cpp:75] Failed to create 'aufs' backend: AufsBackend requires
root privileges, but is running as user mesos
W1012 18:26:19.607341 27666 backend.cpp:75] Failed to create 'bind' backend: BindBackend requires
root privileges
I1012 18:26:19.610288 27695 slave.cpp:208] Mesos agent started on (620)@172.17.0.3:36824
I1012 18:26:19.610329 27695 slave.cpp:209] Flags at startup: --acls="" --appc_simple_discovery_uri_prefix="http://"
--appc_store_dir="/tmp/mesos/store/appc" --authenticate_http_readonly="true" --authenticate_http_readwrite="true"
--authenticatee="crammd5" --authentication_backoff_factor="1secs" --authorizer="local" --cgroups_cpu_enable_pids_and_tids_count="false"
--cgroups_enable_cfs="false" --cgroups_hierarchy="/sys/fs/cgroup" --cgroups_limit_swap="false"
--cgroups_root="mesos" --container_disk_watch_interval="15secs" --containerizers="mesos" --credential="/tmp/Endpoint_SlaveEndpointTest_AuthorizedRequest_1_VRUFPX/credential"
--default_role="*" --disk_watch_interval="1mins" --docker="docker" --docker_kill_orphans="true"
--docker_registry="https://registry-1.docker.io" --docker_remove_delay="6hrs" --docker_socket="/var/run/docker.sock"
--docker_stop_timeout="0ns" --docker_store_dir="/tmp/mesos/store/docker" --docker_volume_checkpoint_dir="/var/run/mesos/isolators/docker/volume"
--enforce_container_disk_quota="false" --executor_registration_timeout="1mins" --executor_shutdown_grace_period="5secs"
--fetcher_cache_dir="/tmp/Endpoint_SlaveEndpointTest_AuthorizedRequest_1_VRUFPX/fetch" --fetcher_cache_size="2GB"
--frameworks_home="" --gc_delay="1weeks" --gc_disk_headroom="0.1" --hadoop_home="" --help="false"
--hostname_lookup="true" --http_authenticators="basic" --http_command_executor="false" --http_credentials="/tmp/Endpoint_SlaveEndpointTest_AuthorizedRequest_1_VRUFPX/http_credentials"
--image_provisioner_backend="copy" --initialize_driver_logging="true" --isolation="posix/cpu,posix/mem"
--launcher="posix" --launcher_dir="/mesos/mesos-1.1.0/_build/src" --logbufsecs="0" --logging_level="INFO"
--max_completed_executors_per_framework="150" --oversubscribed_resources_interval="15secs"
--perf_duration="10secs" --perf_interval="1mins" --qos_correction_interval_min="0ns" --quiet="false"
--recover="reconnect" --recovery_timeout="15mins" --registration_backoff_factor="10ms" --resources="cpus:2;gpus:0;mem:1024;disk:1024;ports:[31000-32000]"
--revocable_cpu_low_priority="true" --runtime_dir="/tmp/Endpoint_SlaveEndpointTest_AuthorizedRequest_1_VRUFPX"
--sandbox_directory="/mnt/mesos/sandbox" --strict="true" --switch_user="true" --systemd_enable_support="true"
--systemd_runtime_directory="/run/systemd/system" --version="false" --work_dir="/tmp/Endpoint_SlaveEndpointTest_AuthorizedRequest_1_n32Qh9"
I1012 18:26:19.610821 27695 credentials.hpp:86] Loading credential for authentication from
'/tmp/Endpoint_SlaveEndpointTest_AuthorizedRequest_1_VRUFPX/credential'
I1012 18:26:19.610999 27695 slave.cpp:346] Agent using credential for: test-principal
I1012 18:26:19.611030 27695 credentials.hpp:37] Loading credentials for authentication from
'/tmp/Endpoint_SlaveEndpointTest_AuthorizedRequest_1_VRUFPX/http_credentials'
I1012 18:26:19.611352 27695 http.cpp:883] Using default 'basic' HTTP authenticator for realm
'mesos-agent-readonly'
I1012 18:26:19.611520 27695 http.cpp:883] Using default 'basic' HTTP authenticator for realm
'mesos-agent-readwrite'
I1012 18:26:19.612871 27695 slave.cpp:533] Agent resources: cpus(*):2; mem(*):1024; disk(*):1024;
ports(*):[31000-32000]
I1012 18:26:19.612958 27695 slave.cpp:541] Agent attributes: [  ]
I1012 18:26:19.612972 27695 slave.cpp:546] Agent hostname: 3b2ebb60ef72
I1012 18:26:19.614413 27697 state.cpp:57] Recovering state from '/tmp/Endpoint_SlaveEndpointTest_AuthorizedRequest_1_n32Qh9/meta'
I1012 18:26:19.614503 27695 process.cpp:3377] Handling HTTP event for process 'slave(620)'
with path: '/slave(620)/monitor/statistics.json'
I1012 18:26:19.614985 27694 status_update_manager.cpp:203] Recovering status update manager
I1012 18:26:19.615169 27685 containerizer.cpp:557] Recovering containerizer
I1012 18:26:19.615515 27693 http.cpp:835] Authorizing principal 'test-principal' to GET the
'/monitor/statistics.json' endpoint
I1012 18:26:19.616540 27690 provisioner.cpp:253] Provisioner recovery complete
I1012 18:26:19.617300 27693 slave.cpp:5281] Finished recovery
I1012 18:26:19.617806 27693 slave.cpp:5455] Querying resource estimator for oversubscribable
resources
I1012 18:26:19.618191 27690 slave.cpp:5469] Received oversubscribable resources {} from the
resource estimator
I1012 18:26:19.619720 27684 slave.cpp:787] Agent terminating
[       OK ] Endpoint/SlaveEndpointTest.AuthorizedRequest/1 (21 ms)
[ RUN      ] Endpoint/SlaveEndpointTest.AuthorizedRequest/2
I1012 18:26:19.627894 27666 containerizer.cpp:202] Using isolation: posix/cpu,posix/mem,filesystem/posix,network/cni
W1012 18:26:19.628423 27666 backend.cpp:75] Failed to create 'aufs' backend: AufsBackend requires
root privileges, but is running as user mesos
W1012 18:26:19.628573 27666 backend.cpp:75] Failed to create 'bind' backend: BindBackend requires
root privileges
I1012 18:26:19.631155 27697 slave.cpp:208] Mesos agent started on (621)@172.17.0.3:36824
I1012 18:26:19.631242 27697 slave.cpp:209] Flags at startup: --acls="" --appc_simple_discovery_uri_prefix="http://"
--appc_store_dir="/tmp/mesos/store/appc" --authenticate_http_readonly="true" --authenticate_http_readwrite="true"
--authenticatee="crammd5" --authentication_backoff_factor="1secs" --authorizer="local" --cgroups_cpu_enable_pids_and_tids_count="false"
--cgroups_enable_cfs="false" --cgroups_hierarchy="/sys/fs/cgroup" --cgroups_limit_swap="false"
--cgroups_root="mesos" --container_disk_watch_interval="15secs" --containerizers="mesos" --credential="/tmp/Endpoint_SlaveEndpointTest_AuthorizedRequest_2_SFMlde/credential"
--default_role="*" --disk_watch_interval="1mins" --docker="docker" --docker_kill_orphans="true"
--docker_registry="https://registry-1.docker.io" --docker_remove_delay="6hrs" --docker_socket="/var/run/docker.sock"
--docker_stop_timeout="0ns" --docker_store_dir="/tmp/mesos/store/docker" --docker_volume_checkpoint_dir="/var/run/mesos/isolators/docker/volume"
--enforce_container_disk_quota="false" --executor_registration_timeout="1mins" --executor_shutdown_grace_period="5secs"
--fetcher_cache_dir="/tmp/Endpoint_SlaveEndpointTest_AuthorizedRequest_2_SFMlde/fetch" --fetcher_cache_size="2GB"
--frameworks_home="" --gc_delay="1weeks" --gc_disk_headroom="0.1" --hadoop_home="" --help="false"
--hostname_lookup="true" --http_authenticators="basic" --http_command_executor="false" --http_credentials="/tmp/Endpoint_SlaveEndpointTest_AuthorizedRequest_2_SFMlde/http_credentials"
--image_provisioner_backend="copy" --initialize_driver_logging="true" --isolation="posix/cpu,posix/mem"
--launcher="posix" --launcher_dir="/mesos/mesos-1.1.0/_build/src" --logbufsecs="0" --logging_level="INFO"
--max_completed_executors_per_framework="150" --oversubscribed_resources_interval="15secs"
--perf_duration="10secs" --perf_interval="1mins" --qos_correction_interval_min="0ns" --quiet="false"
--recover="reconnect" --recovery_timeout="15mins" --registration_backoff_factor="10ms" --resources="cpus:2;gpus:0;mem:1024;disk:1024;ports:[31000-32000]"
--revocable_cpu_low_priority="true" --runtime_dir="/tmp/Endpoint_SlaveEndpointTest_AuthorizedRequest_2_SFMlde"
--sandbox_directory="/mnt/mesos/sandbox" --strict="true" --switch_user="true" --systemd_enable_support="true"
--systemd_runtime_directory="/run/systemd/system" --version="false" --work_dir="/tmp/Endpoint_SlaveEndpointTest_AuthorizedRequest_2_27R1Bp"
I1012 18:26:19.631748 27697 credentials.hpp:86] Loading credential for authentication from
'/tmp/Endpoint_SlaveEndpointTest_AuthorizedRequest_2_SFMlde/credential'
I1012 18:26:19.631889 27697 slave.cpp:346] Agent using credential for: test-principal
I1012 18:26:19.631918 27697 credentials.hpp:37] Loading credentials for authentication from
'/tmp/Endpoint_SlaveEndpointTest_AuthorizedRequest_2_SFMlde/http_credentials'
I1012 18:26:19.632148 27697 http.cpp:883] Using default 'basic' HTTP authenticator for realm
'mesos-agent-readonly'
I1012 18:26:19.632272 27697 http.cpp:883] Using default 'basic' HTTP authenticator for realm
'mesos-agent-readwrite'
I1012 18:26:19.633330 27697 slave.cpp:533] Agent resources: cpus(*):2; mem(*):1024; disk(*):1024;
ports(*):[31000-32000]
I1012 18:26:19.633407 27697 slave.cpp:541] Agent attributes: [  ]
I1012 18:26:19.633420 27697 slave.cpp:546] Agent hostname: 3b2ebb60ef72
I1012 18:26:19.634800 27687 state.cpp:57] Recovering state from '/tmp/Endpoint_SlaveEndpointTest_AuthorizedRequest_2_27R1Bp/meta'
I1012 18:26:19.634866 27697 process.cpp:3377] Handling HTTP event for process 'slave(621)'
with path: '/slave(621)/containers'
I1012 18:26:19.635347 27692 status_update_manager.cpp:203] Recovering status update manager
I1012 18:26:19.635488 27698 containerizer.cpp:557] Recovering containerizer
I1012 18:26:19.635763 27692 http.cpp:835] Authorizing principal 'test-principal' to GET the
'/containers' endpoint
I1012 18:26:19.636710 27691 provisioner.cpp:253] Provisioner recovery complete
I1012 18:26:19.636919 27696 slave.cpp:5281] Finished recovery
I1012 18:26:19.637459 27696 slave.cpp:5455] Querying resource estimator for oversubscribable
resources
I1012 18:26:19.637886 27684 slave.cpp:5469] Received oversubscribable resources {} from the
resource estimator
I1012 18:26:19.639196 27687 slave.cpp:787] Agent terminating
[       OK ] Endpoint/SlaveEndpointTest.AuthorizedRequest/2 (21 ms)
[ RUN      ] Endpoint/SlaveEndpointTest.UnauthorizedRequest/0
I1012 18:26:19.649668 27666 containerizer.cpp:202] Using isolation: posix/cpu,posix/mem,filesystem/posix,network/cni
W1012 18:26:19.650163 27666 backend.cpp:75] Failed to create 'aufs' backend: AufsBackend requires
root privileges, but is running as user mesos
W1012 18:26:19.650288 27666 backend.cpp:75] Failed to create 'bind' backend: BindBackend requires
root privileges
I1012 18:26:19.653674 27696 slave.cpp:208] Mesos agent started on (622)@172.17.0.3:36824
I1012 18:26:19.653726 27696 slave.cpp:209] Flags at startup: --acls="" --appc_simple_discovery_uri_prefix="http://"
--appc_store_dir="/tmp/mesos/store/appc" --authenticate_http_readonly="true" --authenticate_http_readwrite="true"
--authenticatee="crammd5" --authentication_backoff_factor="1secs" --authorizer="local" --cgroups_cpu_enable_pids_and_tids_count="false"
--cgroups_enable_cfs="false" --cgroups_hierarchy="/sys/fs/cgroup" --cgroups_limit_swap="false"
--cgroups_root="mesos" --container_disk_watch_interval="15secs" --containerizers="mesos" --credential="/tmp/Endpoint_SlaveEndpointTest_UnauthorizedRequest_0_aXyVOu/credential"
--default_role="*" --disk_watch_interval="1mins" --docker="docker" --docker_kill_orphans="true"
--docker_registry="https://registry-1.docker.io" --docker_remove_delay="6hrs" --docker_socket="/var/run/docker.sock"
--docker_stop_timeout="0ns" --docker_store_dir="/tmp/mesos/store/docker" --docker_volume_checkpoint_dir="/var/run/mesos/isolators/docker/volume"
--enforce_container_disk_quota="false" --executor_registration_timeout="1mins" --executor_shutdown_grace_period="5secs"
--fetcher_cache_dir="/tmp/Endpoint_SlaveEndpointTest_UnauthorizedRequest_0_aXyVOu/fetch" --fetcher_cache_size="2GB"
--frameworks_home="" --gc_delay="1weeks" --gc_disk_headroom="0.1" --hadoop_home="" --help="false"
--hostname_lookup="true" --http_authenticators="basic" --http_command_executor="false" --http_credentials="/tmp/Endpoint_SlaveEndpointTest_UnauthorizedRequest_0_aXyVOu/http_credentials"
--image_provisioner_backend="copy" --initialize_driver_logging="true" --isolation="posix/cpu,posix/mem"
--launcher="posix" --launcher_dir="/mesos/mesos-1.1.0/_build/src" --logbufsecs="0" --logging_level="INFO"
--max_completed_executors_per_framework="150" --oversubscribed_resources_interval="15secs"
--perf_duration="10secs" --perf_interval="1mins" --qos_correction_interval_min="0ns" --quiet="false"
--recover="reconnect" --recovery_timeout="15mins" --registration_backoff_factor="10ms" --resources="cpus:2;gpus:0;mem:1024;disk:1024;ports:[31000-32000]"
--revocable_cpu_low_priority="true" --runtime_dir="/tmp/Endpoint_SlaveEndpointTest_UnauthorizedRequest_0_aXyVOu"
--sandbox_directory="/mnt/mesos/sandbox" --strict="true" --switch_user="true" --systemd_enable_support="true"
--systemd_runtime_directory="/run/systemd/system" --version="false" --work_dir="/tmp/Endpoint_SlaveEndpointTest_UnauthorizedRequest_0_min19F"
I1012 18:26:19.654597 27696 credentials.hpp:86] Loading credential for authentication from
'/tmp/Endpoint_SlaveEndpointTest_UnauthorizedRequest_0_aXyVOu/credential'
I1012 18:26:19.654798 27696 slave.cpp:346] Agent using credential for: test-principal
I1012 18:26:19.654826 27696 credentials.hpp:37] Loading credentials for authentication from
'/tmp/Endpoint_SlaveEndpointTest_UnauthorizedRequest_0_aXyVOu/http_credentials'
I1012 18:26:19.655109 27696 http.cpp:883] Using default 'basic' HTTP authenticator for realm
'mesos-agent-readonly'
I1012 18:26:19.655263 27696 http.cpp:883] Using default 'basic' HTTP authenticator for realm
'mesos-agent-readwrite'
I1012 18:26:19.656608 27696 slave.cpp:533] Agent resources: cpus(*):2; mem(*):1024; disk(*):1024;
ports(*):[31000-32000]
I1012 18:26:19.656733 27696 slave.cpp:541] Agent attributes: [  ]
I1012 18:26:19.656749 27696 slave.cpp:546] Agent hostname: 3b2ebb60ef72
I1012 18:26:19.658308 27697 state.cpp:57] Recovering state from '/tmp/Endpoint_SlaveEndpointTest_UnauthorizedRequest_0_min19F/meta'
I1012 18:26:19.658366 27696 process.cpp:3377] Handling HTTP event for process 'slave(622)'
with path: '/slave(622)/monitor/statistics'
I1012 18:26:19.658998 27688 status_update_manager.cpp:203] Recovering status update manager
I1012 18:26:19.659173 27690 containerizer.cpp:557] Recovering containerizer
I1012 18:26:19.659556 27693 http.cpp:835] Authorizing principal 'test-principal' to GET the
'/monitor/statistics' endpoint
I1012 18:26:19.660519 27697 provisioner.cpp:253] Provisioner recovery complete
I1012 18:26:19.661067 27685 slave.cpp:5281] Finished recovery
I1012 18:26:19.661622 27685 slave.cpp:5455] Querying resource estimator for oversubscribable
resources
I1012 18:26:19.661937 27685 slave.cpp:5469] Received oversubscribable resources {} from the
resource estimator
I1012 18:26:19.662672 27685 slave.cpp:787] Agent terminating
[       OK ] Endpoint/SlaveEndpointTest.UnauthorizedRequest/0 (23 ms)
[ RUN      ] Endpoint/SlaveEndpointTest.UnauthorizedRequest/1
I1012 18:26:19.673657 27666 containerizer.cpp:202] Using isolation: posix/cpu,posix/mem,filesystem/posix,network/cni
W1012 18:26:19.674329 27666 backend.cpp:75] Failed to create 'aufs' backend: AufsBackend requires
root privileges, but is running as user mesos
W1012 18:26:19.674494 27666 backend.cpp:75] Failed to create 'bind' backend: BindBackend requires
root privileges
I1012 18:26:19.677871 27698 slave.cpp:208] Mesos agent started on (623)@172.17.0.3:36824
I1012 18:26:19.677906 27698 slave.cpp:209] Flags at startup: --acls="" --appc_simple_discovery_uri_prefix="http://"
--appc_store_dir="/tmp/mesos/store/appc" --authenticate_http_readonly="true" --authenticate_http_readwrite="true"
--authenticatee="crammd5" --authentication_backoff_factor="1secs" --authorizer="local" --cgroups_cpu_enable_pids_and_tids_count="false"
--cgroups_enable_cfs="false" --cgroups_hierarchy="/sys/fs/cgroup" --cgroups_limit_swap="false"
--cgroups_root="mesos" --container_disk_watch_interval="15secs" --containerizers="mesos" --credential="/tmp/Endpoint_SlaveEndpointTest_UnauthorizedRequest_1_UuhzFL/credential"
--default_role="*" --disk_watch_interval="1mins" --docker="docker" --docker_kill_orphans="true"
--docker_registry="https://registry-1.docker.io" --docker_remove_delay="6hrs" --docker_socket="/var/run/docker.sock"
--docker_stop_timeout="0ns" --docker_store_dir="/tmp/mesos/store/docker" --docker_volume_checkpoint_dir="/var/run/mesos/isolators/docker/volume"
--enforce_container_disk_quota="false" --executor_registration_timeout="1mins" --executor_shutdown_grace_period="5secs"
--fetcher_cache_dir="/tmp/Endpoint_SlaveEndpointTest_UnauthorizedRequest_1_UuhzFL/fetch" --fetcher_cache_size="2GB"
--frameworks_home="" --gc_delay="1weeks" --gc_disk_headroom="0.1" --hadoop_home="" --help="false"
--hostname_lookup="true" --http_authenticators="basic" --http_command_executor="false" --http_credentials="/tmp/Endpoint_SlaveEndpointTest_UnauthorizedRequest_1_UuhzFL/http_credentials"
--image_provisioner_backend="copy" --initialize_driver_logging="true" --isolation="posix/cpu,posix/mem"
--launcher="posix" --launcher_dir="/mesos/mesos-1.1.0/_build/src" --logbufsecs="0" --logging_level="INFO"
--max_completed_executors_per_framework="150" --oversubscribed_resources_interval="15secs"
--perf_duration="10secs" --perf_interval="1mins" --qos_correction_interval_min="0ns" --quiet="false"
--recover="reconnect" --recovery_timeout="15mins" --registration_backoff_factor="10ms" --resources="cpus:2;gpus:0;mem:1024;disk:1024;ports:[31000-32000]"
--revocable_cpu_low_priority="true" --runtime_dir="/tmp/Endpoint_SlaveEndpointTest_UnauthorizedRequest_1_UuhzFL"
--sandbox_directory="/mnt/mesos/sandbox" --strict="true" --switch_user="true" --systemd_enable_support="true"
--systemd_runtime_directory="/run/systemd/system" --version="false" --work_dir="/tmp/Endpoint_SlaveEndpointTest_UnauthorizedRequest_1_Mh4VWW"
I1012 18:26:19.678310 27698 credentials.hpp:86] Loading credential for authentication from
'/tmp/Endpoint_SlaveEndpointTest_UnauthorizedRequest_1_UuhzFL/credential'
I1012 18:26:19.678501 27698 slave.cpp:346] Agent using credential for: test-principal
I1012 18:26:19.678529 27698 credentials.hpp:37] Loading credentials for authentication from
'/tmp/Endpoint_SlaveEndpointTest_UnauthorizedRequest_1_UuhzFL/http_credentials'
I1012 18:26:19.678799 27698 http.cpp:883] Using default 'basic' HTTP authenticator for realm
'mesos-agent-readonly'
I1012 18:26:19.678949 27698 http.cpp:883] Using default 'basic' HTTP authenticator for realm
'mesos-agent-readwrite'
I1012 18:26:19.679930 27698 slave.cpp:533] Agent resources: cpus(*):2; mem(*):1024; disk(*):1024;
ports(*):[31000-32000]
I1012 18:26:19.680001 27698 slave.cpp:541] Agent attributes: [  ]
I1012 18:26:19.680011 27698 slave.cpp:546] Agent hostname: 3b2ebb60ef72
I1012 18:26:19.681234 27686 state.cpp:57] Recovering state from '/tmp/Endpoint_SlaveEndpointTest_UnauthorizedRequest_1_Mh4VWW/meta'
I1012 18:26:19.681280 27698 process.cpp:3377] Handling HTTP event for process 'slave(623)'
with path: '/slave(623)/monitor/statistics.json'
I1012 18:26:19.681627 27688 status_update_manager.cpp:203] Recovering status update manager
I1012 18:26:19.681804 27685 containerizer.cpp:557] Recovering containerizer
I1012 18:26:19.682117 27687 http.cpp:835] Authorizing principal 'test-principal' to GET the
'/monitor/statistics.json' endpoint
I1012 18:26:19.682760 27688 provisioner.cpp:253] Provisioner recovery complete
I1012 18:26:19.683130 27697 slave.cpp:5281] Finished recovery
I1012 18:26:19.683542 27697 slave.cpp:5455] Querying resource estimator for oversubscribable
resources
I1012 18:26:19.683895 27696 slave.cpp:5469] Received oversubscribable resources {} from the
resource estimator
I1012 18:26:19.684372 27696 slave.cpp:787] Agent terminating
[       OK ] Endpoint/SlaveEndpointTest.UnauthorizedRequest/1 (20 ms)
[ RUN      ] Endpoint/SlaveEndpointTest.UnauthorizedRequest/2
I1012 18:26:19.692900 27666 containerizer.cpp:202] Using isolation: posix/cpu,posix/mem,filesystem/posix,network/cni
W1012 18:26:19.693657 27666 backend.cpp:75] Failed to create 'aufs' backend: AufsBackend requires
root privileges, but is running as user mesos
W1012 18:26:19.693866 27666 backend.cpp:75] Failed to create 'bind' backend: BindBackend requires
root privileges
I1012 18:26:19.697024 27699 slave.cpp:208] Mesos agent started on (624)@172.17.0.3:36824
I1012 18:26:19.697072 27699 slave.cpp:209] Flags at startup: --acls="" --appc_simple_discovery_uri_prefix="http://"
--appc_store_dir="/tmp/mesos/store/appc" --authenticate_http_readonly="true" --authenticate_http_readwrite="true"
--authenticatee="crammd5" --authentication_backoff_factor="1secs" --authorizer="local" --cgroups_cpu_enable_pids_and_tids_count="false"
--cgroups_enable_cfs="false" --cgroups_hierarchy="/sys/fs/cgroup" --cgroups_limit_swap="false"
--cgroups_root="mesos" --container_disk_watch_interval="15secs" --containerizers="mesos" --credential="/tmp/Endpoint_SlaveEndpointTest_UnauthorizedRequest_2_KxNnJ2/credential"
--default_role="*" --disk_watch_interval="1mins" --docker="docker" --docker_kill_orphans="true"
--docker_registry="https://registry-1.docker.io" --docker_remove_delay="6hrs" --docker_socket="/var/run/docker.sock"
--docker_stop_timeout="0ns" --docker_store_dir="/tmp/mesos/store/docker" --docker_volume_checkpoint_dir="/var/run/mesos/isolators/docker/volume"
--enforce_container_disk_quota="false" --executor_registration_timeout="1mins" --executor_shutdown_grace_period="5secs"
--fetcher_cache_dir="/tmp/Endpoint_SlaveEndpointTest_UnauthorizedRequest_2_KxNnJ2/fetch" --fetcher_cache_size="2GB"
--frameworks_home="" --gc_delay="1weeks" --gc_disk_headroom="0.1" --hadoop_home="" --help="false"
--hostname_lookup="true" --http_authenticators="basic" --http_command_executor="false" --http_credentials="/tmp/Endpoint_SlaveEndpointTest_UnauthorizedRequest_2_KxNnJ2/http_credentials"
--image_provisioner_backend="copy" --initialize_driver_logging="true" --isolation="posix/cpu,posix/mem"
--launcher="posix" --launcher_dir="/mesos/mesos-1.1.0/_build/src" --logbufsecs="0" --logging_level="INFO"
--max_completed_executors_per_framework="150" --oversubscribed_resources_interval="15secs"
--perf_duration="10secs" --perf_interval="1mins" --qos_correction_interval_min="0ns" --quiet="false"
--recover="reconnect" --recovery_timeout="15mins" --registration_backoff_factor="10ms" --resources="cpus:2;gpus:0;mem:1024;disk:1024;ports:[31000-32000]"
--revocable_cpu_low_priority="true" --runtime_dir="/tmp/Endpoint_SlaveEndpointTest_UnauthorizedRequest_2_KxNnJ2"
--sandbox_directory="/mnt/mesos/sandbox" --strict="true" --switch_user="true" --systemd_enable_support="true"
--systemd_runtime_directory="/run/systemd/system" --version="false" --work_dir="/tmp/Endpoint_SlaveEndpointTest_UnauthorizedRequest_2_i7ezXd"
I1012 18:26:19.697818 27699 credentials.hpp:86] Loading credential for authentication from
'/tmp/Endpoint_SlaveEndpointTest_UnauthorizedRequest_2_KxNnJ2/credential'
I1012 18:26:19.697933 27699 slave.cpp:346] Agent using credential for: test-principal
I1012 18:26:19.697957 27699 credentials.hpp:37] Loading credentials for authentication from
'/tmp/Endpoint_SlaveEndpointTest_UnauthorizedRequest_2_KxNnJ2/http_credentials'
I1012 18:26:19.698144 27699 http.cpp:883] Using default 'basic' HTTP authenticator for realm
'mesos-agent-readonly'
I1012 18:26:19.698290 27699 http.cpp:883] Using default 'basic' HTTP authenticator for realm
'mesos-agent-readwrite'
I1012 18:26:19.699923 27699 slave.cpp:533] Agent resources: cpus(*):2; mem(*):1024; disk(*):1024;
ports(*):[31000-32000]
I1012 18:26:19.700027 27699 slave.cpp:541] Agent attributes: [  ]
I1012 18:26:19.700045 27699 slave.cpp:546] Agent hostname: 3b2ebb60ef72
I1012 18:26:19.701539 27697 state.cpp:57] Recovering state from '/tmp/Endpoint_SlaveEndpointTest_UnauthorizedRequest_2_i7ezXd/meta'
I1012 18:26:19.701565 27699 process.cpp:3377] Handling HTTP event for process 'slave(624)'
with path: '/slave(624)/containers'
I1012 18:26:19.701962 27690 status_update_manager.cpp:203] Recovering status update manager
I1012 18:26:19.702172 27695 containerizer.cpp:557] Recovering containerizer
I1012 18:26:19.702666 27697 http.cpp:835] Authorizing principal 'test-principal' to GET the
'/containers' endpoint
I1012 18:26:19.703536 27699 provisioner.cpp:253] Provisioner recovery complete
I1012 18:26:19.704041 27685 slave.cpp:5281] Finished recovery
I1012 18:26:19.704516 27685 slave.cpp:5455] Querying resource estimator for oversubscribable
resources
I1012 18:26:19.704823 27698 slave.cpp:5469] Received oversubscribable resources {} from the
resource estimator
I1012 18:26:19.705281 27693 slave.cpp:787] Agent terminating
[       OK ] Endpoint/SlaveEndpointTest.UnauthorizedRequest/2 (21 ms)
[ RUN      ] Endpoint/SlaveEndpointTest.NoAuthorizer/0
I1012 18:26:19.714813 27666 containerizer.cpp:202] Using isolation: posix/cpu,posix/mem,filesystem/posix,network/cni
W1012 18:26:19.715482 27666 backend.cpp:75] Failed to create 'aufs' backend: AufsBackend requires
root privileges, but is running as user mesos
W1012 18:26:19.715672 27666 backend.cpp:75] Failed to create 'bind' backend: BindBackend requires
root privileges
I1012 18:26:19.717588 27666 cluster.cpp:435] Creating default 'local' authorizer
I1012 18:26:19.719771 27685 slave.cpp:208] Mesos agent started on (625)@172.17.0.3:36824
I1012 18:26:19.719815 27685 slave.cpp:209] Flags at startup: --acls="" --appc_simple_discovery_uri_prefix="http://"
--appc_store_dir="/tmp/mesos/store/appc" --authenticate_http_readonly="true" --authenticate_http_readwrite="true"
--authenticatee="crammd5" --authentication_backoff_factor="1secs" --authorizer="local" --cgroups_cpu_enable_pids_and_tids_count="false"
--cgroups_enable_cfs="false" --cgroups_hierarchy="/sys/fs/cgroup" --cgroups_limit_swap="false"
--cgroups_root="mesos" --container_disk_watch_interval="15secs" --containerizers="mesos" --credential="/tmp/Endpoint_SlaveEndpointTest_NoAuthorizer_0_OQf00j/credential"
--default_role="*" --disk_watch_interval="1mins" --docker="docker" --docker_kill_orphans="true"
--docker_registry="https://registry-1.docker.io" --docker_remove_delay="6hrs" --docker_socket="/var/run/docker.sock"
--docker_stop_timeout="0ns" --docker_store_dir="/tmp/mesos/store/docker" --docker_volume_checkpoint_dir="/var/run/mesos/isolators/docker/volume"
--enforce_container_disk_quota="false" --executor_registration_timeout="1mins" --executor_shutdown_grace_period="5secs"
--fetcher_cache_dir="/tmp/Endpoint_SlaveEndpointTest_NoAuthorizer_0_OQf00j/fetch" --fetcher_cache_size="2GB"
--frameworks_home="" --gc_delay="1weeks" --gc_disk_headroom="0.1" --hadoop_home="" --help="false"
--hostname_lookup="true" --http_authenticators="basic" --http_command_executor="false" --http_credentials="/tmp/Endpoint_SlaveEndpointTest_NoAuthorizer_0_OQf00j/http_credentials"
--image_provisioner_backend="copy" --initialize_driver_logging="true" --isolation="posix/cpu,posix/mem"
--launcher="posix" --launcher_dir="/mesos/mesos-1.1.0/_build/src" --logbufsecs="0" --logging_level="INFO"
--max_completed_executors_per_framework="150" --oversubscribed_resources_interval="15secs"
--perf_duration="10secs" --perf_interval="1mins" --qos_correction_interval_min="0ns" --quiet="false"
--recover="reconnect" --recovery_timeout="15mins" --registration_backoff_factor="10ms" --resources="cpus:2;gpus:0;mem:1024;disk:1024;ports:[31000-32000]"
--revocable_cpu_low_priority="true" --runtime_dir="/tmp/Endpoint_SlaveEndpointTest_NoAuthorizer_0_OQf00j"
--sandbox_directory="/mnt/mesos/sandbox" --strict="true" --switch_user="true" --systemd_enable_support="true"
--systemd_runtime_directory="/run/systemd/system" --version="false" --work_dir="/tmp/Endpoint_SlaveEndpointTest_NoAuthorizer_0_ibnIbv"
I1012 18:26:19.720425 27685 credentials.hpp:86] Loading credential for authentication from
'/tmp/Endpoint_SlaveEndpointTest_NoAuthorizer_0_OQf00j/credential'
I1012 18:26:19.720669 27685 slave.cpp:346] Agent using credential for: test-principal
I1012 18:26:19.720695 27685 credentials.hpp:37] Loading credentials for authentication from
'/tmp/Endpoint_SlaveEndpointTest_NoAuthorizer_0_OQf00j/http_credentials'
I1012 18:26:19.721015 27685 http.cpp:883] Using default 'basic' HTTP authenticator for realm
'mesos-agent-readonly'
I1012 18:26:19.721276 27685 http.cpp:883] Using default 'basic' HTTP authenticator for realm
'mesos-agent-readwrite'
I1012 18:26:19.722702 27685 slave.cpp:533] Agent resources: cpus(*):2; mem(*):1024; disk(*):1024;
ports(*):[31000-32000]
I1012 18:26:19.722800 27685 slave.cpp:541] Agent attributes: [  ]
I1012 18:26:19.722817 27685 slave.cpp:546] Agent hostname: 3b2ebb60ef72
I1012 18:26:19.724324 27684 state.cpp:57] Recovering state from '/tmp/Endpoint_SlaveEndpointTest_NoAuthorizer_0_ibnIbv/meta'
I1012 18:26:19.724411 27685 process.cpp:3377] Handling HTTP event for process 'slave(625)'
with path: '/slave(625)/monitor/statistics'
I1012 18:26:19.724809 27684 status_update_manager.cpp:203] Recovering status update manager
I1012 18:26:19.724969 27699 containerizer.cpp:557] Recovering containerizer
I1012 18:26:19.725350 27692 http.cpp:835] Authorizing principal 'test-principal' to GET the
'/monitor/statistics' endpoint
I1012 18:26:19.726052 27698 provisioner.cpp:253] Provisioner recovery complete
I1012 18:26:19.726817 27690 slave.cpp:5281] Finished recovery
I1012 18:26:19.727282 27690 slave.cpp:5455] Querying resource estimator for oversubscribable
resources
I1012 18:26:19.727473 27694 slave.cpp:5469] Received oversubscribable resources {} from the
resource estimator
I1012 18:26:19.728741 27684 slave.cpp:787] Agent terminating
[       OK ] Endpoint/SlaveEndpointTest.NoAuthorizer/0 (24 ms)
[ RUN      ] Endpoint/SlaveEndpointTest.NoAuthorizer/1
I1012 18:26:19.738663 27666 containerizer.cpp:202] Using isolation: posix/cpu,posix/mem,filesystem/posix,network/cni
W1012 18:26:19.739228 27666 backend.cpp:75] Failed to create 'aufs' backend: AufsBackend requires
root privileges, but is running as user mesos
W1012 18:26:19.739423 27666 backend.cpp:75] Failed to create 'bind' backend: BindBackend requires
root privileges
I1012 18:26:19.740703 27666 cluster.cpp:435] Creating default 'local' authorizer
I1012 18:26:19.742274 27685 slave.cpp:208] Mesos agent started on (626)@172.17.0.3:36824
I1012 18:26:19.742310 27685 slave.cpp:209] Flags at startup: --acls="" --appc_simple_discovery_uri_prefix="http://"
--appc_store_dir="/tmp/mesos/store/appc" --authenticate_http_readonly="true" --authenticate_http_readwrite="true"
--authenticatee="crammd5" --authentication_backoff_factor="1secs" --authorizer="local" --cgroups_cpu_enable_pids_and_tids_count="false"
--cgroups_enable_cfs="false" --cgroups_hierarchy="/sys/fs/cgroup" --cgroups_limit_swap="false"
--cgroups_root="mesos" --container_disk_watch_interval="15secs" --containerizers="mesos" --credential="/tmp/Endpoint_SlaveEndpointTest_NoAuthorizer_1_6KQ4xB/credential"
--default_role="*" --disk_watch_interval="1mins" --docker="docker" --docker_kill_orphans="true"
--docker_registry="https://registry-1.docker.io" --docker_remove_delay="6hrs" --docker_socket="/var/run/docker.sock"
--docker_stop_timeout="0ns" --docker_store_dir="/tmp/mesos/store/docker" --docker_volume_checkpoint_dir="/var/run/mesos/isolators/docker/volume"
--enforce_container_disk_quota="false" --executor_registration_timeout="1mins" --executor_shutdown_grace_period="5secs"
--fetcher_cache_dir="/tmp/Endpoint_SlaveEndpointTest_NoAuthorizer_1_6KQ4xB/fetch" --fetcher_cache_size="2GB"
--frameworks_home="" --gc_delay="1weeks" --gc_disk_headroom="0.1" --hadoop_home="" --help="false"
--hostname_lookup="true" --http_authenticators="basic" --http_command_executor="false" --http_credentials="/tmp/Endpoint_SlaveEndpointTest_NoAuthorizer_1_6KQ4xB/http_credentials"
--image_provisioner_backend="copy" --initialize_driver_logging="true" --isolation="posix/cpu,posix/mem"
--launcher="posix" --launcher_dir="/mesos/mesos-1.1.0/_build/src" --logbufsecs="0" --logging_level="INFO"
--max_completed_executors_per_framework="150" --oversubscribed_resources_interval="15secs"
--perf_duration="10secs" --perf_interval="1mins" --qos_correction_interval_min="0ns" --quiet="false"
--recover="reconnect" --recovery_timeout="15mins" --registration_backoff_factor="10ms" --resources="cpus:2;gpus:0;mem:1024;disk:1024;ports:[31000-32000]"
--revocable_cpu_low_priority="true" --runtime_dir="/tmp/Endpoint_SlaveEndpointTest_NoAuthorizer_1_6KQ4xB"
--sandbox_directory="/mnt/mesos/sandbox" --strict="true" --switch_user="true" --systemd_enable_support="true"
--systemd_runtime_directory="/run/systemd/system" --version="false" --work_dir="/tmp/Endpoint_SlaveEndpointTest_NoAuthorizer_1_W6ZREM"
I1012 18:26:19.742863 27685 credentials.hpp:86] Loading credential for authentication from
'/tmp/Endpoint_SlaveEndpointTest_NoAuthorizer_1_6KQ4xB/credential'
I1012 18:26:19.743036 27685 slave.cpp:346] Agent using credential for: test-principal
I1012 18:26:19.743065 27685 credentials.hpp:37] Loading credentials for authentication from
'/tmp/Endpoint_SlaveEndpointTest_NoAuthorizer_1_6KQ4xB/http_credentials'
I1012 18:26:19.743350 27685 http.cpp:883] Using default 'basic' HTTP authenticator for realm
'mesos-agent-readonly'
I1012 18:26:19.743510 27685 http.cpp:883] Using default 'basic' HTTP authenticator for realm
'mesos-agent-readwrite'
I1012 18:26:19.745136 27685 slave.cpp:533] Agent resources: cpus(*):2; mem(*):1024; disk(*):1024;
ports(*):[31000-32000]
I1012 18:26:19.745237 27685 slave.cpp:541] Agent attributes: [  ]
I1012 18:26:19.745254 27685 slave.cpp:546] Agent hostname: 3b2ebb60ef72
I1012 18:26:19.746755 27690 state.cpp:57] Recovering state from '/tmp/Endpoint_SlaveEndpointTest_NoAuthorizer_1_W6ZREM/meta'
I1012 18:26:19.746840 27685 process.cpp:3377] Handling HTTP event for process 'slave(626)'
with path: '/slave(626)/monitor/statistics.json'
I1012 18:26:19.747329 27686 status_update_manager.cpp:203] Recovering status update manager
I1012 18:26:19.747685 27695 containerizer.cpp:557] Recovering containerizer
I1012 18:26:19.747866 27688 http.cpp:835] Authorizing principal 'test-principal' to GET the
'/monitor/statistics.json' endpoint
I1012 18:26:19.749220 27689 provisioner.cpp:253] Provisioner recovery complete
I1012 18:26:19.749752 27687 slave.cpp:5281] Finished recovery
I1012 18:26:19.750296 27687 slave.cpp:5455] Querying resource estimator for oversubscribable
resources
I1012 18:26:19.750461 27689 slave.cpp:5469] Received oversubscribable resources {} from the
resource estimator
I1012 18:26:19.751952 27694 slave.cpp:787] Agent terminating
[       OK ] Endpoint/SlaveEndpointTest.NoAuthorizer/1 (23 ms)
[ RUN      ] Endpoint/SlaveEndpointTest.NoAuthorizer/2
I1012 18:26:19.762152 27666 containerizer.cpp:202] Using isolation: posix/cpu,posix/mem,filesystem/posix,network/cni
W1012 18:26:19.762840 27666 backend.cpp:75] Failed to create 'aufs' backend: AufsBackend requires
root privileges, but is running as user mesos
W1012 18:26:19.763025 27666 backend.cpp:75] Failed to create 'bind' backend: BindBackend requires
root privileges
I1012 18:26:19.764550 27666 cluster.cpp:435] Creating default 'local' authorizer
I1012 18:26:19.766386 27699 slave.cpp:208] Mesos agent started on (627)@172.17.0.3:36824
I1012 18:26:19.766433 27699 slave.cpp:209] Flags at startup: --acls="" --appc_simple_discovery_uri_prefix="http://"
--appc_store_dir="/tmp/mesos/store/appc" --authenticate_http_readonly="true" --authenticate_http_readwrite="true"
--authenticatee="crammd5" --authentication_backoff_factor="1secs" --authorizer="local" --cgroups_cpu_enable_pids_and_tids_count="false"
--cgroups_enable_cfs="false" --cgroups_hierarchy="/sys/fs/cgroup" --cgroups_limit_swap="false"
--cgroups_root="mesos" --container_disk_watch_interval="15secs" --containerizers="mesos" --credential="/tmp/Endpoint_SlaveEndpointTest_NoAuthorizer_2_EilfkT/credential"
--default_role="*" --disk_watch_interval="1mins" --docker="docker" --docker_kill_orphans="true"
--docker_registry="https://registry-1.docker.io" --docker_remove_delay="6hrs" --docker_socket="/var/run/docker.sock"
--docker_stop_timeout="0ns" --docker_store_dir="/tmp/mesos/store/docker" --docker_volume_checkpoint_dir="/var/run/mesos/isolators/docker/volume"
--enforce_container_disk_quota="false" --executor_registration_timeout="1mins" --executor_shutdown_grace_period="5secs"
--fetcher_cache_dir="/tmp/Endpoint_SlaveEndpointTest_NoAuthorizer_2_EilfkT/fetch" --fetcher_cache_size="2GB"
--frameworks_home="" --gc_delay="1weeks" --gc_disk_headroom="0.1" --hadoop_home="" --help="false"
--hostname_lookup="true" --http_authenticators="basic" --http_command_executor="false" --http_credentials="/tmp/Endpoint_SlaveEndpointTest_NoAuthorizer_2_EilfkT/http_credentials"
--image_provisioner_backend="copy" --initialize_driver_logging="true" --isolation="posix/cpu,posix/mem"
--launcher="posix" --launcher_dir="/mesos/mesos-1.1.0/_build/src" --logbufsecs="0" --logging_level="INFO"
--max_completed_executors_per_framework="150" --oversubscribed_resources_interval="15secs"
--perf_duration="10secs" --perf_interval="1mins" --qos_correction_interval_min="0ns" --quiet="false"
--recover="reconnect" --recovery_timeout="15mins" --registration_backoff_factor="10ms" --resources="cpus:2;gpus:0;mem:1024;disk:1024;ports:[31000-32000]"
--revocable_cpu_low_priority="true" --runtime_dir="/tmp/Endpoint_SlaveEndpointTest_NoAuthorizer_2_EilfkT"
--sandbox_directory="/mnt/mesos/sandbox" --strict="true" --switch_user="true" --systemd_enable_support="true"
--systemd_runtime_directory="/run/systemd/system" --version="false" --work_dir="/tmp/Endpoint_SlaveEndpointTest_NoAuthorizer_2_mvMfn4"
I1012 18:26:19.767063 27699 credentials.hpp:86] Loading credential for authentication from
'/tmp/Endpoint_SlaveEndpointTest_NoAuthorizer_2_EilfkT/credential'
I1012 18:26:19.767304 27699 slave.cpp:346] Agent using credential for: test-principal
I1012 18:26:19.767335 27699 credentials.hpp:37] Loading credentials for authentication from
'/tmp/Endpoint_SlaveEndpointTest_NoAuthorizer_2_EilfkT/http_credentials'
I1012 18:26:19.767659 27699 http.cpp:883] Using default 'basic' HTTP authenticator for realm
'mesos-agent-readonly'
I1012 18:26:19.767838 27699 http.cpp:883] Using default 'basic' HTTP authenticator for realm
'mesos-agent-readwrite'
I1012 18:26:19.769147 27699 slave.cpp:533] Agent resources: cpus(*):2; mem(*):1024; disk(*):1024;
ports(*):[31000-32000]
I1012 18:26:19.769246 27699 slave.cpp:541] Agent attributes: [  ]
I1012 18:26:19.769263 27699 slave.cpp:546] Agent hostname: 3b2ebb60ef72
I1012 18:26:19.770836 27693 state.cpp:57] Recovering state from '/tmp/Endpoint_SlaveEndpointTest_NoAuthorizer_2_mvMfn4/meta'
I1012 18:26:19.770905 27699 process.cpp:3377] Handling HTTP event for process 'slave(627)'
with path: '/slave(627)/containers'
I1012 18:26:19.771386 27690 status_update_manager.cpp:203] Recovering status update manager
I1012 18:26:19.771658 27697 containerizer.cpp:557] Recovering containerizer
I1012 18:26:19.771960 27690 http.cpp:835] Authorizing principal 'test-principal' to GET the
'/containers' endpoint
I1012 18:26:19.773180 27695 provisioner.cpp:253] Provisioner recovery complete
I1012 18:26:19.773450 27684 slave.cpp:5281] Finished recovery
I1012 18:26:19.774016 27684 slave.cpp:5455] Querying resource estimator for oversubscribable
resources
I1012 18:26:19.774210 27699 slave.cpp:5469] Received oversubscribable resources {} from the
resource estimator
I1012 18:26:19.775598 27686 slave.cpp:787] Agent terminating
[       OK ] Endpoint/SlaveEndpointTest.NoAuthorizer/2 (22 ms)
[----------] 9 tests from Endpoint/SlaveEndpointTest (200 ms total)

[----------] Global test environment tear-down
[==========] 1354 tests from 154 test cases ran. (446812 ms total)
[  PASSED  ] 1352 tests.
[  FAILED  ] 2 tests, listed below:
[  FAILED  ] DiskResource/PersistentVolumeTest.SharedPersistentVolumeRescindOnDestroy/0, where
GetParam() = 0
[  FAILED  ] DiskResource/PersistentVolumeTest.SharedPersistentVolumeRescindOnDestroy/1, where
GetParam() = 1

 2 FAILED TESTS
  YOU HAVE 5 DISABLED TESTS

make[4]: Leaving directory `/mesos/mesos-1.1.0/_build/src'
make[4]: *** [check-local] Error 1
make[3]: *** [check-am] Error 2
make[3]: Leaving directory `/mesos/mesos-1.1.0/_build/src'
make[2]: *** [check] Error 2
make[2]: Leaving directory `/mesos/mesos-1.1.0/_build/src'
make[1]: *** [check-recursive] Error 1
make[1]: Leaving directory `/mesos/mesos-1.1.0/_build'
make: *** [distcheck] Error 1
+ docker rmi mesos-1476294662-29751
Untagged: mesos-1476294662-29751:latest
Deleted: sha256:c2954f8d959a492e4ba9ba95e2122cfe0acd81064f485a4e2b671010a40acf5e
Deleted: sha256:4e440a537cd65f7852f736a6b735059f739f73b06fd8ab83805d08dacbe5a334
Deleted: sha256:7f95e41db6799c32d3f5898a9d4a3f166ac80f72dbd9d97ab0ca9ce6ace911ed
Deleted: sha256:062e16603ae876a992df75f3b5b086b0b92e5746790b00530a035e38a51cfbae
Deleted: sha256:4acb0835fd3e94d16197865589794ab4ab3b308adf9b62101f8d775999f1b75b
Deleted: sha256:552f594e84584273c92b5f5cac195ec6bd76d63d6d9ab3d0314c5a58c7f9303c
Deleted: sha256:b75d7b5932637fa511e7fbedca4808d5a3c91bea613f8e84706bfc7260fff8c5
Deleted: sha256:85056c62c91edca731e16c7b39adf8ee27562a4705901f8dcdc7ca3dd4138bf5
Deleted: sha256:c8ff58f47c5992ef8c0897bac2a0864d4a59904b0e74ef7e8de5bd20601b237e
Deleted: sha256:800a86dcc05e56e0acde55b2653d425ee9362e1ae8300b3b514e1483b26554cf
Deleted: sha256:34e5c64fd5e77e0feb28d3103a48d130c4e1962f4a87d763ba6815e74500b6a5
Deleted: sha256:8fb9234a2ba34325d832677b02041c9ea43a6d67fae2a1edbe9dfbd78514909d
Deleted: sha256:e6baafbe603264603562022766c719aa4bf37e0590e9a33d053bf5b60b609bcf
Deleted: sha256:921486d6f9b021e7960c2dc201790b3d9ac480ed2978c8d17361cb72ccaef74e
Deleted: sha256:cd2c934c55488868935ed7a457395eddc0c193600f3216c1ede1f3ca2a67b0f3
Deleted: sha256:6c20b3356e503e741fb40666ec6c135d39f3d9d37ab3207dfadbdfc3e0366996
Deleted: sha256:1b1dd618928181c3c2194cb4cb016cbe2ed780ed7b95ed56197fd9ad88b8b22d
Deleted: sha256:a600c9c0e1075580d8971fd4d8dc86ea48cd14e096deef705980d6115fad2c03
Deleted: sha256:bc25ec690e6f6070327f632f703dc3f518f7000c95cb79b30d6da9c9c65626fa
Deleted: sha256:e8e3c1fc5901017682d0ce3718664660421e9ab2f9d9080d831f70b2ac0ec366
Deleted: sha256:d1e0f83760e2cc060f5950d45cc68e579ecdecde354125b403413b27ee11575e
Deleted: sha256:2bbcd9ea98053532c29b5b107192efd0c4492df6bc141e26cf49f6848f3b1fb5
Deleted: sha256:a3ebb353179ef8e9b20ae36d4d88ee7fd6e92d83da6684daab1d166f135717ab
Deleted: sha256:69cfe235aeb7a27c6ed425946a467bd8d0941811ea9c9f3b3f003edb91ac1d97
Build step 'Execute shell' marked build as failure

Mime
View raw message