mesos-builds mailing list archives

Site index · List index
Message view « Date » · « Thread »
Top « Date » · « Thread »
From Apache Jenkins Server <jenk...@builds.apache.org>
Subject Build failed in Jenkins: mesos-reviewbot #15640
Date Wed, 12 Oct 2016 19:26:32 GMT
See <https://builds.apache.org/job/mesos-reviewbot/15640/changes>

Changes:

[toenshoff] Added a parallel gtest runner.

[toenshoff] Added configure option for Mesos test runner.

[toenshoff] Enable Mesos test runner.

[toenshoff] Permitted specifying custom test driver in libprocess.

[toenshoff] Permitted specifying custom test driver in stout.

[xujyan] Recover resources when offer is rescinded on DESTROY of shared volume.

[yujie.jay] Added fields `chain` and `excludeDevices` to `PortMapper`.

[yujie.jay] Added `PluginError` to simplify error reporting for CNI plugins.

[yujie.jay] Added the 'name' and 'args' field to the 'delegate' plugin's CNI config.

[yujie.jay] Added constants for CNI commands.

[yujie.jay] Updated signature of `delegate` and `execute` method.

------------------------------------------
[...truncated 216880 lines...]
[ RUN      ] Endpoint/SlaveEndpointTest.AuthorizedRequest/1
I1012 19:26:13.327222 29214 containerizer.cpp:202] Using isolation: posix/cpu,posix/mem,filesystem/posix,network/cni
W1012 19:26:13.327853 29214 backend.cpp:75] Failed to create 'aufs' backend: AufsBackend requires
root privileges, but is running as user mesos
W1012 19:26:13.327998 29214 backend.cpp:75] Failed to create 'bind' backend: BindBackend requires
root privileges
I1012 19:26:13.330979 29243 slave.cpp:208] Mesos agent started on (620)@172.17.0.2:55106
I1012 19:26:13.331037 29243 slave.cpp:209] Flags at startup: --acls="" --appc_simple_discovery_uri_prefix="http://"
--appc_store_dir="/tmp/mesos/store/appc" --authenticate_http_readonly="true" --authenticate_http_readwrite="true"
--authenticatee="crammd5" --authentication_backoff_factor="1secs" --authorizer="local" --cgroups_cpu_enable_pids_and_tids_count="false"
--cgroups_enable_cfs="false" --cgroups_hierarchy="/sys/fs/cgroup" --cgroups_limit_swap="false"
--cgroups_root="mesos" --container_disk_watch_interval="15secs" --containerizers="mesos" --credential="/tmp/Endpoint_SlaveEndpointTest_AuthorizedRequest_1_wwzyci/credential"
--default_role="*" --disk_watch_interval="1mins" --docker="docker" --docker_kill_orphans="true"
--docker_registry="https://registry-1.docker.io" --docker_remove_delay="6hrs" --docker_socket="/var/run/docker.sock"
--docker_stop_timeout="0ns" --docker_store_dir="/tmp/mesos/store/docker" --docker_volume_checkpoint_dir="/var/run/mesos/isolators/docker/volume"
--enforce_container_disk_quota="false" --executor_registration_timeout="1mins" --executor_shutdown_grace_period="5secs"
--fetcher_cache_dir="/tmp/Endpoint_SlaveEndpointTest_AuthorizedRequest_1_wwzyci/fetch" --fetcher_cache_size="2GB"
--frameworks_home="" --gc_delay="1weeks" --gc_disk_headroom="0.1" --hadoop_home="" --help="true"
--hostname_lookup="true" --http_authenticators="basic" --http_command_executor="false" --http_credentials="/tmp/Endpoint_SlaveEndpointTest_AuthorizedRequest_1_wwzyci/http_credentials"
--image_provisioner_backend="copy" --initialize_driver_logging="true" --isolation="posix/cpu,posix/mem"
--launcher="posix" --launcher_dir="/mesos/mesos-1.1.0/_build/src" --logbufsecs="0" --logging_level="INFO"
--max_completed_executors_per_framework="150" --oversubscribed_resources_interval="15secs"
--perf_duration="10secs" --perf_interval="1mins" --qos_correction_interval_min="0ns" --quiet="false"
--recover="reconnect" --recovery_timeout="15mins" --registration_backoff_factor="10ms" --resources="cpus:2;gpus:0;mem:1024;disk:1024;ports:[31000-32000]"
--revocable_cpu_low_priority="true" --runtime_dir="/tmp/Endpoint_SlaveEndpointTest_AuthorizedRequest_1_wwzyci"
--sandbox_directory="/mnt/mesos/sandbox" --strict="true" --switch_user="true" --systemd_enable_support="true"
--systemd_runtime_directory="/run/systemd/system" --version="false" --work_dir="/tmp/Endpoint_SlaveEndpointTest_AuthorizedRequest_1_sGLNWe"
I1012 19:26:13.331665 29243 credentials.hpp:86] Loading credential for authentication from
'/tmp/Endpoint_SlaveEndpointTest_AuthorizedRequest_1_wwzyci/credential'
I1012 19:26:13.331878 29243 slave.cpp:346] Agent using credential for: test-principal
I1012 19:26:13.331904 29243 credentials.hpp:37] Loading credentials for authentication from
'/tmp/Endpoint_SlaveEndpointTest_AuthorizedRequest_1_wwzyci/http_credentials'
I1012 19:26:13.332195 29243 http.cpp:883] Using default 'basic' HTTP authenticator for realm
'mesos-agent-readonly'
I1012 19:26:13.333528 29243 http.cpp:883] Using default 'basic' HTTP authenticator for realm
'mesos-agent-readwrite'
I1012 19:26:13.335113 29243 slave.cpp:533] Agent resources: cpus(*):2; mem(*):1024; disk(*):1024;
ports(*):[31000-32000]
I1012 19:26:13.335253 29243 slave.cpp:541] Agent attributes: [  ]
I1012 19:26:13.335273 29243 slave.cpp:546] Agent hostname: e3b95694fc15
I1012 19:26:13.337357 29243 process.cpp:3377] Handling HTTP event for process 'slave(620)'
with path: '/slave(620)/monitor/statistics.json'
I1012 19:26:13.337736 29243 state.cpp:57] Recovering state from '/tmp/Endpoint_SlaveEndpointTest_AuthorizedRequest_1_sGLNWe/meta'
I1012 19:26:13.338156 29245 status_update_manager.cpp:203] Recovering status update manager
I1012 19:26:13.338384 29238 containerizer.cpp:557] Recovering containerizer
I1012 19:26:13.338541 29241 http.cpp:835] Authorizing principal 'test-principal' to GET the
'/monitor/statistics.json' endpoint
I1012 19:26:13.339861 29239 provisioner.cpp:253] Provisioner recovery complete
I1012 19:26:13.340349 29241 slave.cpp:5281] Finished recovery
I1012 19:26:13.341089 29241 slave.cpp:5455] Querying resource estimator for oversubscribable
resources
I1012 19:26:13.341516 29241 slave.cpp:5469] Received oversubscribable resources {} from the
resource estimator
I1012 19:26:13.343325 29214 slave.cpp:787] Agent terminating
[       OK ] Endpoint/SlaveEndpointTest.AuthorizedRequest/1 (45 ms)
[ RUN      ] Endpoint/SlaveEndpointTest.AuthorizedRequest/2
I1012 19:26:13.372859 29214 containerizer.cpp:202] Using isolation: posix/cpu,posix/mem,filesystem/posix,network/cni
W1012 19:26:13.373585 29214 backend.cpp:75] Failed to create 'aufs' backend: AufsBackend requires
root privileges, but is running as user mesos
W1012 19:26:13.373746 29214 backend.cpp:75] Failed to create 'bind' backend: BindBackend requires
root privileges
I1012 19:26:13.377221 29239 slave.cpp:208] Mesos agent started on (621)@172.17.0.2:55106
I1012 19:26:13.377249 29239 slave.cpp:209] Flags at startup: --acls="" --appc_simple_discovery_uri_prefix="http://"
--appc_store_dir="/tmp/mesos/store/appc" --authenticate_http_readonly="true" --authenticate_http_readwrite="true"
--authenticatee="crammd5" --authentication_backoff_factor="1secs" --authorizer="local" --cgroups_cpu_enable_pids_and_tids_count="false"
--cgroups_enable_cfs="false" --cgroups_hierarchy="/sys/fs/cgroup" --cgroups_limit_swap="false"
--cgroups_root="mesos" --container_disk_watch_interval="15secs" --containerizers="mesos" --credential="/tmp/Endpoint_SlaveEndpointTest_AuthorizedRequest_2_y4M2Bv/credential"
--default_role="*" --disk_watch_interval="1mins" --docker="docker" --docker_kill_orphans="true"
--docker_registry="https://registry-1.docker.io" --docker_remove_delay="6hrs" --docker_socket="/var/run/docker.sock"
--docker_stop_timeout="0ns" --docker_store_dir="/tmp/mesos/store/docker" --docker_volume_checkpoint_dir="/var/run/mesos/isolators/docker/volume"
--enforce_container_disk_quota="false" --executor_registration_timeout="1mins" --executor_shutdown_grace_period="5secs"
--fetcher_cache_dir="/tmp/Endpoint_SlaveEndpointTest_AuthorizedRequest_2_y4M2Bv/fetch" --fetcher_cache_size="2GB"
--frameworks_home="" --gc_delay="1weeks" --gc_disk_headroom="0.1" --hadoop_home="" --help="false"
--hostname_lookup="true" --http_authenticators="basic" --http_command_executor="false" --http_credentials="/tmp/Endpoint_SlaveEndpointTest_AuthorizedRequest_2_y4M2Bv/http_credentials"
--image_provisioner_backend="copy" --initialize_driver_logging="true" --isolation="posix/cpu,posix/mem"
--launcher="posix" --launcher_dir="/mesos/mesos-1.1.0/_build/src" --logbufsecs="0" --logging_level="INFO"
--max_completed_executors_per_framework="150" --oversubscribed_resources_interval="15secs"
--perf_duration="10secs" --perf_interval="1mins" --qos_correction_interval_min="0ns" --quiet="false"
--recover="reconnect" --recovery_timeout="15mins" --registration_backoff_factor="10ms" --resources="cpus:2;gpus:0;mem:1024;disk:1024;ports:[31000-32000]"
--revocable_cpu_low_priority="true" --runtime_dir="/tmp/Endpoint_SlaveEndpointTest_AuthorizedRequest_2_y4M2Bv"
--sandbox_directory="/mnt/mesos/sandbox" --strict="true" --switch_user="true" --systemd_enable_support="true"
--systemd_runtime_directory="/run/systemd/system" --version="false" --work_dir="/tmp/Endpoint_SlaveEndpointTest_AuthorizedRequest_2_y9DRes"
I1012 19:26:13.377686 29239 credentials.hpp:86] Loading credential for authentication from
'/tmp/Endpoint_SlaveEndpointTest_AuthorizedRequest_2_y4M2Bv/credential'
I1012 19:26:13.377890 29239 slave.cpp:346] Agent using credential for: test-principal
I1012 19:26:13.377909 29239 credentials.hpp:37] Loading credentials for authentication from
'/tmp/Endpoint_SlaveEndpointTest_AuthorizedRequest_2_y4M2Bv/http_credentials'
I1012 19:26:13.378157 29239 http.cpp:883] Using default 'basic' HTTP authenticator for realm
'mesos-agent-readonly'
I1012 19:26:13.378285 29239 http.cpp:883] Using default 'basic' HTTP authenticator for realm
'mesos-agent-readwrite'
I1012 19:26:13.379271 29239 slave.cpp:533] Agent resources: cpus(*):2; mem(*):1024; disk(*):1024;
ports(*):[31000-32000]
I1012 19:26:13.379343 29239 slave.cpp:541] Agent attributes: [  ]
I1012 19:26:13.379354 29239 slave.cpp:546] Agent hostname: e3b95694fc15
I1012 19:26:13.381093 29244 state.cpp:57] Recovering state from '/tmp/Endpoint_SlaveEndpointTest_AuthorizedRequest_2_y9DRes/meta'
I1012 19:26:13.381193 29239 process.cpp:3377] Handling HTTP event for process 'slave(621)'
with path: '/slave(621)/containers'
I1012 19:26:13.381645 29246 status_update_manager.cpp:203] Recovering status update manager
I1012 19:26:13.381980 29247 containerizer.cpp:557] Recovering containerizer
I1012 19:26:13.382235 29246 http.cpp:835] Authorizing principal 'test-principal' to GET the
'/containers' endpoint
I1012 19:26:13.383627 29241 provisioner.cpp:253] Provisioner recovery complete
I1012 19:26:13.384028 29240 slave.cpp:5281] Finished recovery
I1012 19:26:13.384613 29240 slave.cpp:5455] Querying resource estimator for oversubscribable
resources
I1012 19:26:13.385006 29240 slave.cpp:5469] Received oversubscribable resources {} from the
resource estimator
I1012 19:26:13.389724 29235 slave.cpp:787] Agent terminating
[       OK ] Endpoint/SlaveEndpointTest.AuthorizedRequest/2 (29 ms)
[ RUN      ] Endpoint/SlaveEndpointTest.UnauthorizedRequest/0
I1012 19:26:13.405169 29214 containerizer.cpp:202] Using isolation: posix/cpu,posix/mem,filesystem/posix,network/cni
W1012 19:26:13.405923 29214 backend.cpp:75] Failed to create 'aufs' backend: AufsBackend requires
root privileges, but is running as user mesos
W1012 19:26:13.406080 29214 backend.cpp:75] Failed to create 'bind' backend: BindBackend requires
root privileges
I1012 19:26:13.409430 29248 slave.cpp:208] Mesos agent started on (622)@172.17.0.2:55106
I1012 19:26:13.409454 29248 slave.cpp:209] Flags at startup: --acls="" --appc_simple_discovery_uri_prefix="http://"
--appc_store_dir="/tmp/mesos/store/appc" --authenticate_http_readonly="true" --authenticate_http_readwrite="true"
--authenticatee="crammd5" --authentication_backoff_factor="1secs" --authorizer="local" --cgroups_cpu_enable_pids_and_tids_count="false"
--cgroups_enable_cfs="false" --cgroups_hierarchy="/sys/fs/cgroup" --cgroups_limit_swap="false"
--cgroups_root="mesos" --container_disk_watch_interval="15secs" --containerizers="mesos" --credential="/tmp/Endpoint_SlaveEndpointTest_UnauthorizedRequest_0_O7u6nJ/credential"
--default_role="*" --disk_watch_interval="1mins" --docker="docker" --docker_kill_orphans="true"
--docker_registry="https://registry-1.docker.io" --docker_remove_delay="6hrs" --docker_socket="/var/run/docker.sock"
--docker_stop_timeout="0ns" --docker_store_dir="/tmp/mesos/store/docker" --docker_volume_checkpoint_dir="/var/run/mesos/isolators/docker/volume"
--enforce_container_disk_quota="false" --executor_registration_timeout="1mins" --executor_shutdown_grace_period="5secs"
--fetcher_cache_dir="/tmp/Endpoint_SlaveEndpointTest_UnauthorizedRequest_0_O7u6nJ/fetch" --fetcher_cache_size="2GB"
--frameworks_home="" --gc_delay="1weeks" --gc_disk_headroom="0.1" --hadoop_home="" --help="false"
--hostname_lookup="true" --http_authenticators="basic" --http_command_executor="false" --http_credentials="/tmp/Endpoint_SlaveEndpointTest_UnauthorizedRequest_0_O7u6nJ/http_credentials"
--image_provisioner_backend="copy" --initialize_driver_logging="true" --isolation="posix/cpu,posix/mem"
--launcher="posix" --launcher_dir="/mesos/mesos-1.1.0/_build/src" --logbufsecs="0" --logging_level="INFO"
--max_completed_executors_per_framework="150" --oversubscribed_resources_interval="15secs"
--perf_duration="10secs" --perf_interval="1mins" --qos_correction_interval_min="0ns" --quiet="false"
--recover="reconnect" --recovery_timeout="15mins" --registration_backoff_factor="10ms" --resources="cpus:2;gpus:0;mem:1024;disk:1024;ports:[31000-32000]"
--revocable_cpu_low_priority="true" --runtime_dir="/tmp/Endpoint_SlaveEndpointTest_UnauthorizedRequest_0_O7u6nJ"
--sandbox_directory="/mnt/mesos/sandbox" --strict="true" --switch_user="true" --systemd_enable_support="true"
--systemd_runtime_directory="/run/systemd/system" --version="false" --work_dir="/tmp/Endpoint_SlaveEndpointTest_UnauthorizedRequest_0_gQELVF"
I1012 19:26:13.410043 29248 credentials.hpp:86] Loading credential for authentication from
'/tmp/Endpoint_SlaveEndpointTest_UnauthorizedRequest_0_O7u6nJ/credential'
I1012 19:26:13.410228 29248 slave.cpp:346] Agent using credential for: test-principal
I1012 19:26:13.410248 29248 credentials.hpp:37] Loading credentials for authentication from
'/tmp/Endpoint_SlaveEndpointTest_UnauthorizedRequest_0_O7u6nJ/http_credentials'
I1012 19:26:13.410526 29248 http.cpp:883] Using default 'basic' HTTP authenticator for realm
'mesos-agent-readonly'
I1012 19:26:13.410650 29248 http.cpp:883] Using default 'basic' HTTP authenticator for realm
'mesos-agent-readwrite'
I1012 19:26:13.411986 29248 slave.cpp:533] Agent resources: cpus(*):2; mem(*):1024; disk(*):1024;
ports(*):[31000-32000]
I1012 19:26:13.412089 29248 slave.cpp:541] Agent attributes: [  ]
I1012 19:26:13.412104 29248 slave.cpp:546] Agent hostname: e3b95694fc15
I1012 19:26:13.413745 29248 process.cpp:3377] Handling HTTP event for process 'slave(622)'
with path: '/slave(622)/monitor/statistics'
I1012 19:26:13.414144 29248 state.cpp:57] Recovering state from '/tmp/Endpoint_SlaveEndpointTest_UnauthorizedRequest_0_gQELVF/meta'
I1012 19:26:13.415199 29248 status_update_manager.cpp:203] Recovering status update manager
I1012 19:26:13.415688 29248 containerizer.cpp:557] Recovering containerizer
I1012 19:26:13.415871 29238 http.cpp:835] Authorizing principal 'test-principal' to GET the
'/monitor/statistics' endpoint
I1012 19:26:13.417357 29244 provisioner.cpp:253] Provisioner recovery complete
I1012 19:26:13.417803 29246 slave.cpp:5281] Finished recovery
I1012 19:26:13.418444 29246 slave.cpp:5455] Querying resource estimator for oversubscribable
resources
I1012 19:26:13.418738 29242 slave.cpp:5469] Received oversubscribable resources {} from the
resource estimator
I1012 19:26:13.419687 29242 slave.cpp:787] Agent terminating
[       OK ] Endpoint/SlaveEndpointTest.UnauthorizedRequest/0 (25 ms)
[ RUN      ] Endpoint/SlaveEndpointTest.UnauthorizedRequest/1
I1012 19:26:13.442523 29214 containerizer.cpp:202] Using isolation: posix/cpu,posix/mem,filesystem/posix,network/cni
W1012 19:26:13.443470 29214 backend.cpp:75] Failed to create 'aufs' backend: AufsBackend requires
root privileges, but is running as user mesos
W1012 19:26:13.443658 29214 backend.cpp:75] Failed to create 'bind' backend: BindBackend requires
root privileges
I1012 19:26:13.449756 29237 slave.cpp:208] Mesos agent started on (623)@172.17.0.2:55106
I1012 19:26:13.449802 29237 slave.cpp:209] Flags at startup: --acls="" --appc_simple_discovery_uri_prefix="http://"
--appc_store_dir="/tmp/mesos/store/appc" --authenticate_http_readonly="true" --authenticate_http_readwrite="true"
--authenticatee="crammd5" --authentication_backoff_factor="1secs" --authorizer="local" --cgroups_cpu_enable_pids_and_tids_count="false"
--cgroups_enable_cfs="false" --cgroups_hierarchy="/sys/fs/cgroup" --cgroups_limit_swap="false"
--cgroups_root="mesos" --container_disk_watch_interval="15secs" --containerizers="mesos" --credential="/tmp/Endpoint_SlaveEndpointTest_UnauthorizedRequest_1_Qe0yxX/credential"
--default_role="*" --disk_watch_interval="1mins" --docker="docker" --docker_kill_orphans="true"
--docker_registry="https://registry-1.docker.io" --docker_remove_delay="6hrs" --docker_socket="/var/run/docker.sock"
--docker_stop_timeout="0ns" --docker_store_dir="/tmp/mesos/store/docker" --docker_volume_checkpoint_dir="/var/run/mesos/isolators/docker/volume"
--enforce_container_disk_quota="false" --executor_registration_timeout="1mins" --executor_shutdown_grace_period="5secs"
--fetcher_cache_dir="/tmp/Endpoint_SlaveEndpointTest_UnauthorizedRequest_1_Qe0yxX/fetch" --fetcher_cache_size="2GB"
--frameworks_home="" --gc_delay="1weeks" --gc_disk_headroom="0.1" --hadoop_home="" --help="true"
--hostname_lookup="true" --http_authenticators="basic" --http_command_executor="false" --http_credentials="/tmp/Endpoint_SlaveEndpointTest_UnauthorizedRequest_1_Qe0yxX/http_credentials"
--image_provisioner_backend="copy" --initialize_driver_logging="true" --isolation="posix/cpu,posix/mem"
--launcher="posix" --launcher_dir="/mesos/mesos-1.1.0/_build/src" --logbufsecs="0" --logging_level="INFO"
--max_completed_executors_per_framework="150" --oversubscribed_resources_interval="15secs"
--perf_duration="10secs" --perf_interval="1mins" --qos_correction_interval_min="0ns" --quiet="false"
--recover="reconnect" --recovery_timeout="15mins" --registration_backoff_factor="10ms" --resources="cpus:2;gpus:0;mem:1024;disk:1024;ports:[31000-32000]"
--revocable_cpu_low_priority="true" --runtime_dir="/tmp/Endpoint_SlaveEndpointTest_UnauthorizedRequest_1_Qe0yxX"
--sandbox_directory="/mnt/mesos/sandbox" --strict="true" --switch_user="true" --systemd_enable_support="true"
--systemd_runtime_directory="/run/systemd/system" --version="false" --work_dir="/tmp/Endpoint_SlaveEndpointTest_UnauthorizedRequest_1_ymAdZT"
I1012 19:26:13.450520 29237 credentials.hpp:86] Loading credential for authentication from
'/tmp/Endpoint_SlaveEndpointTest_UnauthorizedRequest_1_Qe0yxX/credential'
I1012 19:26:13.450767 29237 slave.cpp:346] Agent using credential for: test-principal
I1012 19:26:13.450793 29237 credentials.hpp:37] Loading credentials for authentication from
'/tmp/Endpoint_SlaveEndpointTest_UnauthorizedRequest_1_Qe0yxX/http_credentials'
I1012 19:26:13.451073 29237 http.cpp:883] Using default 'basic' HTTP authenticator for realm
'mesos-agent-readonly'
I1012 19:26:13.451253 29237 http.cpp:883] Using default 'basic' HTTP authenticator for realm
'mesos-agent-readwrite'
I1012 19:26:13.452693 29237 slave.cpp:533] Agent resources: cpus(*):2; mem(*):1024; disk(*):1024;
ports(*):[31000-32000]
I1012 19:26:13.452937 29237 slave.cpp:541] Agent attributes: [  ]
I1012 19:26:13.453069 29237 slave.cpp:546] Agent hostname: e3b95694fc15
I1012 19:26:13.454759 29241 state.cpp:57] Recovering state from '/tmp/Endpoint_SlaveEndpointTest_UnauthorizedRequest_1_ymAdZT/meta'
I1012 19:26:13.454820 29237 process.cpp:3377] Handling HTTP event for process 'slave(623)'
with path: '/slave(623)/monitor/statistics.json'
I1012 19:26:13.455433 29247 status_update_manager.cpp:203] Recovering status update manager
I1012 19:26:13.455699 29247 containerizer.cpp:557] Recovering containerizer
I1012 19:26:13.456008 29237 http.cpp:835] Authorizing principal 'test-principal' to GET the
'/monitor/statistics.json' endpoint
I1012 19:26:13.457090 29248 provisioner.cpp:253] Provisioner recovery complete
I1012 19:26:13.457396 29243 slave.cpp:5281] Finished recovery
I1012 19:26:13.468418 29243 slave.cpp:5455] Querying resource estimator for oversubscribable
resources
I1012 19:26:13.468585 29243 slave.cpp:787] Agent terminating
[       OK ] Endpoint/SlaveEndpointTest.UnauthorizedRequest/1 (47 ms)
[ RUN      ] Endpoint/SlaveEndpointTest.UnauthorizedRequest/2
I1012 19:26:13.494232 29214 containerizer.cpp:202] Using isolation: posix/cpu,posix/mem,filesystem/posix,network/cni
W1012 19:26:13.495059 29214 backend.cpp:75] Failed to create 'aufs' backend: AufsBackend requires
root privileges, but is running as user mesos
W1012 19:26:13.495213 29214 backend.cpp:75] Failed to create 'bind' backend: BindBackend requires
root privileges
I1012 19:26:13.499552 29243 slave.cpp:208] Mesos agent started on (624)@172.17.0.2:55106
I1012 19:26:13.499600 29243 slave.cpp:209] Flags at startup: --acls="" --appc_simple_discovery_uri_prefix="http://"
--appc_store_dir="/tmp/mesos/store/appc" --authenticate_http_readonly="true" --authenticate_http_readwrite="true"
--authenticatee="crammd5" --authentication_backoff_factor="1secs" --authorizer="local" --cgroups_cpu_enable_pids_and_tids_count="false"
--cgroups_enable_cfs="false" --cgroups_hierarchy="/sys/fs/cgroup" --cgroups_limit_swap="false"
--cgroups_root="mesos" --container_disk_watch_interval="15secs" --containerizers="mesos" --credential="/tmp/Endpoint_SlaveEndpointTest_UnauthorizedRequest_2_2r1pec/credential"
--default_role="*" --disk_watch_interval="1mins" --docker="docker" --docker_kill_orphans="true"
--docker_registry="https://registry-1.docker.io" --docker_remove_delay="6hrs" --docker_socket="/var/run/docker.sock"
--docker_stop_timeout="0ns" --docker_store_dir="/tmp/mesos/store/docker" --docker_volume_checkpoint_dir="/var/run/mesos/isolators/docker/volume"
--enforce_container_disk_quota="false" --executor_registration_timeout="1mins" --executor_shutdown_grace_period="5secs"
--fetcher_cache_dir="/tmp/Endpoint_SlaveEndpointTest_UnauthorizedRequest_2_2r1pec/fetch" --fetcher_cache_size="2GB"
--frameworks_home="" --gc_delay="1weeks" --gc_disk_headroom="0.1" --hadoop_home="" --help="true"
--hostname_lookup="true" --http_authenticators="basic" --http_command_executor="false" --http_credentials="/tmp/Endpoint_SlaveEndpointTest_UnauthorizedRequest_2_2r1pec/http_credentials"
--image_provisioner_backend="copy" --initialize_driver_logging="true" --isolation="posix/cpu,posix/mem"
--launcher="posix" --launcher_dir="/mesos/mesos-1.1.0/_build/src" --logbufsecs="0" --logging_level="INFO"
--max_completed_executors_per_framework="150" --oversubscribed_resources_interval="15secs"
--perf_duration="10secs" --perf_interval="1mins" --qos_correction_interval_min="0ns" --quiet="false"
--recover="reconnect" --recovery_timeout="15mins" --registration_backoff_factor="10ms" --resources="cpus:2;gpus:0;mem:1024;disk:1024;ports:[31000-32000]"
--revocable_cpu_low_priority="true" --runtime_dir="/tmp/Endpoint_SlaveEndpointTest_UnauthorizedRequest_2_2r1pec"
--sandbox_directory="/mnt/mesos/sandbox" --strict="true" --switch_user="true" --systemd_enable_support="true"
--systemd_runtime_directory="/run/systemd/system" --version="false" --work_dir="/tmp/Endpoint_SlaveEndpointTest_UnauthorizedRequest_2_a1LGx8"
I1012 19:26:13.500531 29243 credentials.hpp:86] Loading credential for authentication from
'/tmp/Endpoint_SlaveEndpointTest_UnauthorizedRequest_2_2r1pec/credential'
I1012 19:26:13.500818 29243 slave.cpp:346] Agent using credential for: test-principal
I1012 19:26:13.500847 29243 credentials.hpp:37] Loading credentials for authentication from
'/tmp/Endpoint_SlaveEndpointTest_UnauthorizedRequest_2_2r1pec/http_credentials'
I1012 19:26:13.501895 29243 http.cpp:883] Using default 'basic' HTTP authenticator for realm
'mesos-agent-readonly'
I1012 19:26:13.502225 29243 http.cpp:883] Using default 'basic' HTTP authenticator for realm
'mesos-agent-readwrite'
I1012 19:26:13.504139 29243 slave.cpp:533] Agent resources: cpus(*):2; mem(*):1024; disk(*):1024;
ports(*):[31000-32000]
I1012 19:26:13.504290 29243 slave.cpp:541] Agent attributes: [  ]
I1012 19:26:13.504309 29243 slave.cpp:546] Agent hostname: e3b95694fc15
I1012 19:26:13.505753 29242 state.cpp:57] Recovering state from '/tmp/Endpoint_SlaveEndpointTest_UnauthorizedRequest_2_a1LGx8/meta'
I1012 19:26:13.505856 29243 process.cpp:3377] Handling HTTP event for process 'slave(624)'
with path: '/slave(624)/containers'
I1012 19:26:13.506387 29233 status_update_manager.cpp:203] Recovering status update manager
I1012 19:26:13.506588 29247 containerizer.cpp:557] Recovering containerizer
I1012 19:26:13.506922 29236 http.cpp:835] Authorizing principal 'test-principal' to GET the
'/containers' endpoint
I1012 19:26:13.512249 29243 provisioner.cpp:253] Provisioner recovery complete
I1012 19:26:13.516394 29241 slave.cpp:5281] Finished recovery
I1012 19:26:13.542207 29241 slave.cpp:5455] Querying resource estimator for oversubscribable
resources
I1012 19:26:13.542387 29241 slave.cpp:787] Agent terminating
[       OK ] Endpoint/SlaveEndpointTest.UnauthorizedRequest/2 (67 ms)
[ RUN      ] Endpoint/SlaveEndpointTest.NoAuthorizer/0
I1012 19:26:13.569530 29214 containerizer.cpp:202] Using isolation: posix/cpu,posix/mem,filesystem/posix,network/cni
W1012 19:26:13.570988 29214 backend.cpp:75] Failed to create 'aufs' backend: AufsBackend requires
root privileges, but is running as user mesos
W1012 19:26:13.571328 29214 backend.cpp:75] Failed to create 'bind' backend: BindBackend requires
root privileges
I1012 19:26:13.573740 29214 cluster.cpp:435] Creating default 'local' authorizer
I1012 19:26:13.578269 29235 slave.cpp:208] Mesos agent started on (625)@172.17.0.2:55106
I1012 19:26:13.579521 29235 slave.cpp:209] Flags at startup: --acls="" --appc_simple_discovery_uri_prefix="http://"
--appc_store_dir="/tmp/mesos/store/appc" --authenticate_http_readonly="true" --authenticate_http_readwrite="true"
--authenticatee="crammd5" --authentication_backoff_factor="1secs" --authorizer="local" --cgroups_cpu_enable_pids_and_tids_count="false"
--cgroups_enable_cfs="false" --cgroups_hierarchy="/sys/fs/cgroup" --cgroups_limit_swap="false"
--cgroups_root="mesos" --container_disk_watch_interval="15secs" --containerizers="mesos" --credential="/tmp/Endpoint_SlaveEndpointTest_NoAuthorizer_0_oVQrHr/credential"
--default_role="*" --disk_watch_interval="1mins" --docker="docker" --docker_kill_orphans="true"
--docker_registry="https://registry-1.docker.io" --docker_remove_delay="6hrs" --docker_socket="/var/run/docker.sock"
--docker_stop_timeout="0ns" --docker_store_dir="/tmp/mesos/store/docker" --docker_volume_checkpoint_dir="/var/run/mesos/isolators/docker/volume"
--enforce_container_disk_quota="false" --executor_registration_timeout="1mins" --executor_shutdown_grace_period="5secs"
--fetcher_cache_dir="/tmp/Endpoint_SlaveEndpointTest_NoAuthorizer_0_oVQrHr/fetch" --fetcher_cache_size="2GB"
--frameworks_home="" --gc_delay="1weeks" --gc_disk_headroom="0.1" --hadoop_home="" --help="false"
--hostname_lookup="true" --http_authenticators="basic" --http_command_executor="false" --http_credentials="/tmp/Endpoint_SlaveEndpointTest_NoAuthorizer_0_oVQrHr/http_credentials"
--image_provisioner_backend="copy" --initialize_driver_logging="true" --isolation="posix/cpu,posix/mem"
--launcher="posix" --launcher_dir="/mesos/mesos-1.1.0/_build/src" --logbufsecs="0" --logging_level="INFO"
--max_completed_executors_per_framework="150" --oversubscribed_resources_interval="15secs"
--perf_duration="10secs" --perf_interval="1mins" --qos_correction_interval_min="0ns" --quiet="false"
--recover="reconnect" --recovery_timeout="15mins" --registration_backoff_factor="10ms" --resources="cpus:2;gpus:0;mem:1024;disk:1024;ports:[31000-32000]"
--revocable_cpu_low_priority="true" --runtime_dir="/tmp/Endpoint_SlaveEndpointTest_NoAuthorizer_0_oVQrHr"
--sandbox_directory="/mnt/mesos/sandbox" --strict="true" --switch_user="true" --systemd_enable_support="true"
--systemd_runtime_directory="/run/systemd/system" --version="false" --work_dir="/tmp/Endpoint_SlaveEndpointTest_NoAuthorizer_0_kNUzOn"
I1012 19:26:13.580844 29235 credentials.hpp:86] Loading credential for authentication from
'/tmp/Endpoint_SlaveEndpointTest_NoAuthorizer_0_oVQrHr/credential'
I1012 19:26:13.581396 29235 slave.cpp:346] Agent using credential for: test-principal
I1012 19:26:13.581796 29235 credentials.hpp:37] Loading credentials for authentication from
'/tmp/Endpoint_SlaveEndpointTest_NoAuthorizer_0_oVQrHr/http_credentials'
I1012 19:26:13.582406 29235 http.cpp:883] Using default 'basic' HTTP authenticator for realm
'mesos-agent-readonly'
I1012 19:26:13.582880 29235 http.cpp:883] Using default 'basic' HTTP authenticator for realm
'mesos-agent-readwrite'
I1012 19:26:13.585149 29235 slave.cpp:533] Agent resources: cpus(*):2; mem(*):1024; disk(*):1024;
ports(*):[31000-32000]
I1012 19:26:13.585284 29235 slave.cpp:541] Agent attributes: [  ]
I1012 19:26:13.585301 29235 slave.cpp:546] Agent hostname: e3b95694fc15
I1012 19:26:13.587395 29235 process.cpp:3377] Handling HTTP event for process 'slave(625)'
with path: '/slave(625)/monitor/statistics'
I1012 19:26:13.588413 29235 state.cpp:57] Recovering state from '/tmp/Endpoint_SlaveEndpointTest_NoAuthorizer_0_kNUzOn/meta'
I1012 19:26:13.589583 29235 status_update_manager.cpp:203] Recovering status update manager
I1012 19:26:13.590060 29235 containerizer.cpp:557] Recovering containerizer
I1012 19:26:13.590728 29235 http.cpp:835] Authorizing principal 'test-principal' to GET the
'/monitor/statistics' endpoint
I1012 19:26:13.592527 29247 provisioner.cpp:253] Provisioner recovery complete
I1012 19:26:13.593713 29235 slave.cpp:5281] Finished recovery
I1012 19:26:13.594282 29235 slave.cpp:5455] Querying resource estimator for oversubscribable
resources
I1012 19:26:13.594630 29235 slave.cpp:5469] Received oversubscribable resources {} from the
resource estimator
I1012 19:26:13.601586 29214 slave.cpp:787] Agent terminating
[       OK ] Endpoint/SlaveEndpointTest.NoAuthorizer/0 (44 ms)
[ RUN      ] Endpoint/SlaveEndpointTest.NoAuthorizer/1
I1012 19:26:13.613298 29214 containerizer.cpp:202] Using isolation: posix/cpu,posix/mem,filesystem/posix,network/cni
W1012 19:26:13.614223 29214 backend.cpp:75] Failed to create 'aufs' backend: AufsBackend requires
root privileges, but is running as user mesos
W1012 19:26:13.614660 29214 backend.cpp:75] Failed to create 'bind' backend: BindBackend requires
root privileges
I1012 19:26:13.616719 29214 cluster.cpp:435] Creating default 'local' authorizer
I1012 19:26:13.619617 29234 slave.cpp:208] Mesos agent started on (626)@172.17.0.2:55106
I1012 19:26:13.619654 29234 slave.cpp:209] Flags at startup: --acls="" --appc_simple_discovery_uri_prefix="http://"
--appc_store_dir="/tmp/mesos/store/appc" --authenticate_http_readonly="true" --authenticate_http_readwrite="true"
--authenticatee="crammd5" --authentication_backoff_factor="1secs" --authorizer="local" --cgroups_cpu_enable_pids_and_tids_count="false"
--cgroups_enable_cfs="false" --cgroups_hierarchy="/sys/fs/cgroup" --cgroups_limit_swap="false"
--cgroups_root="mesos" --container_disk_watch_interval="15secs" --containerizers="mesos" --credential="/tmp/Endpoint_SlaveEndpointTest_NoAuthorizer_1_qBZREH/credential"
--default_role="*" --disk_watch_interval="1mins" --docker="docker" --docker_kill_orphans="true"
--docker_registry="https://registry-1.docker.io" --docker_remove_delay="6hrs" --docker_socket="/var/run/docker.sock"
--docker_stop_timeout="0ns" --docker_store_dir="/tmp/mesos/store/docker" --docker_volume_checkpoint_dir="/var/run/mesos/isolators/docker/volume"
--enforce_container_disk_quota="false" --executor_registration_timeout="1mins" --executor_shutdown_grace_period="5secs"
--fetcher_cache_dir="/tmp/Endpoint_SlaveEndpointTest_NoAuthorizer_1_qBZREH/fetch" --fetcher_cache_size="2GB"
--frameworks_home="" --gc_delay="1weeks" --gc_disk_headroom="0.1" --hadoop_home="" --help="false"
--hostname_lookup="true" --http_authenticators="basic" --http_command_executor="false" --http_credentials="/tmp/Endpoint_SlaveEndpointTest_NoAuthorizer_1_qBZREH/http_credentials"
--image_provisioner_backend="copy" --initialize_driver_logging="true" --isolation="posix/cpu,posix/mem"
--launcher="posix" --launcher_dir="/mesos/mesos-1.1.0/_build/src" --logbufsecs="0" --logging_level="INFO"
--max_completed_executors_per_framework="150" --oversubscribed_resources_interval="15secs"
--perf_duration="10secs" --perf_interval="1mins" --qos_correction_interval_min="0ns" --quiet="false"
--recover="reconnect" --recovery_timeout="15mins" --registration_backoff_factor="10ms" --resources="cpus:2;gpus:0;mem:1024;disk:1024;ports:[31000-32000]"
--revocable_cpu_low_priority="true" --runtime_dir="/tmp/Endpoint_SlaveEndpointTest_NoAuthorizer_1_qBZREH"
--sandbox_directory="/mnt/mesos/sandbox" --strict="true" --switch_user="true" --systemd_enable_support="true"
--systemd_runtime_directory="/run/systemd/system" --version="false" --work_dir="/tmp/Endpoint_SlaveEndpointTest_NoAuthorizer_1_gDQKED"
I1012 19:26:13.620548 29234 credentials.hpp:86] Loading credential for authentication from
'/tmp/Endpoint_SlaveEndpointTest_NoAuthorizer_1_qBZREH/credential'
I1012 19:26:13.620833 29234 slave.cpp:346] Agent using credential for: test-principal
I1012 19:26:13.620949 29234 credentials.hpp:37] Loading credentials for authentication from
'/tmp/Endpoint_SlaveEndpointTest_NoAuthorizer_1_qBZREH/http_credentials'
I1012 19:26:13.621353 29234 http.cpp:883] Using default 'basic' HTTP authenticator for realm
'mesos-agent-readonly'
I1012 19:26:13.621496 29234 http.cpp:883] Using default 'basic' HTTP authenticator for realm
'mesos-agent-readwrite'
I1012 19:26:13.623002 29234 slave.cpp:533] Agent resources: cpus(*):2; mem(*):1024; disk(*):1024;
ports(*):[31000-32000]
I1012 19:26:13.623106 29234 slave.cpp:541] Agent attributes: [  ]
I1012 19:26:13.623119 29234 slave.cpp:546] Agent hostname: e3b95694fc15
I1012 19:26:13.626394 29244 state.cpp:57] Recovering state from '/tmp/Endpoint_SlaveEndpointTest_NoAuthorizer_1_gDQKED/meta'
I1012 19:26:13.626541 29234 process.cpp:3377] Handling HTTP event for process 'slave(626)'
with path: '/slave(626)/monitor/statistics.json'
I1012 19:26:13.627105 29244 status_update_manager.cpp:203] Recovering status update manager
I1012 19:26:13.627409 29244 containerizer.cpp:557] Recovering containerizer
I1012 19:26:13.627817 29237 http.cpp:835] Authorizing principal 'test-principal' to GET the
'/monitor/statistics.json' endpoint
I1012 19:26:13.629271 29234 provisioner.cpp:253] Provisioner recovery complete
I1012 19:26:13.629531 29234 slave.cpp:5281] Finished recovery
I1012 19:26:13.630149 29234 slave.cpp:5455] Querying resource estimator for oversubscribable
resources
I1012 19:26:13.630590 29234 slave.cpp:5469] Received oversubscribable resources {} from the
resource estimator
I1012 19:26:13.632167 29237 slave.cpp:787] Agent terminating
[       OK ] Endpoint/SlaveEndpointTest.NoAuthorizer/1 (33 ms)
[ RUN      ] Endpoint/SlaveEndpointTest.NoAuthorizer/2
I1012 19:26:13.653148 29214 containerizer.cpp:202] Using isolation: posix/cpu,posix/mem,filesystem/posix,network/cni
W1012 19:26:13.654213 29214 backend.cpp:75] Failed to create 'aufs' backend: AufsBackend requires
root privileges, but is running as user mesos
W1012 19:26:13.654367 29214 backend.cpp:75] Failed to create 'bind' backend: BindBackend requires
root privileges
I1012 19:26:13.656139 29214 cluster.cpp:435] Creating default 'local' authorizer
I1012 19:26:13.658179 29242 slave.cpp:208] Mesos agent started on (627)@172.17.0.2:55106
I1012 19:26:13.658210 29242 slave.cpp:209] Flags at startup: --acls="" --appc_simple_discovery_uri_prefix="http://"
--appc_store_dir="/tmp/mesos/store/appc" --authenticate_http_readonly="true" --authenticate_http_readwrite="true"
--authenticatee="crammd5" --authentication_backoff_factor="1secs" --authorizer="local" --cgroups_cpu_enable_pids_and_tids_count="false"
--cgroups_enable_cfs="false" --cgroups_hierarchy="/sys/fs/cgroup" --cgroups_limit_swap="false"
--cgroups_root="mesos" --container_disk_watch_interval="15secs" --containerizers="mesos" --credential="/tmp/Endpoint_SlaveEndpointTest_NoAuthorizer_2_sroj1X/credential"
--default_role="*" --disk_watch_interval="1mins" --docker="docker" --docker_kill_orphans="true"
--docker_registry="https://registry-1.docker.io" --docker_remove_delay="6hrs" --docker_socket="/var/run/docker.sock"
--docker_stop_timeout="0ns" --docker_store_dir="/tmp/mesos/store/docker" --docker_volume_checkpoint_dir="/var/run/mesos/isolators/docker/volume"
--enforce_container_disk_quota="false" --executor_registration_timeout="1mins" --executor_shutdown_grace_period="5secs"
--fetcher_cache_dir="/tmp/Endpoint_SlaveEndpointTest_NoAuthorizer_2_sroj1X/fetch" --fetcher_cache_size="2GB"
--frameworks_home="" --gc_delay="1weeks" --gc_disk_headroom="0.1" --hadoop_home="" --help="false"
--hostname_lookup="true" --http_authenticators="basic" --http_command_executor="false" --http_credentials="/tmp/Endpoint_SlaveEndpointTest_NoAuthorizer_2_sroj1X/http_credentials"
--image_provisioner_backend="copy" --initialize_driver_logging="true" --isolation="posix/cpu,posix/mem"
--launcher="posix" --launcher_dir="/mesos/mesos-1.1.0/_build/src" --logbufsecs="0" --logging_level="INFO"
--max_completed_executors_per_framework="150" --oversubscribed_resources_interval="15secs"
--perf_duration="10secs" --perf_interval="1mins" --qos_correction_interval_min="0ns" --quiet="false"
--recover="reconnect" --recovery_timeout="15mins" --registration_backoff_factor="10ms" --resources="cpus:2;gpus:0;mem:1024;disk:1024;ports:[31000-32000]"
--revocable_cpu_low_priority="true" --runtime_dir="/tmp/Endpoint_SlaveEndpointTest_NoAuthorizer_2_sroj1X"
--sandbox_directory="/mnt/mesos/sandbox" --strict="true" --switch_user="true" --systemd_enable_support="true"
--systemd_runtime_directory="/run/systemd/system" --version="false" --work_dir="/tmp/Endpoint_SlaveEndpointTest_NoAuthorizer_2_KFRNUT"
I1012 19:26:13.658957 29242 credentials.hpp:86] Loading credential for authentication from
'/tmp/Endpoint_SlaveEndpointTest_NoAuthorizer_2_sroj1X/credential'
I1012 19:26:13.659205 29242 slave.cpp:346] Agent using credential for: test-principal
I1012 19:26:13.659225 29242 credentials.hpp:37] Loading credentials for authentication from
'/tmp/Endpoint_SlaveEndpointTest_NoAuthorizer_2_sroj1X/http_credentials'
I1012 19:26:13.659596 29242 http.cpp:883] Using default 'basic' HTTP authenticator for realm
'mesos-agent-readonly'
I1012 19:26:13.659910 29242 http.cpp:883] Using default 'basic' HTTP authenticator for realm
'mesos-agent-readwrite'
I1012 19:26:13.661536 29242 slave.cpp:533] Agent resources: cpus(*):2; mem(*):1024; disk(*):1024;
ports(*):[31000-32000]
I1012 19:26:13.661644 29242 slave.cpp:541] Agent attributes: [  ]
I1012 19:26:13.661660 29242 slave.cpp:546] Agent hostname: e3b95694fc15
I1012 19:26:13.663381 29237 state.cpp:57] Recovering state from '/tmp/Endpoint_SlaveEndpointTest_NoAuthorizer_2_KFRNUT/meta'
I1012 19:26:13.663462 29242 process.cpp:3377] Handling HTTP event for process 'slave(627)'
with path: '/slave(627)/containers'
I1012 19:26:13.664086 29242 status_update_manager.cpp:203] Recovering status update manager
I1012 19:26:13.664458 29243 containerizer.cpp:557] Recovering containerizer
I1012 19:26:13.664654 29239 http.cpp:835] Authorizing principal 'test-principal' to GET the
'/containers' endpoint
I1012 19:26:13.666057 29246 provisioner.cpp:253] Provisioner recovery complete
I1012 19:26:13.666411 29237 slave.cpp:5281] Finished recovery
I1012 19:26:13.666985 29237 slave.cpp:5455] Querying resource estimator for oversubscribable
resources
I1012 19:26:13.667182 29242 slave.cpp:5469] Received oversubscribable resources {} from the
resource estimator
I1012 19:26:13.668370 29248 slave.cpp:787] Agent terminating
[       OK ] Endpoint/SlaveEndpointTest.NoAuthorizer/2 (26 ms)
[----------] 9 tests from Endpoint/SlaveEndpointTest (397 ms total)

[----------] Global test environment tear-down
[==========] 1354 tests from 154 test cases ran. (1292458 ms total)
[  PASSED  ] 1352 tests.
[  FAILED  ] 2 tests, listed below:
[  FAILED  ] DiskResource/PersistentVolumeTest.SharedPersistentVolumeRescindOnDestroy/0, where
GetParam() = 0
[  FAILED  ] DiskResource/PersistentVolumeTest.SharedPersistentVolumeRescindOnDestroy/1, where
GetParam() = 1

 2 FAILED TESTS
  YOU HAVE 5 DISABLED TESTS

make[4]: *** [check-local] Error 1
make[4]: Leaving directory `/mesos/mesos-1.1.0/_build/src'
make[3]: *** [check-am] Error 2
make[3]: Leaving directory `/mesos/mesos-1.1.0/_build/src'
make[2]: *** [check] Error 2
make[2]: Leaving directory `/mesos/mesos-1.1.0/_build/src'
make[1]: *** [check-recursive] Error 1
make[1]: Leaving directory `/mesos/mesos-1.1.0/_build'
make: *** [distcheck] Error 1
+ docker rmi mesos-1476296393-12299
Untagged: mesos-1476296393-12299:latest
Deleted: sha256:21a322737348e696413f0c1aa49f209f2743411290b3b0651789907235696232
Deleted: sha256:d77f399d8f85bf7aee2efd5adf1496fcf460fcae194eca84c88f964092c5a6ac
Deleted: sha256:128353a7550f03cd919bdcd7bb7ef0f197fb8146141eb20b406f572e45069604
Deleted: sha256:5035afe41968f49d22e0a3b5abc9b6e5985827a15ff9b0a6f30d483efd08da22
Deleted: sha256:ff28128fdc32825718efe4243da5bd5e1872587faf56153dd567a5baa01d4f6a
Deleted: sha256:356b085a449014dbc049d28ebb4184a8b6ed80697e139db21c775ebb5c8b737d
Deleted: sha256:a6dab49940a55ff40a5378e836ba27e94a00dae485d44e0edd6d08072dbe0602
Deleted: sha256:83c22fd0159856d8c01d9082ce013a3c8727e661285025424de99f4e858f12db
Deleted: sha256:2a7e1082af23529af99a4b114c2b5d60e861e06266339efead4f53ebcbcfef67
Deleted: sha256:d260de090f0710a4ab5713ac8ced857266af5e6bc7b4bafe42cf6f2d138adb3b
Deleted: sha256:a5e7d44b53f698f857cddac8374d6b5f52b10e269663317946cc19133996777a
Deleted: sha256:111459d29f848c544e34200aed5db1c189df17537897f07a808d3ecdae7aeb01
Deleted: sha256:eff02d7bf807be17f1c2a28a03c864ae144dbaf85cf184ad7168d34fdfc8f844
Deleted: sha256:ff68db20692330bd2a960d99207d690e14b84dbf7a739cbb99326cc3cc716adf
Deleted: sha256:a5d98bd387b561f1de03ccb20407afa63f2b377bd3c5b41d8501277b605569d0
Deleted: sha256:c1e0a6b338f3df71b8a20e576993ec6fff4d80bb895fd81e66e8da686c992a9b
Deleted: sha256:7a5a2cae1f0181f411540f3f67fcbe5abfced49c0edaf2615203b3cd486c44e4
Deleted: sha256:556d543f0a5c1af6c0362bafa0bfb44c24d3b615f9a65e8be487bbb6db8146d6
Deleted: sha256:6dcf0c531e605338ab8266e7424aaeb8cd2b1f695a8a67e376400d2af57ca7a1
Deleted: sha256:bebc0a519f37a4ca3a01f0c62e1b7371690f53947727c84650a83c4f4d118fe8
Deleted: sha256:08a28385ffffba55afbcf171ba6a8af29b6b2cd1be7fe5d82fd986a131ae3d1c
Deleted: sha256:f88b5da76b7edaa23b5666a027cfb6e6fd45d6931db57830fee26cb42191e159
Deleted: sha256:5a3330ab569ec8d6fc33f7ee182ada6ba0895187c36ff6d872e074b8c851a74f
Deleted: sha256:ef501208280f54ceae89e2b92ecd0541584f6f935bbf9e46bc362a563d636822
Build step 'Execute shell' marked build as failure

Mime
View raw message