mesos-builds mailing list archives

Site index · List index
Message view « Date » · « Thread »
Top « Date » · « Thread »
From Anand Mazumdar <an...@mesosphere.io>
Subject Re: Build failed in Jenkins: Mesos » autotools,clang,--verbose,GLOG_v=1 MESOS_VERBOSE=1,ubuntu:14.04,(docker||Hadoop)&&(!ubuntu-us1)&&(!ubuntu-6) #2739
Date Fri, 07 Oct 2016 17:21:51 GMT
This was resolved yesterday thanks to BenM! 

https://issues.apache.org/jira/browse/MESOS-6319 <https://issues.apache.org/jira/browse/MESOS-6319>

-anand

> On Oct 7, 2016, at 10:18 AM, Vinod Kone <vinod@mesosphere.io> wrote:
> 
> benm? anand?
> 
> On Thu, Oct 6, 2016 at 9:22 AM, Apache Jenkins Server <
> jenkins@builds.apache.org> wrote:
> 
>> See <https://builds.apache.org/job/Mesos/BUILDTOOL=autotools,
>> COMPILER=clang,CONFIGURATION=--verbose,ENVIRONMENT=GLOG_v=1%
>> 20MESOS_VERBOSE=1,OS=ubuntu%3A14.04,label_exp=(docker%7C%
>> 7CHadoop)&&(!ubuntu-us1)&&(!ubuntu-6)/2739/changes>
>> 
>> Changes:
>> 
>> [bmahler] Updated test for BadACLNoPrincipal and
>> BadACLDropCreateAndDestroy.
>> 
>> [yujie.jay] Refactored the provisioner recover test.
>> 
>> [yujie.jay] Added unit test for provisioner '
>> RecoverNestedContainerNoParentImage'.
>> 
>> [bmahler] Updated comments for Resources::add and Resources::subtract.
>> 
>> [vinodkone] Added MESOS-5613 to 1.0.2 CHANGELOG.
>> 
>> [bmahler] Added a TODO for cleaning up the `Mesos` library lifetime issues.
>> 
>> [bmahler] Added support for nested containers to the test containerizer.
>> 
>> [bmahler] Store the user in the Executor struct in agent.
>> 
>> [bmahler] Updated the nested container launch to correctly determine the
>> user.
>> 
>> [vinodkone] Corrected small typo.
>> 
>> ------------------------------------------
>> [...truncated 208246 lines...]
>> [       OK ] Endpoint/SlaveEndpointTest.AuthorizedRequest/0 (23 ms)
>> [ RUN      ] Endpoint/SlaveEndpointTest.AuthorizedRequest/1
>> I1006 16:21:10.686904 27570 containerizer.cpp:227] Using isolation:
>> posix/cpu,posix/mem,filesystem/posix,network/cni
>> W1006 16:21:10.687726 27570 backend.cpp:75] Failed to create 'aufs'
>> backend: AufsBackend requires root privileges, but is running as user mesos
>> W1006 16:21:10.687881 27570 backend.cpp:75] Failed to create 'bind'
>> backend: BindBackend requires root privileges
>> I1006 16:21:10.691051 27598 slave.cpp:208] Mesos agent started on (611)@
>> 172.17.0.2:48505
>> I1006 16:21:10.691097 27598 slave.cpp:209] Flags at startup: --acls=""
>> --appc_simple_discovery_uri_prefix="http://" --appc_store_dir="/tmp/mesos/store/appc"
>> --authenticate_http_readonly="true" --authenticate_http_readwrite="true"
>> --authenticatee="crammd5" --authentication_backoff_factor="1secs"
>> --authorizer="local" --cgroups_cpu_enable_pids_and_tids_count="false"
>> --cgroups_enable_cfs="false" --cgroups_hierarchy="/sys/fs/cgroup"
>> --cgroups_limit_swap="false" --cgroups_root="mesos" --container_disk_watch_interval="15secs"
>> --containerizers="mesos" --credential="/tmp/Endpoint_SlaveEndpointTest_
>> AuthorizedRequest_1_rydvCt/credential" --default_role="*"
>> --disk_watch_interval="1mins" --docker="docker"
>> --docker_kill_orphans="true" --docker_registry="https://
>> registry-1.docker.io" --docker_remove_delay="6hrs"
>> --docker_socket="/var/run/docker.sock" --docker_stop_timeout="0ns"
>> --docker_store_dir="/tmp/mesos/store/docker" --docker_volume_checkpoint_
>> dir="/var/run/mesos/isolators/docker/volume" --enforce_container_disk_quota="false"
>> --executor_registration_timeout="1mins" --executor_shutdown_grace_period="5secs"
>> --fetcher_cache_dir="/tmp/Endpoint_SlaveEndpointTest_
>> AuthorizedRequest_1_rydvCt/fetch" --fetcher_cache_size="2GB"
>> --frameworks_home="" --gc_delay="1weeks" --gc_disk_headroom="0.1"
>> --hadoop_home="" --help="false" --hostname_lookup="true"
>> --http_authenticators="basic" --http_command_executor="false"
>> --http_credentials="/tmp/Endpoint_SlaveEndpointTest_
>> AuthorizedRequest_1_rydvCt/http_credentials" --image_provisioner_backend="copy"
>> --initialize_driver_logging="true" --isolation="posix/cpu,posix/mem"
>> --launcher="posix" --launcher_dir="/mesos/mesos-1.1.0/_build/src"
>> --logbufsecs="0" --logging_level="INFO" --oversubscribed_resources_interval="15secs"
>> --perf_duration="10secs" --perf_interval="1mins"
>> --qos_correction_interval_min="0ns" --quiet="false" --recover="reconnect"
>> --recovery_timeout="15mins" --registration_backoff_factor="10ms"
>> --resources="cpus:2;gpus:0;mem:1024;disk:1024;ports:[31000-32000]"
>> --revocable_cpu_low_priority="true" --runtime_dir="/tmp/Endpoint_
>> SlaveEndpointTest_AuthorizedRequest_1_rydvCt" --sandbox_directory="/mnt/mesos/sandbox"
>> --strict="true" --switch_user="true" --systemd_enable_support="true"
>> --systemd_runtime_directory="/run/systemd/system" --version="false"
>> --work_dir="/tmp/Endpoint_SlaveEndpointTest_AuthorizedRequest_1_5B4bOQ"
>> I1006 16:21:10.691691 27598 credentials.hpp:86] Loading credential for
>> authentication from '/tmp/Endpoint_SlaveEndpointTest_
>> AuthorizedRequest_1_rydvCt/credential'
>> I1006 16:21:10.691963 27598 slave.cpp:346] Agent using credential for:
>> test-principal
>> I1006 16:21:10.691994 27598 credentials.hpp:37] Loading credentials for
>> authentication from '/tmp/Endpoint_SlaveEndpointTest_
>> AuthorizedRequest_1_rydvCt/http_credentials'
>> I1006 16:21:10.692366 27598 http.cpp:883] Using default 'basic' HTTP
>> authenticator for realm 'mesos-agent-readonly'
>> I1006 16:21:10.692518 27598 http.cpp:883] Using default 'basic' HTTP
>> authenticator for realm 'mesos-agent-readwrite'
>> I1006 16:21:10.693599 27598 slave.cpp:533] Agent resources: cpus(*):2;
>> mem(*):1024; disk(*):1024; ports(*):[31000-32000]
>> I1006 16:21:10.693711 27598 slave.cpp:541] Agent attributes: [  ]
>> I1006 16:21:10.693734 27598 slave.cpp:546] Agent hostname: 521f0c156db7
>> I1006 16:21:10.695363 27595 state.cpp:57] Recovering state from
>> '/tmp/Endpoint_SlaveEndpointTest_AuthorizedRequest_1_5B4bOQ/meta'
>> I1006 16:21:10.695447 27598 process.cpp:3377] Handling HTTP event for
>> process 'slave(611)' with path: '/slave(611)/monitor/statistics.json'
>> I1006 16:21:10.695991 27594 status_update_manager.cpp:203] Recovering
>> status update manager
>> I1006 16:21:10.696223 27594 containerizer.cpp:581] Recovering containerizer
>> I1006 16:21:10.696604 27599 http.cpp:835] Authorizing principal
>> 'test-principal' to GET the '/monitor/statistics.json' endpoint
>> I1006 16:21:10.697834 27595 provisioner.cpp:253] Provisioner recovery
>> complete
>> I1006 16:21:10.698566 27589 slave.cpp:5256] Finished recovery
>> I1006 16:21:10.699187 27589 slave.cpp:5428] Querying resource estimator
>> for oversubscribable resources
>> I1006 16:21:10.699394 27596 slave.cpp:5442] Received oversubscribable
>> resources {} from the resource estimator
>> I1006 16:21:10.700523 27570 slave.cpp:787] Agent terminating
>> [       OK ] Endpoint/SlaveEndpointTest.AuthorizedRequest/1 (22 ms)
>> [ RUN      ] Endpoint/SlaveEndpointTest.AuthorizedRequest/2
>> I1006 16:21:10.708552 27570 containerizer.cpp:227] Using isolation:
>> posix/cpu,posix/mem,filesystem/posix,network/cni
>> W1006 16:21:10.709126 27570 backend.cpp:75] Failed to create 'aufs'
>> backend: AufsBackend requires root privileges, but is running as user mesos
>> W1006 16:21:10.709286 27570 backend.cpp:75] Failed to create 'bind'
>> backend: BindBackend requires root privileges
>> I1006 16:21:10.711982 27598 slave.cpp:208] Mesos agent started on (612)@
>> 172.17.0.2:48505
>> I1006 16:21:10.712021 27598 slave.cpp:209] Flags at startup: --acls=""
>> --appc_simple_discovery_uri_prefix="http://" --appc_store_dir="/tmp/mesos/store/appc"
>> --authenticate_http_readonly="true" --authenticate_http_readwrite="true"
>> --authenticatee="crammd5" --authentication_backoff_factor="1secs"
>> --authorizer="local" --cgroups_cpu_enable_pids_and_tids_count="false"
>> --cgroups_enable_cfs="false" --cgroups_hierarchy="/sys/fs/cgroup"
>> --cgroups_limit_swap="false" --cgroups_root="mesos" --container_disk_watch_interval="15secs"
>> --containerizers="mesos" --credential="/tmp/Endpoint_SlaveEndpointTest_
>> AuthorizedRequest_2_RhXu4Y/credential" --default_role="*"
>> --disk_watch_interval="1mins" --docker="docker"
>> --docker_kill_orphans="true" --docker_registry="https://
>> registry-1.docker.io" --docker_remove_delay="6hrs"
>> --docker_socket="/var/run/docker.sock" --docker_stop_timeout="0ns"
>> --docker_store_dir="/tmp/mesos/store/docker" --docker_volume_checkpoint_
>> dir="/var/run/mesos/isolators/docker/volume" --enforce_container_disk_quota="false"
>> --executor_registration_timeout="1mins" --executor_shutdown_grace_period="5secs"
>> --fetcher_cache_dir="/tmp/Endpoint_SlaveEndpointTest_
>> AuthorizedRequest_2_RhXu4Y/fetch" --fetcher_cache_size="2GB"
>> --frameworks_home="" --gc_delay="1weeks" --gc_disk_headroom="0.1"
>> --hadoop_home="" --help="false" --hostname_lookup="true"
>> --http_authenticators="basic" --http_command_executor="false"
>> --http_credentials="/tmp/Endpoint_SlaveEndpointTest_
>> AuthorizedRequest_2_RhXu4Y/http_credentials" --image_provisioner_backend="copy"
>> --initialize_driver_logging="true" --isolation="posix/cpu,posix/mem"
>> --launcher="posix" --launcher_dir="/mesos/mesos-1.1.0/_build/src"
>> --logbufsecs="0" --logging_level="INFO" --oversubscribed_resources_interval="15secs"
>> --perf_duration="10secs" --perf_interval="1mins"
>> --qos_correction_interval_min="0ns" --quiet="false" --recover="reconnect"
>> --recovery_timeout="15mins" --registration_backoff_factor="10ms"
>> --resources="cpus:2;gpus:0;mem:1024;disk:1024;ports:[31000-32000]"
>> --revocable_cpu_low_priority="true" --runtime_dir="/tmp/Endpoint_
>> SlaveEndpointTest_AuthorizedRequest_2_RhXu4Y" --sandbox_directory="/mnt/mesos/sandbox"
>> --strict="true" --switch_user="true" --systemd_enable_support="true"
>> --systemd_runtime_directory="/run/systemd/system" --version="false"
>> --work_dir="/tmp/Endpoint_SlaveEndpointTest_AuthorizedRequest_2_tZmCcm"
>> I1006 16:21:10.712523 27598 credentials.hpp:86] Loading credential for
>> authentication from '/tmp/Endpoint_SlaveEndpointTest_
>> AuthorizedRequest_2_RhXu4Y/credential'
>> I1006 16:21:10.712848 27598 slave.cpp:346] Agent using credential for:
>> test-principal
>> I1006 16:21:10.712873 27598 credentials.hpp:37] Loading credentials for
>> authentication from '/tmp/Endpoint_SlaveEndpointTest_
>> AuthorizedRequest_2_RhXu4Y/http_credentials'
>> I1006 16:21:10.713152 27598 http.cpp:883] Using default 'basic' HTTP
>> authenticator for realm 'mesos-agent-readonly'
>> I1006 16:21:10.713312 27598 http.cpp:883] Using default 'basic' HTTP
>> authenticator for realm 'mesos-agent-readwrite'
>> I1006 16:21:10.716367 27598 slave.cpp:533] Agent resources: cpus(*):2;
>> mem(*):1024; disk(*):1024; ports(*):[31000-32000]
>> I1006 16:21:10.716487 27598 slave.cpp:541] Agent attributes: [  ]
>> I1006 16:21:10.716509 27598 slave.cpp:546] Agent hostname: 521f0c156db7
>> I1006 16:21:10.718246 27600 state.cpp:57] Recovering state from
>> '/tmp/Endpoint_SlaveEndpointTest_AuthorizedRequest_2_tZmCcm/meta'
>> I1006 16:21:10.718385 27598 process.cpp:3377] Handling HTTP event for
>> process 'slave(612)' with path: '/slave(612)/containers'
>> I1006 16:21:10.718947 27588 status_update_manager.cpp:203] Recovering
>> status update manager
>> I1006 16:21:10.719167 27597 containerizer.cpp:581] Recovering containerizer
>> I1006 16:21:10.719497 27592 http.cpp:835] Authorizing principal
>> 'test-principal' to GET the '/containers' endpoint
>> I1006 16:21:10.720692 27592 provisioner.cpp:253] Provisioner recovery
>> complete
>> I1006 16:21:10.721359 27588 slave.cpp:5256] Finished recovery
>> I1006 16:21:10.722025 27588 slave.cpp:5428] Querying resource estimator
>> for oversubscribable resources
>> I1006 16:21:10.722273 27594 slave.cpp:5442] Received oversubscribable
>> resources {} from the resource estimator
>> I1006 16:21:10.723139 27594 slave.cpp:787] Agent terminating
>> [       OK ] Endpoint/SlaveEndpointTest.AuthorizedRequest/2 (23 ms)
>> [ RUN      ] Endpoint/SlaveEndpointTest.UnauthorizedRequest/0
>> I1006 16:21:10.731724 27570 containerizer.cpp:227] Using isolation:
>> posix/cpu,posix/mem,filesystem/posix,network/cni
>> W1006 16:21:10.732287 27570 backend.cpp:75] Failed to create 'aufs'
>> backend: AufsBackend requires root privileges, but is running as user mesos
>> W1006 16:21:10.732440 27570 backend.cpp:75] Failed to create 'bind'
>> backend: BindBackend requires root privileges
>> I1006 16:21:10.735739 27597 slave.cpp:208] Mesos agent started on (613)@
>> 172.17.0.2:48505
>> I1006 16:21:10.735791 27597 slave.cpp:209] Flags at startup: --acls=""
>> --appc_simple_discovery_uri_prefix="http://" --appc_store_dir="/tmp/mesos/store/appc"
>> --authenticate_http_readonly="true" --authenticate_http_readwrite="true"
>> --authenticatee="crammd5" --authentication_backoff_factor="1secs"
>> --authorizer="local" --cgroups_cpu_enable_pids_and_tids_count="false"
>> --cgroups_enable_cfs="false" --cgroups_hierarchy="/sys/fs/cgroup"
>> --cgroups_limit_swap="false" --cgroups_root="mesos" --container_disk_watch_interval="15secs"
>> --containerizers="mesos" --credential="/tmp/Endpoint_SlaveEndpointTest_
>> UnauthorizedRequest_0_3BLuLu/credential" --default_role="*"
>> --disk_watch_interval="1mins" --docker="docker"
>> --docker_kill_orphans="true" --docker_registry="https://
>> registry-1.docker.io" --docker_remove_delay="6hrs"
>> --docker_socket="/var/run/docker.sock" --docker_stop_timeout="0ns"
>> --docker_store_dir="/tmp/mesos/store/docker" --docker_volume_checkpoint_
>> dir="/var/run/mesos/isolators/docker/volume" --enforce_container_disk_quota="false"
>> --executor_registration_timeout="1mins" --executor_shutdown_grace_period="5secs"
>> --fetcher_cache_dir="/tmp/Endpoint_SlaveEndpointTest_
>> UnauthorizedRequest_0_3BLuLu/fetch" --fetcher_cache_size="2GB"
>> --frameworks_home="" --gc_delay="1weeks" --gc_disk_headroom="0.1"
>> --hadoop_home="" --help="false" --hostname_lookup="true"
>> --http_authenticators="basic" --http_command_executor="false"
>> --http_credentials="/tmp/Endpoint_SlaveEndpointTest_
>> UnauthorizedRequest_0_3BLuLu/http_credentials"
>> --image_provisioner_backend="copy" --initialize_driver_logging="true"
>> --isolation="posix/cpu,posix/mem" --launcher="posix"
>> --launcher_dir="/mesos/mesos-1.1.0/_build/src" --logbufsecs="0"
>> --logging_level="INFO" --oversubscribed_resources_interval="15secs"
>> --perf_duration="10secs" --perf_interval="1mins"
>> --qos_correction_interval_min="0ns" --quiet="false" --recover="reconnect"
>> --recovery_timeout="15mins" --registration_backoff_factor="10ms"
>> --resources="cpus:2;gpus:0;mem:1024;disk:1024;ports:[31000-32000]"
>> --revocable_cpu_low_priority="true" --runtime_dir="/tmp/Endpoint_
>> SlaveEndpointTest_UnauthorizedRequest_0_3BLuLu" --sandbox_directory="/mnt/mesos/sandbox"
>> --strict="true" --switch_user="true" --systemd_enable_support="true"
>> --systemd_runtime_directory="/run/systemd/system" --version="false"
>> --work_dir="/tmp/Endpoint_SlaveEndpointTest_UnauthorizedRequest_0_riaRPR"
>> I1006 16:21:10.736323 27597 credentials.hpp:86] Loading credential for
>> authentication from '/tmp/Endpoint_SlaveEndpointTest_
>> UnauthorizedRequest_0_3BLuLu/credential'
>> I1006 16:21:10.736619 27597 slave.cpp:346] Agent using credential for:
>> test-principal
>> I1006 16:21:10.736660 27597 credentials.hpp:37] Loading credentials for
>> authentication from '/tmp/Endpoint_SlaveEndpointTest_
>> UnauthorizedRequest_0_3BLuLu/http_credentials'
>> I1006 16:21:10.736941 27597 http.cpp:883] Using default 'basic' HTTP
>> authenticator for realm 'mesos-agent-readonly'
>> I1006 16:21:10.737073 27597 http.cpp:883] Using default 'basic' HTTP
>> authenticator for realm 'mesos-agent-readwrite'
>> I1006 16:21:10.738240 27597 slave.cpp:533] Agent resources: cpus(*):2;
>> mem(*):1024; disk(*):1024; ports(*):[31000-32000]
>> I1006 16:21:10.738353 27597 slave.cpp:541] Agent attributes: [  ]
>> I1006 16:21:10.738371 27597 slave.cpp:546] Agent hostname: 521f0c156db7
>> I1006 16:21:10.739799 27591 state.cpp:57] Recovering state from
>> '/tmp/Endpoint_SlaveEndpointTest_UnauthorizedRequest_0_riaRPR/meta'
>> I1006 16:21:10.739910 27597 process.cpp:3377] Handling HTTP event for
>> process 'slave(613)' with path: '/slave(613)/monitor/statistics'
>> I1006 16:21:10.740434 27598 status_update_manager.cpp:203] Recovering
>> status update manager
>> I1006 16:21:10.740665 27602 containerizer.cpp:581] Recovering containerizer
>> I1006 16:21:10.740985 27595 http.cpp:835] Authorizing principal
>> 'test-principal' to GET the '/monitor/statistics' endpoint
>> I1006 16:21:10.741857 27592 provisioner.cpp:253] Provisioner recovery
>> complete
>> I1006 16:21:10.742270 27603 slave.cpp:5256] Finished recovery
>> I1006 16:21:10.743454 27603 slave.cpp:5428] Querying resource estimator
>> for oversubscribable resources
>> I1006 16:21:10.743602 27603 slave.cpp:787] Agent terminating
>> [       OK ] Endpoint/SlaveEndpointTest.UnauthorizedRequest/0 (20 ms)
>> [ RUN      ] Endpoint/SlaveEndpointTest.UnauthorizedRequest/1
>> I1006 16:21:10.751768 27570 containerizer.cpp:227] Using isolation:
>> posix/cpu,posix/mem,filesystem/posix,network/cni
>> W1006 16:21:10.752321 27570 backend.cpp:75] Failed to create 'aufs'
>> backend: AufsBackend requires root privileges, but is running as user mesos
>> W1006 16:21:10.752476 27570 backend.cpp:75] Failed to create 'bind'
>> backend: BindBackend requires root privileges
>> I1006 16:21:10.755096 27595 slave.cpp:208] Mesos agent started on (614)@
>> 172.17.0.2:48505
>> I1006 16:21:10.755134 27595 slave.cpp:209] Flags at startup: --acls=""
>> --appc_simple_discovery_uri_prefix="http://" --appc_store_dir="/tmp/mesos/store/appc"
>> --authenticate_http_readonly="true" --authenticate_http_readwrite="true"
>> --authenticatee="crammd5" --authentication_backoff_factor="1secs"
>> --authorizer="local" --cgroups_cpu_enable_pids_and_tids_count="false"
>> --cgroups_enable_cfs="false" --cgroups_hierarchy="/sys/fs/cgroup"
>> --cgroups_limit_swap="false" --cgroups_root="mesos" --container_disk_watch_interval="15secs"
>> --containerizers="mesos" --credential="/tmp/Endpoint_SlaveEndpointTest_
>> UnauthorizedRequest_1_580IF0/credential" --default_role="*"
>> --disk_watch_interval="1mins" --docker="docker"
>> --docker_kill_orphans="true" --docker_registry="https://
>> registry-1.docker.io" --docker_remove_delay="6hrs"
>> --docker_socket="/var/run/docker.sock" --docker_stop_timeout="0ns"
>> --docker_store_dir="/tmp/mesos/store/docker" --docker_volume_checkpoint_
>> dir="/var/run/mesos/isolators/docker/volume" --enforce_container_disk_quota="false"
>> --executor_registration_timeout="1mins" --executor_shutdown_grace_period="5secs"
>> --fetcher_cache_dir="/tmp/Endpoint_SlaveEndpointTest_
>> UnauthorizedRequest_1_580IF0/fetch" --fetcher_cache_size="2GB"
>> --frameworks_home="" --gc_delay="1weeks" --gc_disk_headroom="0.1"
>> --hadoop_home="" --help="false" --hostname_lookup="true"
>> --http_authenticators="basic" --http_command_executor="false"
>> --http_credentials="/tmp/Endpoint_SlaveEndpointTest_
>> UnauthorizedRequest_1_580IF0/http_credentials"
>> --image_provisioner_backend="copy" --initialize_driver_logging="true"
>> --isolation="posix/cpu,posix/mem" --launcher="posix"
>> --launcher_dir="/mesos/mesos-1.1.0/_build/src" --logbufsecs="0"
>> --logging_level="INFO" --oversubscribed_resources_interval="15secs"
>> --perf_duration="10secs" --perf_interval="1mins"
>> --qos_correction_interval_min="0ns" --quiet="false" --recover="reconnect"
>> --recovery_timeout="15mins" --registration_backoff_factor="10ms"
>> --resources="cpus:2;gpus:0;mem:1024;disk:1024;ports:[31000-32000]"
>> --revocable_cpu_low_priority="true" --runtime_dir="/tmp/Endpoint_
>> SlaveEndpointTest_UnauthorizedRequest_1_580IF0" --sandbox_directory="/mnt/mesos/sandbox"
>> --strict="true" --switch_user="true" --systemd_enable_support="true"
>> --systemd_runtime_directory="/run/systemd/system" --version="false"
>> --work_dir="/tmp/Endpoint_SlaveEndpointTest_UnauthorizedRequest_1_jYbOGn"
>> I1006 16:21:10.755625 27595 credentials.hpp:86] Loading credential for
>> authentication from '/tmp/Endpoint_SlaveEndpointTest_
>> UnauthorizedRequest_1_580IF0/credential'
>> I1006 16:21:10.755826 27595 slave.cpp:346] Agent using credential for:
>> test-principal
>> I1006 16:21:10.755851 27595 credentials.hpp:37] Loading credentials for
>> authentication from '/tmp/Endpoint_SlaveEndpointTest_
>> UnauthorizedRequest_1_580IF0/http_credentials'
>> I1006 16:21:10.756109 27595 http.cpp:883] Using default 'basic' HTTP
>> authenticator for realm 'mesos-agent-readonly'
>> I1006 16:21:10.756261 27595 http.cpp:883] Using default 'basic' HTTP
>> authenticator for realm 'mesos-agent-readwrite'
>> I1006 16:21:10.757235 27595 slave.cpp:533] Agent resources: cpus(*):2;
>> mem(*):1024; disk(*):1024; ports(*):[31000-32000]
>> I1006 16:21:10.757313 27595 slave.cpp:541] Agent attributes: [  ]
>> I1006 16:21:10.757328 27595 slave.cpp:546] Agent hostname: 521f0c156db7
>> I1006 16:21:10.758800 27600 state.cpp:57] Recovering state from
>> '/tmp/Endpoint_SlaveEndpointTest_UnauthorizedRequest_1_jYbOGn/meta'
>> I1006 16:21:10.758890 27595 process.cpp:3377] Handling HTTP event for
>> process 'slave(614)' with path: '/slave(614)/monitor/statistics.json'
>> I1006 16:21:10.759312 27598 status_update_manager.cpp:203] Recovering
>> status update manager
>> I1006 16:21:10.759449 27598 containerizer.cpp:581] Recovering containerizer
>> I1006 16:21:10.759759 27592 http.cpp:835] Authorizing principal
>> 'test-principal' to GET the '/monitor/statistics.json' endpoint
>> I1006 16:21:10.760548 27588 provisioner.cpp:253] Provisioner recovery
>> complete
>> I1006 16:21:10.760938 27592 slave.cpp:5256] Finished recovery
>> I1006 16:21:10.761526 27592 slave.cpp:5428] Querying resource estimator
>> for oversubscribable resources
>> I1006 16:21:10.761833 27601 slave.cpp:5442] Received oversubscribable
>> resources {} from the resource estimator
>> I1006 16:21:10.762439 27594 slave.cpp:787] Agent terminating
>> [       OK ] Endpoint/SlaveEndpointTest.UnauthorizedRequest/1 (18 ms)
>> [ RUN      ] Endpoint/SlaveEndpointTest.UnauthorizedRequest/2
>> I1006 16:21:10.770308 27570 containerizer.cpp:227] Using isolation:
>> posix/cpu,posix/mem,filesystem/posix,network/cni
>> W1006 16:21:10.770858 27570 backend.cpp:75] Failed to create 'aufs'
>> backend: AufsBackend requires root privileges, but is running as user mesos
>> W1006 16:21:10.770999 27570 backend.cpp:75] Failed to create 'bind'
>> backend: BindBackend requires root privileges
>> I1006 16:21:10.773730 27590 slave.cpp:208] Mesos agent started on (615)@
>> 172.17.0.2:48505
>> I1006 16:21:10.773766 27590 slave.cpp:209] Flags at startup: --acls=""
>> --appc_simple_discovery_uri_prefix="http://" --appc_store_dir="/tmp/mesos/store/appc"
>> --authenticate_http_readonly="true" --authenticate_http_readwrite="true"
>> --authenticatee="crammd5" --authentication_backoff_factor="1secs"
>> --authorizer="local" --cgroups_cpu_enable_pids_and_tids_count="false"
>> --cgroups_enable_cfs="false" --cgroups_hierarchy="/sys/fs/cgroup"
>> --cgroups_limit_swap="false" --cgroups_root="mesos" --container_disk_watch_interval="15secs"
>> --containerizers="mesos" --credential="/tmp/Endpoint_SlaveEndpointTest_
>> UnauthorizedRequest_2_fXp2Lw/credential" --default_role="*"
>> --disk_watch_interval="1mins" --docker="docker"
>> --docker_kill_orphans="true" --docker_registry="https://
>> registry-1.docker.io" --docker_remove_delay="6hrs"
>> --docker_socket="/var/run/docker.sock" --docker_stop_timeout="0ns"
>> --docker_store_dir="/tmp/mesos/store/docker" --docker_volume_checkpoint_
>> dir="/var/run/mesos/isolators/docker/volume" --enforce_container_disk_quota="false"
>> --executor_registration_timeout="1mins" --executor_shutdown_grace_period="5secs"
>> --fetcher_cache_dir="/tmp/Endpoint_SlaveEndpointTest_
>> UnauthorizedRequest_2_fXp2Lw/fetch" --fetcher_cache_size="2GB"
>> --frameworks_home="" --gc_delay="1weeks" --gc_disk_headroom="0.1"
>> --hadoop_home="" --help="false" --hostname_lookup="true"
>> --http_authenticators="basic" --http_command_executor="false"
>> --http_credentials="/tmp/Endpoint_SlaveEndpointTest_
>> UnauthorizedRequest_2_fXp2Lw/http_credentials"
>> --image_provisioner_backend="copy" --initialize_driver_logging="true"
>> --isolation="posix/cpu,posix/mem" --launcher="posix"
>> --launcher_dir="/mesos/mesos-1.1.0/_build/src" --logbufsecs="0"
>> --logging_level="INFO" --oversubscribed_resources_interval="15secs"
>> --perf_duration="10secs" --perf_interval="1mins"
>> --qos_correction_interval_min="0ns" --quiet="false" --recover="reconnect"
>> --recovery_timeout="15mins" --registration_backoff_factor="10ms"
>> --resources="cpus:2;gpus:0;mem:1024;disk:1024;ports:[31000-32000]"
>> --revocable_cpu_low_priority="true" --runtime_dir="/tmp/Endpoint_
>> SlaveEndpointTest_UnauthorizedRequest_2_fXp2Lw" --sandbox_directory="/mnt/mesos/sandbox"
>> --strict="true" --switch_user="true" --systemd_enable_support="true"
>> --systemd_runtime_directory="/run/systemd/system" --version="false"
>> --work_dir="/tmp/Endpoint_SlaveEndpointTest_UnauthorizedRequest_2_bHq6JT"
>> I1006 16:21:10.774183 27590 credentials.hpp:86] Loading credential for
>> authentication from '/tmp/Endpoint_SlaveEndpointTest_
>> UnauthorizedRequest_2_fXp2Lw/credential'
>> I1006 16:21:10.774322 27590 slave.cpp:346] Agent using credential for:
>> test-principal
>> I1006 16:21:10.774348 27590 credentials.hpp:37] Loading credentials for
>> authentication from '/tmp/Endpoint_SlaveEndpointTest_
>> UnauthorizedRequest_2_fXp2Lw/http_credentials'
>> I1006 16:21:10.774591 27590 http.cpp:883] Using default 'basic' HTTP
>> authenticator for realm 'mesos-agent-readonly'
>> I1006 16:21:10.774763 27590 http.cpp:883] Using default 'basic' HTTP
>> authenticator for realm 'mesos-agent-readwrite'
>> I1006 16:21:10.775663 27590 slave.cpp:533] Agent resources: cpus(*):2;
>> mem(*):1024; disk(*):1024; ports(*):[31000-32000]
>> I1006 16:21:10.775739 27590 slave.cpp:541] Agent attributes: [  ]
>> I1006 16:21:10.775760 27590 slave.cpp:546] Agent hostname: 521f0c156db7
>> I1006 16:21:10.777097 27597 state.cpp:57] Recovering state from
>> '/tmp/Endpoint_SlaveEndpointTest_UnauthorizedRequest_2_bHq6JT/meta'
>> I1006 16:21:10.777164 27590 process.cpp:3377] Handling HTTP event for
>> process 'slave(615)' with path: '/slave(615)/containers'
>> I1006 16:21:10.777523 27589 status_update_manager.cpp:203] Recovering
>> status update manager
>> I1006 16:21:10.777716 27589 containerizer.cpp:581] Recovering containerizer
>> I1006 16:21:10.778167 27602 http.cpp:835] Authorizing principal
>> 'test-principal' to GET the '/containers' endpoint
>> I1006 16:21:10.779412 27588 provisioner.cpp:253] Provisioner recovery
>> complete
>> I1006 16:21:10.779793 27600 slave.cpp:5256] Finished recovery
>> I1006 16:21:10.780438 27600 slave.cpp:5428] Querying resource estimator
>> for oversubscribable resources
>> I1006 16:21:10.780628 27600 slave.cpp:787] Agent terminating
>> [       OK ] Endpoint/SlaveEndpointTest.UnauthorizedRequest/2 (18 ms)
>> [ RUN      ] Endpoint/SlaveEndpointTest.NoAuthorizer/0
>> I1006 16:21:10.789597 27570 containerizer.cpp:227] Using isolation:
>> posix/cpu,posix/mem,filesystem/posix,network/cni
>> W1006 16:21:10.790238 27570 backend.cpp:75] Failed to create 'aufs'
>> backend: AufsBackend requires root privileges, but is running as user mesos
>> W1006 16:21:10.790427 27570 backend.cpp:75] Failed to create 'bind'
>> backend: BindBackend requires root privileges
>> I1006 16:21:10.791960 27570 cluster.cpp:435] Creating default 'local'
>> authorizer
>> I1006 16:21:10.793795 27591 slave.cpp:208] Mesos agent started on (616)@
>> 172.17.0.2:48505
>> I1006 16:21:10.793838 27591 slave.cpp:209] Flags at startup: --acls=""
>> --appc_simple_discovery_uri_prefix="http://" --appc_store_dir="/tmp/mesos/store/appc"
>> --authenticate_http_readonly="true" --authenticate_http_readwrite="true"
>> --authenticatee="crammd5" --authentication_backoff_factor="1secs"
>> --authorizer="local" --cgroups_cpu_enable_pids_and_tids_count="false"
>> --cgroups_enable_cfs="false" --cgroups_hierarchy="/sys/fs/cgroup"
>> --cgroups_limit_swap="false" --cgroups_root="mesos" --container_disk_watch_interval="15secs"
>> --containerizers="mesos" --credential="/tmp/Endpoint_SlaveEndpointTest_
>> NoAuthorizer_0_TTXr42/credential" --default_role="*"
>> --disk_watch_interval="1mins" --docker="docker"
>> --docker_kill_orphans="true" --docker_registry="https://
>> registry-1.docker.io" --docker_remove_delay="6hrs"
>> --docker_socket="/var/run/docker.sock" --docker_stop_timeout="0ns"
>> --docker_store_dir="/tmp/mesos/store/docker" --docker_volume_checkpoint_
>> dir="/var/run/mesos/isolators/docker/volume" --enforce_container_disk_quota="false"
>> --executor_registration_timeout="1mins" --executor_shutdown_grace_period="5secs"
>> --fetcher_cache_dir="/tmp/Endpoint_SlaveEndpointTest_NoAuthorizer_0_TTXr42/fetch"
>> --fetcher_cache_size="2GB" --frameworks_home="" --gc_delay="1weeks"
>> --gc_disk_headroom="0.1" --hadoop_home="" --help="false"
>> --hostname_lookup="true" --http_authenticators="basic"
>> --http_command_executor="false" --http_credentials="/tmp/
>> Endpoint_SlaveEndpointTest_NoAuthorizer_0_TTXr42/http_credentials"
>> --image_provisioner_backend="copy" --initialize_driver_logging="true"
>> --isolation="posix/cpu,posix/mem" --launcher="posix"
>> --launcher_dir="/mesos/mesos-1.1.0/_build/src" --logbufsecs="0"
>> --logging_level="INFO" --oversubscribed_resources_interval="15secs"
>> --perf_duration="10secs" --perf_interval="1mins"
>> --qos_correction_interval_min="0ns" --quiet="false" --recover="reconnect"
>> --recovery_timeout="15mins" --registration_backoff_factor="10ms"
>> --resources="cpus:2;gpus:0;mem:1024;disk:1024;ports:[31000-32000]"
>> --revocable_cpu_low_priority="true" --runtime_dir="/tmp/Endpoint_
>> SlaveEndpointTest_NoAuthorizer_0_TTXr42" --sandbox_directory="/mnt/mesos/sandbox"
>> --strict="true" --switch_user="true" --systemd_enable_support="true"
>> --systemd_runtime_directory="/run/systemd/system" --version="false"
>> --work_dir="/tmp/Endpoint_SlaveEndpointTest_NoAuthorizer_0_FrIuZp"
>> I1006 16:21:10.794314 27591 credentials.hpp:86] Loading credential for
>> authentication from '/tmp/Endpoint_SlaveEndpointTest_
>> NoAuthorizer_0_TTXr42/credential'
>> I1006 16:21:10.794483 27591 slave.cpp:346] Agent using credential for:
>> test-principal
>> I1006 16:21:10.794523 27591 credentials.hpp:37] Loading credentials for
>> authentication from '/tmp/Endpoint_SlaveEndpointTest_
>> NoAuthorizer_0_TTXr42/http_credentials'
>> I1006 16:21:10.794853 27591 http.cpp:883] Using default 'basic' HTTP
>> authenticator for realm 'mesos-agent-readonly'
>> I1006 16:21:10.795089 27591 http.cpp:883] Using default 'basic' HTTP
>> authenticator for realm 'mesos-agent-readwrite'
>> I1006 16:21:10.796247 27591 slave.cpp:533] Agent resources: cpus(*):2;
>> mem(*):1024; disk(*):1024; ports(*):[31000-32000]
>> I1006 16:21:10.796336 27591 slave.cpp:541] Agent attributes: [  ]
>> I1006 16:21:10.796351 27591 slave.cpp:546] Agent hostname: 521f0c156db7
>> I1006 16:21:10.797994 27597 state.cpp:57] Recovering state from
>> '/tmp/Endpoint_SlaveEndpointTest_NoAuthorizer_0_FrIuZp/meta'
>> I1006 16:21:10.798086 27591 process.cpp:3377] Handling HTTP event for
>> process 'slave(616)' with path: '/slave(616)/monitor/statistics'
>> I1006 16:21:10.798576 27596 status_update_manager.cpp:203] Recovering
>> status update manager
>> I1006 16:21:10.798781 27602 containerizer.cpp:581] Recovering containerizer
>> I1006 16:21:10.799110 27593 http.cpp:835] Authorizing principal
>> 'test-principal' to GET the '/monitor/statistics' endpoint
>> I1006 16:21:10.800285 27595 provisioner.cpp:253] Provisioner recovery
>> complete
>> I1006 16:21:10.800981 27592 slave.cpp:5256] Finished recovery
>> I1006 16:21:10.801560 27592 slave.cpp:5428] Querying resource estimator
>> for oversubscribable resources
>> I1006 16:21:10.801789 27601 slave.cpp:5442] Received oversubscribable
>> resources {} from the resource estimator
>> I1006 16:21:10.803166 27601 slave.cpp:787] Agent terminating
>> [       OK ] Endpoint/SlaveEndpointTest.NoAuthorizer/0 (23 ms)
>> [ RUN      ] Endpoint/SlaveEndpointTest.NoAuthorizer/1
>> I1006 16:21:10.813136 27570 containerizer.cpp:227] Using isolation:
>> posix/cpu,posix/mem,filesystem/posix,network/cni
>> W1006 16:21:10.813756 27570 backend.cpp:75] Failed to create 'aufs'
>> backend: AufsBackend requires root privileges, but is running as user mesos
>> W1006 16:21:10.813946 27570 backend.cpp:75] Failed to create 'bind'
>> backend: BindBackend requires root privileges
>> I1006 16:21:10.815395 27570 cluster.cpp:435] Creating default 'local'
>> authorizer
>> I1006 16:21:10.817072 27603 slave.cpp:208] Mesos agent started on (617)@
>> 172.17.0.2:48505
>> I1006 16:21:10.817116 27603 slave.cpp:209] Flags at startup: --acls=""
>> --appc_simple_discovery_uri_prefix="http://" --appc_store_dir="/tmp/mesos/store/appc"
>> --authenticate_http_readonly="true" --authenticate_http_readwrite="true"
>> --authenticatee="crammd5" --authentication_backoff_factor="1secs"
>> --authorizer="local" --cgroups_cpu_enable_pids_and_tids_count="false"
>> --cgroups_enable_cfs="false" --cgroups_hierarchy="/sys/fs/cgroup"
>> --cgroups_limit_swap="false" --cgroups_root="mesos" --container_disk_watch_interval="15secs"
>> --containerizers="mesos" --credential="/tmp/Endpoint_SlaveEndpointTest_
>> NoAuthorizer_1_NXlOBz/credential" --default_role="*"
>> --disk_watch_interval="1mins" --docker="docker"
>> --docker_kill_orphans="true" --docker_registry="https://
>> registry-1.docker.io" --docker_remove_delay="6hrs"
>> --docker_socket="/var/run/docker.sock" --docker_stop_timeout="0ns"
>> --docker_store_dir="/tmp/mesos/store/docker" --docker_volume_checkpoint_
>> dir="/var/run/mesos/isolators/docker/volume" --enforce_container_disk_quota="false"
>> --executor_registration_timeout="1mins" --executor_shutdown_grace_period="5secs"
>> --fetcher_cache_dir="/tmp/Endpoint_SlaveEndpointTest_NoAuthorizer_1_NXlOBz/fetch"
>> --fetcher_cache_size="2GB" --frameworks_home="" --gc_delay="1weeks"
>> --gc_disk_headroom="0.1" --hadoop_home="" --help="false"
>> --hostname_lookup="true" --http_authenticators="basic"
>> --http_command_executor="false" --http_credentials="/tmp/
>> Endpoint_SlaveEndpointTest_NoAuthorizer_1_NXlOBz/http_credentials"
>> --image_provisioner_backend="copy" --initialize_driver_logging="true"
>> --isolation="posix/cpu,posix/mem" --launcher="posix"
>> --launcher_dir="/mesos/mesos-1.1.0/_build/src" --logbufsecs="0"
>> --logging_level="INFO" --oversubscribed_resources_interval="15secs"
>> --perf_duration="10secs" --perf_interval="1mins"
>> --qos_correction_interval_min="0ns" --quiet="false" --recover="reconnect"
>> --recovery_timeout="15mins" --registration_backoff_factor="10ms"
>> --resources="cpus:2;gpus:0;mem:1024;disk:1024;ports:[31000-32000]"
>> --revocable_cpu_low_priority="true" --runtime_dir="/tmp/Endpoint_
>> SlaveEndpointTest_NoAuthorizer_1_NXlOBz" --sandbox_directory="/mnt/mesos/sandbox"
>> --strict="true" --switch_user="true" --systemd_enable_support="true"
>> --systemd_runtime_directory="/run/systemd/system" --version="false"
>> --work_dir="/tmp/Endpoint_SlaveEndpointTest_NoAuthorizer_1_3ag1sW"
>> I1006 16:21:10.817840 27603 credentials.hpp:86] Loading credential for
>> authentication from '/tmp/Endpoint_SlaveEndpointTest_
>> NoAuthorizer_1_NXlOBz/credential'
>> I1006 16:21:10.818002 27603 slave.cpp:346] Agent using credential for:
>> test-principal
>> I1006 16:21:10.818029 27603 credentials.hpp:37] Loading credentials for
>> authentication from '/tmp/Endpoint_SlaveEndpointTest_
>> NoAuthorizer_1_NXlOBz/http_credentials'
>> I1006 16:21:10.818220 27603 http.cpp:883] Using default 'basic' HTTP
>> authenticator for realm 'mesos-agent-readonly'
>> I1006 16:21:10.818320 27603 http.cpp:883] Using default 'basic' HTTP
>> authenticator for realm 'mesos-agent-readwrite'
>> I1006 16:21:10.819092 27603 slave.cpp:533] Agent resources: cpus(*):2;
>> mem(*):1024; disk(*):1024; ports(*):[31000-32000]
>> I1006 16:21:10.819164 27603 slave.cpp:541] Agent attributes: [  ]
>> I1006 16:21:10.819175 27603 slave.cpp:546] Agent hostname: 521f0c156db7
>> I1006 16:21:10.820322 27599 state.cpp:57] Recovering state from
>> '/tmp/Endpoint_SlaveEndpointTest_NoAuthorizer_1_3ag1sW/meta'
>> I1006 16:21:10.820431 27603 process.cpp:3377] Handling HTTP event for
>> process 'slave(617)' with path: '/slave(617)/monitor/statistics.json'
>> I1006 16:21:10.820873 27588 status_update_manager.cpp:203] Recovering
>> status update manager
>> I1006 16:21:10.821029 27592 containerizer.cpp:581] Recovering containerizer
>> I1006 16:21:10.821265 27595 http.cpp:835] Authorizing principal
>> 'test-principal' to GET the '/monitor/statistics.json' endpoint
>> I1006 16:21:10.822177 27602 provisioner.cpp:253] Provisioner recovery
>> complete
>> I1006 16:21:10.822937 27592 slave.cpp:5256] Finished recovery
>> I1006 16:21:10.823413 27592 slave.cpp:5428] Querying resource estimator
>> for oversubscribable resources
>> I1006 16:21:10.823734 27589 slave.cpp:5442] Received oversubscribable
>> resources {} from the resource estimator
>> I1006 16:21:10.824790 27593 slave.cpp:787] Agent terminating
>> [       OK ] Endpoint/SlaveEndpointTest.NoAuthorizer/1 (20 ms)
>> [ RUN      ] Endpoint/SlaveEndpointTest.NoAuthorizer/2
>> I1006 16:21:10.832917 27570 containerizer.cpp:227] Using isolation:
>> posix/cpu,posix/mem,filesystem/posix,network/cni
>> W1006 16:21:10.833530 27570 backend.cpp:75] Failed to create 'aufs'
>> backend: AufsBackend requires root privileges, but is running as user mesos
>> W1006 16:21:10.833734 27570 backend.cpp:75] Failed to create 'bind'
>> backend: BindBackend requires root privileges
>> I1006 16:21:10.834959 27570 cluster.cpp:435] Creating default 'local'
>> authorizer
>> I1006 16:21:10.836450 27603 slave.cpp:208] Mesos agent started on (618)@
>> 172.17.0.2:48505
>> I1006 16:21:10.836483 27603 slave.cpp:209] Flags at startup: --acls=""
>> --appc_simple_discovery_uri_prefix="http://" --appc_store_dir="/tmp/mesos/store/appc"
>> --authenticate_http_readonly="true" --authenticate_http_readwrite="true"
>> --authenticatee="crammd5" --authentication_backoff_factor="1secs"
>> --authorizer="local" --cgroups_cpu_enable_pids_and_tids_count="false"
>> --cgroups_enable_cfs="false" --cgroups_hierarchy="/sys/fs/cgroup"
>> --cgroups_limit_swap="false" --cgroups_root="mesos" --container_disk_watch_interval="15secs"
>> --containerizers="mesos" --credential="/tmp/Endpoint_SlaveEndpointTest_
>> NoAuthorizer_2_B3Xvm6/credential" --default_role="*"
>> --disk_watch_interval="1mins" --docker="docker"
>> --docker_kill_orphans="true" --docker_registry="https://
>> registry-1.docker.io" --docker_remove_delay="6hrs"
>> --docker_socket="/var/run/docker.sock" --docker_stop_timeout="0ns"
>> --docker_store_dir="/tmp/mesos/store/docker" --docker_volume_checkpoint_
>> dir="/var/run/mesos/isolators/docker/volume" --enforce_container_disk_quota="false"
>> --executor_registration_timeout="1mins" --executor_shutdown_grace_period="5secs"
>> --fetcher_cache_dir="/tmp/Endpoint_SlaveEndpointTest_NoAuthorizer_2_B3Xvm6/fetch"
>> --fetcher_cache_size="2GB" --frameworks_home="" --gc_delay="1weeks"
>> --gc_disk_headroom="0.1" --hadoop_home="" --help="false"
>> --hostname_lookup="true" --http_authenticators="basic"
>> --http_command_executor="false" --http_credentials="/tmp/
>> Endpoint_SlaveEndpointTest_NoAuthorizer_2_B3Xvm6/http_credentials"
>> --image_provisioner_backend="copy" --initialize_driver_logging="true"
>> --isolation="posix/cpu,posix/mem" --launcher="posix"
>> --launcher_dir="/mesos/mesos-1.1.0/_build/src" --logbufsecs="0"
>> --logging_level="INFO" --oversubscribed_resources_interval="15secs"
>> --perf_duration="10secs" --perf_interval="1mins"
>> --qos_correction_interval_min="0ns" --quiet="false" --recover="reconnect"
>> --recovery_timeout="15mins" --registration_backoff_factor="10ms"
>> --resources="cpus:2;gpus:0;mem:1024;disk:1024;ports:[31000-32000]"
>> --revocable_cpu_low_priority="true" --runtime_dir="/tmp/Endpoint_
>> SlaveEndpointTest_NoAuthorizer_2_B3Xvm6" --sandbox_directory="/mnt/mesos/sandbox"
>> --strict="true" --switch_user="true" --systemd_enable_support="true"
>> --systemd_runtime_directory="/run/systemd/system" --version="false"
>> --work_dir="/tmp/Endpoint_SlaveEndpointTest_NoAuthorizer_2_3Ontat"
>> I1006 16:21:10.836997 27603 credentials.hpp:86] Loading credential for
>> authentication from '/tmp/Endpoint_SlaveEndpointTest_
>> NoAuthorizer_2_B3Xvm6/credential'
>> I1006 16:21:10.837285 27603 slave.cpp:346] Agent using credential for:
>> test-principal
>> I1006 16:21:10.837316 27603 credentials.hpp:37] Loading credentials for
>> authentication from '/tmp/Endpoint_SlaveEndpointTest_
>> NoAuthorizer_2_B3Xvm6/http_credentials'
>> I1006 16:21:10.837612 27603 http.cpp:883] Using default 'basic' HTTP
>> authenticator for realm 'mesos-agent-readonly'
>> I1006 16:21:10.837803 27603 http.cpp:883] Using default 'basic' HTTP
>> authenticator for realm 'mesos-agent-readwrite'
>> I1006 16:21:10.838856 27603 slave.cpp:533] Agent resources: cpus(*):2;
>> mem(*):1024; disk(*):1024; ports(*):[31000-32000]
>> I1006 16:21:10.838945 27603 slave.cpp:541] Agent attributes: [  ]
>> I1006 16:21:10.838968 27603 slave.cpp:546] Agent hostname: 521f0c156db7
>> I1006 16:21:10.840332 27601 state.cpp:57] Recovering state from
>> '/tmp/Endpoint_SlaveEndpointTest_NoAuthorizer_2_3Ontat/meta'
>> I1006 16:21:10.840447 27603 process.cpp:3377] Handling HTTP event for
>> process 'slave(618)' with path: '/slave(618)/containers'
>> I1006 16:21:10.840906 27590 status_update_manager.cpp:203] Recovering
>> status update manager
>> I1006 16:21:10.841176 27595 containerizer.cpp:581] Recovering containerizer
>> I1006 16:21:10.841431 27598 http.cpp:835] Authorizing principal
>> 'test-principal' to GET the '/containers' endpoint
>> I1006 16:21:10.842488 27601 provisioner.cpp:253] Provisioner recovery
>> complete
>> I1006 16:21:10.842767 27597 slave.cpp:5256] Finished recovery
>> I1006 16:21:10.843495 27597 slave.cpp:5428] Querying resource estimator
>> for oversubscribable resources
>> I1006 16:21:10.843832 27591 slave.cpp:5442] Received oversubscribable
>> resources {} from the resource estimator
>> I1006 16:21:10.845021 27595 slave.cpp:787] Agent terminating
>> [       OK ] Endpoint/SlaveEndpointTest.NoAuthorizer/2 (20 ms)
>> [----------] 9 tests from Endpoint/SlaveEndpointTest (190 ms total)
>> 
>> [----------] Global test environment tear-down
>> [==========] 1348 tests from 154 test cases ran. (380446 ms total)
>> [  PASSED  ] 1347 tests.
>> [  FAILED  ] 1 test, listed below:
>> [  FAILED  ] ContentType/AgentAPITest.NestedContainerLaunch/0, where
>> GetParam() = application/x-protobuf
>> 
>> 1 FAILED TEST
>>  YOU HAVE 5 DISABLED TESTS
>> 
>> make[4]: *** [check-local] Error 1
>> make[4]: Leaving directory `/mesos/mesos-1.1.0/_build/src'
>> make[3]: *** [check-am] Error 2
>> make[3]: Leaving directory `/mesos/mesos-1.1.0/_build/src'
>> make[2]: *** [check] Error 2
>> make[2]: Leaving directory `/mesos/mesos-1.1.0/_build/src'
>> make[1]: *** [check-recursive] Error 1
>> make[1]: Leaving directory `/mesos/mesos-1.1.0/_build'
>> make: *** [distcheck] Error 1
>> + docker rmi mesos-1475768686-9956
>> Untagged: mesos-1475768686-9956:latest
>> Deleted: sha256:7af7d4410c9158ca3c36061be2d8ad
>> a56b0cbe346e76f9d3f1a6275bb21147d3
>> Deleted: sha256:0e5c701397d54d5b19997a83970f68
>> beef46af5aeeedd965fe78d968df2ded77
>> Deleted: sha256:107d885d13ff022b4045b466a816a5
>> 7d1ae8a4c4c5d12aa3c347c7defa78e43f
>> Deleted: sha256:e374f391beee8b04b55a900dc54808
>> 9a324e03fbc7f41104c35246493391c3af
>> Deleted: sha256:da50a958c8b57233027fe36369ccf9
>> 62bb5cf6b08343aec94c4dee07b85af863
>> Deleted: sha256:c8c5d41a4c0d4de8fc541ccfd7d36c
>> 26a2b3fd90a6984c6b900dfe280d4e50a8
>> Deleted: sha256:600ff4fbb2840b6f9219c64c349b1f
>> a968ad923c01820bb8719da2c83892d9af
>> Deleted: sha256:de40b8112cc5af44ba6b82f7983f45
>> 9ca3075bed0f56f75a9eecb2c2c0f4ab58
>> Deleted: sha256:85064ace85cf6949e942b01b484208
>> 3fde718d5a6d6036e18329db1c35d3b4d7
>> Deleted: sha256:3c104d9239e59917205a06edd364cf
>> c5d303616a4d2854238540e9578b95ae09
>> Deleted: sha256:f854fcff240743646c6526a280c015
>> d9f0a1e436074f1ff9bd4181e66dfde801
>> Deleted: sha256:816f96eb10bbb27863a510bdd0ff5c
>> 7af28e788f90405fbbe283053d185e4017
>> Deleted: sha256:0b0cf53af387109db5dfae77d1ddaa
>> 9462e9b77f2969a4c9e9988c49e862178c
>> Deleted: sha256:03b1a9cb4fa094d68714a1086035db
>> b441550a820bec13f848d458d4286d0669
>> Deleted: sha256:4fbb48502a7d55a0b91618a0b72005
>> 910a7d5a8c707097abc8b41343fa5e8d5d
>> Deleted: sha256:be4f338596a3c1058c301c30072c3a
>> e96c8872e8297cc54785b724627637dd24
>> Deleted: sha256:e8733fbc404bb20bd37dd90ca16c17
>> 717261aa9dcab788850dc9a10cd84528b7
>> Deleted: sha256:3c4c19a019267b907f59bd0e4857aa
>> d05dc8f570d320bb41373c7e51941abf3a
>> Deleted: sha256:bf9d04de0eddb2000deb30d8cb715f
>> 5eab61840a71a63ddc04f2ce664c8181bf
>> Deleted: sha256:adc7047bda45e467e74a44a23a6fcb
>> ce7486c7d2fe5dd9f1b7740af63a7ed168
>> Deleted: sha256:579bd9a05b76bab54037f26f54c1df
>> 32a58f20e6bc9d77564d206cd77710b862
>> Deleted: sha256:662acd04cbe7e78e864029bca6b443
>> 7761e2d56e97c3525656753884124ad90e
>> Deleted: sha256:bd497a60f6ce572de20a1960905933
>> 90bbd5cd619ff763ca6174cdafc537699e
>> Deleted: sha256:03998f21bf7fe23ab23b323479cc43
>> 3fb4ee475907cddbac2c4cd4beab5fd018
>> Build step 'Execute shell' marked build as failure
>> 


Mime
  • Unnamed multipart/alternative (inline, None, 0 bytes)
View raw message