mesos-builds mailing list archives

Site index · List index
Message view « Date » · « Thread »
Top « Date » · « Thread »
From Apache Jenkins Server <jenk...@builds.apache.org>
Subject Build failed in Jenkins: mesos-reviewbot #15864
Date Fri, 28 Oct 2016 23:41:50 GMT
See <https://builds.apache.org/job/mesos-reviewbot/15864/changes>

Changes:

[vinodkone] Updated release guide.

------------------------------------------
[...truncated 215343 lines...]
I1028 23:41:29.939218 29419 containerizer.cpp:201] Using isolation: posix/cpu,posix/mem,filesystem/posix,network/cni
W1028 23:41:29.939909 29419 backend.cpp:76] Failed to create 'aufs' backend: AufsBackend requires
root privileges, but is running as user mesos
W1028 23:41:29.940152 29419 backend.cpp:76] Failed to create 'bind' backend: BindBackend requires
root privileges
I1028 23:41:29.943068 29441 slave.cpp:208] Mesos agent started on (636)@172.17.0.2:58617
I1028 23:41:29.943095 29441 slave.cpp:209] Flags at startup: --acls="" --appc_simple_discovery_uri_prefix="http://"
--appc_store_dir="/tmp/mesos/store/appc" --authenticate_http_readonly="true" --authenticate_http_readwrite="true"
--authenticatee="crammd5" --authentication_backoff_factor="1secs" --authorizer="local" --cgroups_cpu_enable_pids_and_tids_count="false"
--cgroups_enable_cfs="false" --cgroups_hierarchy="/sys/fs/cgroup" --cgroups_limit_swap="false"
--cgroups_root="mesos" --container_disk_watch_interval="15secs" --containerizers="mesos" --credential="/tmp/Endpoint_SlaveEndpointTest_AuthorizedRequest_1_UkrT0e/credential"
--default_role="*" --disk_watch_interval="1mins" --docker="docker" --docker_kill_orphans="true"
--docker_registry="https://registry-1.docker.io" --docker_remove_delay="6hrs" --docker_socket="/var/run/docker.sock"
--docker_stop_timeout="0ns" --docker_store_dir="/tmp/mesos/store/docker" --docker_volume_checkpoint_dir="/var/run/mesos/isolators/docker/volume"
--enforce_container_disk_quota="false" --executor_registration_timeout="1mins" --executor_shutdown_grace_period="5secs"
--fetcher_cache_dir="/tmp/Endpoint_SlaveEndpointTest_AuthorizedRequest_1_UkrT0e/fetch" --fetcher_cache_size="2GB"
--frameworks_home="" --gc_delay="1weeks" --gc_disk_headroom="0.1" --hadoop_home="" --help="false"
--hostname_lookup="true" --http_authenticators="basic" --http_command_executor="false" --http_credentials="/tmp/Endpoint_SlaveEndpointTest_AuthorizedRequest_1_UkrT0e/http_credentials"
--image_provisioner_backend="copy" --initialize_driver_logging="true" --isolation="posix/cpu,posix/mem"
--launcher="posix" --launcher_dir="/mesos/mesos-1.2.0/_build/src" --logbufsecs="0" --logging_level="INFO"
--max_completed_executors_per_framework="150" --oversubscribed_resources_interval="15secs"
--perf_duration="10secs" --perf_interval="1mins" --qos_correction_interval_min="0ns" --quiet="false"
--recover="reconnect" --recovery_timeout="15mins" --registration_backoff_factor="10ms" --resources="cpus:2;gpus:0;mem:1024;disk:1024;ports:[31000-32000]"
--revocable_cpu_low_priority="true" --runtime_dir="/tmp/Endpoint_SlaveEndpointTest_AuthorizedRequest_1_UkrT0e"
--sandbox_directory="/mnt/mesos/sandbox" --strict="true" --switch_user="true" --systemd_enable_support="true"
--systemd_runtime_directory="/run/systemd/system" --version="false" --work_dir="/tmp/Endpoint_SlaveEndpointTest_AuthorizedRequest_1_tmuOrj"
I1028 23:41:29.943812 29441 credentials.hpp:86] Loading credential for authentication from
'/tmp/Endpoint_SlaveEndpointTest_AuthorizedRequest_1_UkrT0e/credential'
I1028 23:41:29.943992 29441 slave.cpp:346] Agent using credential for: test-principal
I1028 23:41:29.944016 29441 credentials.hpp:37] Loading credentials for authentication from
'/tmp/Endpoint_SlaveEndpointTest_AuthorizedRequest_1_UkrT0e/http_credentials'
I1028 23:41:29.944285 29441 http.cpp:887] Using default 'basic' HTTP authenticator for realm
'mesos-agent-readonly'
I1028 23:41:29.944492 29441 http.cpp:887] Using default 'basic' HTTP authenticator for realm
'mesos-agent-readwrite'
I1028 23:41:29.945973 29441 slave.cpp:533] Agent resources: cpus(*):2; mem(*):1024; disk(*):1024;
ports(*):[31000-32000]
I1028 23:41:29.946075 29441 slave.cpp:541] Agent attributes: [  ]
I1028 23:41:29.946089 29441 slave.cpp:546] Agent hostname: 08fed81fdb8e
I1028 23:41:29.947696 29447 state.cpp:57] Recovering state from '/tmp/Endpoint_SlaveEndpointTest_AuthorizedRequest_1_tmuOrj/meta'
I1028 23:41:29.948025 29440 status_update_manager.cpp:203] Recovering status update manager
I1028 23:41:29.948575 29448 containerizer.cpp:557] Recovering containerizer
I1028 23:41:29.950162 29452 provisioner.cpp:253] Provisioner recovery complete
I1028 23:41:29.950609 29453 slave.cpp:5399] Finished recovery
I1028 23:41:29.951133 29453 slave.cpp:5573] Querying resource estimator for oversubscribable
resources
I1028 23:41:29.951552 29443 slave.cpp:5587] Received oversubscribable resources {} from the
resource estimator
I1028 23:41:29.953054 29444 process.cpp:3570] Handling HTTP event for process 'slave(636)'
with path: '/slave(636)/monitor/statistics.json'
I1028 23:41:29.954613 29439 http.cpp:839] Authorizing principal 'test-principal' to GET the
'/monitor/statistics.json' endpoint
I1028 23:41:29.959734 29441 slave.cpp:787] Agent terminating
[       OK ] Endpoint/SlaveEndpointTest.AuthorizedRequest/1 (30 ms)
[ RUN      ] Endpoint/SlaveEndpointTest.AuthorizedRequest/2
I1028 23:41:29.970291 29419 containerizer.cpp:201] Using isolation: posix/cpu,posix/mem,filesystem/posix,network/cni
W1028 23:41:29.970974 29419 backend.cpp:76] Failed to create 'aufs' backend: AufsBackend requires
root privileges, but is running as user mesos
W1028 23:41:29.971160 29419 backend.cpp:76] Failed to create 'bind' backend: BindBackend requires
root privileges
I1028 23:41:29.974217 29450 slave.cpp:208] Mesos agent started on (637)@172.17.0.2:58617
I1028 23:41:29.974243 29450 slave.cpp:209] Flags at startup: --acls="" --appc_simple_discovery_uri_prefix="http://"
--appc_store_dir="/tmp/mesos/store/appc" --authenticate_http_readonly="true" --authenticate_http_readwrite="true"
--authenticatee="crammd5" --authentication_backoff_factor="1secs" --authorizer="local" --cgroups_cpu_enable_pids_and_tids_count="false"
--cgroups_enable_cfs="false" --cgroups_hierarchy="/sys/fs/cgroup" --cgroups_limit_swap="false"
--cgroups_root="mesos" --container_disk_watch_interval="15secs" --containerizers="mesos" --credential="/tmp/Endpoint_SlaveEndpointTest_AuthorizedRequest_2_ICDlyX/credential"
--default_role="*" --disk_watch_interval="1mins" --docker="docker" --docker_kill_orphans="true"
--docker_registry="https://registry-1.docker.io" --docker_remove_delay="6hrs" --docker_socket="/var/run/docker.sock"
--docker_stop_timeout="0ns" --docker_store_dir="/tmp/mesos/store/docker" --docker_volume_checkpoint_dir="/var/run/mesos/isolators/docker/volume"
--enforce_container_disk_quota="false" --executor_registration_timeout="1mins" --executor_shutdown_grace_period="5secs"
--fetcher_cache_dir="/tmp/Endpoint_SlaveEndpointTest_AuthorizedRequest_2_ICDlyX/fetch" --fetcher_cache_size="2GB"
--frameworks_home="" --gc_delay="1weeks" --gc_disk_headroom="0.1" --hadoop_home="" --help="false"
--hostname_lookup="true" --http_authenticators="basic" --http_command_executor="false" --http_credentials="/tmp/Endpoint_SlaveEndpointTest_AuthorizedRequest_2_ICDlyX/http_credentials"
--image_provisioner_backend="copy" --initialize_driver_logging="true" --isolation="posix/cpu,posix/mem"
--launcher="posix" --launcher_dir="/mesos/mesos-1.2.0/_build/src" --logbufsecs="0" --logging_level="INFO"
--max_completed_executors_per_framework="150" --oversubscribed_resources_interval="15secs"
--perf_duration="10secs" --perf_interval="1mins" --qos_correction_interval_min="0ns" --quiet="false"
--recover="reconnect" --recovery_timeout="15mins" --registration_backoff_factor="10ms" --resources="cpus:2;gpus:0;mem:1024;disk:1024;ports:[31000-32000]"
--revocable_cpu_low_priority="true" --runtime_dir="/tmp/Endpoint_SlaveEndpointTest_AuthorizedRequest_2_ICDlyX"
--sandbox_directory="/mnt/mesos/sandbox" --strict="true" --switch_user="true" --systemd_enable_support="true"
--systemd_runtime_directory="/run/systemd/system" --version="false" --work_dir="/tmp/Endpoint_SlaveEndpointTest_AuthorizedRequest_2_hpedU1"
I1028 23:41:29.974853 29450 credentials.hpp:86] Loading credential for authentication from
'/tmp/Endpoint_SlaveEndpointTest_AuthorizedRequest_2_ICDlyX/credential'
I1028 23:41:29.975016 29450 slave.cpp:346] Agent using credential for: test-principal
I1028 23:41:29.975040 29450 credentials.hpp:37] Loading credentials for authentication from
'/tmp/Endpoint_SlaveEndpointTest_AuthorizedRequest_2_ICDlyX/http_credentials'
I1028 23:41:29.975301 29450 http.cpp:887] Using default 'basic' HTTP authenticator for realm
'mesos-agent-readonly'
I1028 23:41:29.975455 29450 http.cpp:887] Using default 'basic' HTTP authenticator for realm
'mesos-agent-readwrite'
I1028 23:41:29.976800 29450 slave.cpp:533] Agent resources: cpus(*):2; mem(*):1024; disk(*):1024;
ports(*):[31000-32000]
I1028 23:41:29.976900 29450 slave.cpp:541] Agent attributes: [  ]
I1028 23:41:29.976914 29450 slave.cpp:546] Agent hostname: 08fed81fdb8e
I1028 23:41:29.978538 29443 state.cpp:57] Recovering state from '/tmp/Endpoint_SlaveEndpointTest_AuthorizedRequest_2_hpedU1/meta'
I1028 23:41:29.978968 29442 status_update_manager.cpp:203] Recovering status update manager
I1028 23:41:29.979229 29438 containerizer.cpp:557] Recovering containerizer
I1028 23:41:29.980679 29444 provisioner.cpp:253] Provisioner recovery complete
I1028 23:41:29.981181 29451 slave.cpp:5399] Finished recovery
I1028 23:41:29.981642 29451 slave.cpp:5573] Querying resource estimator for oversubscribable
resources
I1028 23:41:29.981936 29439 slave.cpp:5587] Received oversubscribable resources {} from the
resource estimator
I1028 23:41:29.983456 29453 process.cpp:3570] Handling HTTP event for process 'slave(637)'
with path: '/slave(637)/containers'
I1028 23:41:29.984622 29452 http.cpp:839] Authorizing principal 'test-principal' to GET the
'/containers' endpoint
I1028 23:41:29.988751 29449 slave.cpp:787] Agent terminating
[       OK ] Endpoint/SlaveEndpointTest.AuthorizedRequest/2 (29 ms)
[ RUN      ] Endpoint/SlaveEndpointTest.UnauthorizedRequest/0
I1028 23:41:30.000346 29419 containerizer.cpp:201] Using isolation: posix/cpu,posix/mem,filesystem/posix,network/cni
W1028 23:41:30.001052 29419 backend.cpp:76] Failed to create 'aufs' backend: AufsBackend requires
root privileges, but is running as user mesos
W1028 23:41:30.001274 29419 backend.cpp:76] Failed to create 'bind' backend: BindBackend requires
root privileges
I1028 23:41:30.003991 29450 slave.cpp:208] Mesos agent started on (638)@172.17.0.2:58617
I1028 23:41:30.004022 29450 slave.cpp:209] Flags at startup: --acls="" --appc_simple_discovery_uri_prefix="http://"
--appc_store_dir="/tmp/mesos/store/appc" --authenticate_http_readonly="true" --authenticate_http_readwrite="true"
--authenticatee="crammd5" --authentication_backoff_factor="1secs" --authorizer="local" --cgroups_cpu_enable_pids_and_tids_count="false"
--cgroups_enable_cfs="false" --cgroups_hierarchy="/sys/fs/cgroup" --cgroups_limit_swap="false"
--cgroups_root="mesos" --container_disk_watch_interval="15secs" --containerizers="mesos" --credential="/tmp/Endpoint_SlaveEndpointTest_UnauthorizedRequest_0_YWynpG/credential"
--default_role="*" --disk_watch_interval="1mins" --docker="docker" --docker_kill_orphans="true"
--docker_registry="https://registry-1.docker.io" --docker_remove_delay="6hrs" --docker_socket="/var/run/docker.sock"
--docker_stop_timeout="0ns" --docker_store_dir="/tmp/mesos/store/docker" --docker_volume_checkpoint_dir="/var/run/mesos/isolators/docker/volume"
--enforce_container_disk_quota="false" --executor_registration_timeout="1mins" --executor_shutdown_grace_period="5secs"
--fetcher_cache_dir="/tmp/Endpoint_SlaveEndpointTest_UnauthorizedRequest_0_YWynpG/fetch" --fetcher_cache_size="2GB"
--frameworks_home="" --gc_delay="1weeks" --gc_disk_headroom="0.1" --hadoop_home="" --help="false"
--hostname_lookup="true" --http_authenticators="basic" --http_command_executor="false" --http_credentials="/tmp/Endpoint_SlaveEndpointTest_UnauthorizedRequest_0_YWynpG/http_credentials"
--image_provisioner_backend="copy" --initialize_driver_logging="true" --isolation="posix/cpu,posix/mem"
--launcher="posix" --launcher_dir="/mesos/mesos-1.2.0/_build/src" --logbufsecs="0" --logging_level="INFO"
--max_completed_executors_per_framework="150" --oversubscribed_resources_interval="15secs"
--perf_duration="10secs" --perf_interval="1mins" --qos_correction_interval_min="0ns" --quiet="false"
--recover="reconnect" --recovery_timeout="15mins" --registration_backoff_factor="10ms" --resources="cpus:2;gpus:0;mem:1024;disk:1024;ports:[31000-32000]"
--revocable_cpu_low_priority="true" --runtime_dir="/tmp/Endpoint_SlaveEndpointTest_UnauthorizedRequest_0_YWynpG"
--sandbox_directory="/mnt/mesos/sandbox" --strict="true" --switch_user="true" --systemd_enable_support="true"
--systemd_runtime_directory="/run/systemd/system" --version="false" --work_dir="/tmp/Endpoint_SlaveEndpointTest_UnauthorizedRequest_0_H7lnGK"
I1028 23:41:30.004967 29450 credentials.hpp:86] Loading credential for authentication from
'/tmp/Endpoint_SlaveEndpointTest_UnauthorizedRequest_0_YWynpG/credential'
I1028 23:41:30.005180 29450 slave.cpp:346] Agent using credential for: test-principal
I1028 23:41:30.005213 29450 credentials.hpp:37] Loading credentials for authentication from
'/tmp/Endpoint_SlaveEndpointTest_UnauthorizedRequest_0_YWynpG/http_credentials'
I1028 23:41:30.005637 29450 http.cpp:887] Using default 'basic' HTTP authenticator for realm
'mesos-agent-readonly'
I1028 23:41:30.005810 29450 http.cpp:887] Using default 'basic' HTTP authenticator for realm
'mesos-agent-readwrite'
I1028 23:41:30.007498 29450 slave.cpp:533] Agent resources: cpus(*):2; mem(*):1024; disk(*):1024;
ports(*):[31000-32000]
I1028 23:41:30.007596 29450 slave.cpp:541] Agent attributes: [  ]
I1028 23:41:30.007609 29450 slave.cpp:546] Agent hostname: 08fed81fdb8e
I1028 23:41:30.009040 29438 state.cpp:57] Recovering state from '/tmp/Endpoint_SlaveEndpointTest_UnauthorizedRequest_0_H7lnGK/meta'
I1028 23:41:30.009479 29452 status_update_manager.cpp:203] Recovering status update manager
I1028 23:41:30.009727 29442 containerizer.cpp:557] Recovering containerizer
I1028 23:41:30.011317 29450 provisioner.cpp:253] Provisioner recovery complete
I1028 23:41:30.012101 29442 slave.cpp:5399] Finished recovery
I1028 23:41:30.012738 29442 slave.cpp:5573] Querying resource estimator for oversubscribable
resources
I1028 23:41:30.013098 29438 slave.cpp:5587] Received oversubscribable resources {} from the
resource estimator
I1028 23:41:30.014971 29451 process.cpp:3570] Handling HTTP event for process 'slave(638)'
with path: '/slave(638)/monitor/statistics'
I1028 23:41:30.016058 29446 http.cpp:839] Authorizing principal 'test-principal' to GET the
'/monitor/statistics' endpoint
I1028 23:41:30.019112 29438 slave.cpp:787] Agent terminating
[       OK ] Endpoint/SlaveEndpointTest.UnauthorizedRequest/0 (29 ms)
[ RUN      ] Endpoint/SlaveEndpointTest.UnauthorizedRequest/1
I1028 23:41:30.030323 29419 containerizer.cpp:201] Using isolation: posix/cpu,posix/mem,filesystem/posix,network/cni
W1028 23:41:30.031016 29419 backend.cpp:76] Failed to create 'aufs' backend: AufsBackend requires
root privileges, but is running as user mesos
W1028 23:41:30.031193 29419 backend.cpp:76] Failed to create 'bind' backend: BindBackend requires
root privileges
I1028 23:41:30.034536 29452 slave.cpp:208] Mesos agent started on (639)@172.17.0.2:58617
I1028 23:41:30.034560 29452 slave.cpp:209] Flags at startup: --acls="" --appc_simple_discovery_uri_prefix="http://"
--appc_store_dir="/tmp/mesos/store/appc" --authenticate_http_readonly="true" --authenticate_http_readwrite="true"
--authenticatee="crammd5" --authentication_backoff_factor="1secs" --authorizer="local" --cgroups_cpu_enable_pids_and_tids_count="false"
--cgroups_enable_cfs="false" --cgroups_hierarchy="/sys/fs/cgroup" --cgroups_limit_swap="false"
--cgroups_root="mesos" --container_disk_watch_interval="15secs" --containerizers="mesos" --credential="/tmp/Endpoint_SlaveEndpointTest_UnauthorizedRequest_1_0O45zp/credential"
--default_role="*" --disk_watch_interval="1mins" --docker="docker" --docker_kill_orphans="true"
--docker_registry="https://registry-1.docker.io" --docker_remove_delay="6hrs" --docker_socket="/var/run/docker.sock"
--docker_stop_timeout="0ns" --docker_store_dir="/tmp/mesos/store/docker" --docker_volume_checkpoint_dir="/var/run/mesos/isolators/docker/volume"
--enforce_container_disk_quota="false" --executor_registration_timeout="1mins" --executor_shutdown_grace_period="5secs"
--fetcher_cache_dir="/tmp/Endpoint_SlaveEndpointTest_UnauthorizedRequest_1_0O45zp/fetch" --fetcher_cache_size="2GB"
--frameworks_home="" --gc_delay="1weeks" --gc_disk_headroom="0.1" --hadoop_home="" --help="false"
--hostname_lookup="true" --http_authenticators="basic" --http_command_executor="false" --http_credentials="/tmp/Endpoint_SlaveEndpointTest_UnauthorizedRequest_1_0O45zp/http_credentials"
--image_provisioner_backend="copy" --initialize_driver_logging="true" --isolation="posix/cpu,posix/mem"
--launcher="posix" --launcher_dir="/mesos/mesos-1.2.0/_build/src" --logbufsecs="0" --logging_level="INFO"
--max_completed_executors_per_framework="150" --oversubscribed_resources_interval="15secs"
--perf_duration="10secs" --perf_interval="1mins" --qos_correction_interval_min="0ns" --quiet="false"
--recover="reconnect" --recovery_timeout="15mins" --registration_backoff_factor="10ms" --resources="cpus:2;gpus:0;mem:1024;disk:1024;ports:[31000-32000]"
--revocable_cpu_low_priority="true" --runtime_dir="/tmp/Endpoint_SlaveEndpointTest_UnauthorizedRequest_1_0O45zp"
--sandbox_directory="/mnt/mesos/sandbox" --strict="true" --switch_user="true" --systemd_enable_support="true"
--systemd_runtime_directory="/run/systemd/system" --version="false" --work_dir="/tmp/Endpoint_SlaveEndpointTest_UnauthorizedRequest_1_1zVcMt"
I1028 23:41:30.035205 29452 credentials.hpp:86] Loading credential for authentication from
'/tmp/Endpoint_SlaveEndpointTest_UnauthorizedRequest_1_0O45zp/credential'
I1028 23:41:30.035369 29452 slave.cpp:346] Agent using credential for: test-principal
I1028 23:41:30.035394 29452 credentials.hpp:37] Loading credentials for authentication from
'/tmp/Endpoint_SlaveEndpointTest_UnauthorizedRequest_1_0O45zp/http_credentials'
I1028 23:41:30.035651 29452 http.cpp:887] Using default 'basic' HTTP authenticator for realm
'mesos-agent-readonly'
I1028 23:41:30.035782 29452 http.cpp:887] Using default 'basic' HTTP authenticator for realm
'mesos-agent-readwrite'
I1028 23:41:30.037014 29452 slave.cpp:533] Agent resources: cpus(*):2; mem(*):1024; disk(*):1024;
ports(*):[31000-32000]
I1028 23:41:30.037112 29452 slave.cpp:541] Agent attributes: [  ]
I1028 23:41:30.037127 29452 slave.cpp:546] Agent hostname: 08fed81fdb8e
I1028 23:41:30.038729 29445 state.cpp:57] Recovering state from '/tmp/Endpoint_SlaveEndpointTest_UnauthorizedRequest_1_1zVcMt/meta'
I1028 23:41:30.039155 29452 status_update_manager.cpp:203] Recovering status update manager
I1028 23:41:30.039372 29444 containerizer.cpp:557] Recovering containerizer
I1028 23:41:30.040751 29441 provisioner.cpp:253] Provisioner recovery complete
I1028 23:41:30.041287 29450 slave.cpp:5399] Finished recovery
I1028 23:41:30.041831 29450 slave.cpp:5573] Querying resource estimator for oversubscribable
resources
I1028 23:41:30.042047 29453 slave.cpp:5587] Received oversubscribable resources {} from the
resource estimator
I1028 23:41:30.043740 29448 process.cpp:3570] Handling HTTP event for process 'slave(639)'
with path: '/slave(639)/monitor/statistics.json'
I1028 23:41:30.044766 29441 http.cpp:839] Authorizing principal 'test-principal' to GET the
'/monitor/statistics.json' endpoint
I1028 23:41:30.047721 29446 slave.cpp:787] Agent terminating
[       OK ] Endpoint/SlaveEndpointTest.UnauthorizedRequest/1 (27 ms)
[ RUN      ] Endpoint/SlaveEndpointTest.UnauthorizedRequest/2
I1028 23:41:30.057880 29419 containerizer.cpp:201] Using isolation: posix/cpu,posix/mem,filesystem/posix,network/cni
W1028 23:41:30.058545 29419 backend.cpp:76] Failed to create 'aufs' backend: AufsBackend requires
root privileges, but is running as user mesos
W1028 23:41:30.058709 29419 backend.cpp:76] Failed to create 'bind' backend: BindBackend requires
root privileges
I1028 23:41:30.061807 29443 slave.cpp:208] Mesos agent started on (640)@172.17.0.2:58617
I1028 23:41:30.061839 29443 slave.cpp:209] Flags at startup: --acls="" --appc_simple_discovery_uri_prefix="http://"
--appc_store_dir="/tmp/mesos/store/appc" --authenticate_http_readonly="true" --authenticate_http_readwrite="true"
--authenticatee="crammd5" --authentication_backoff_factor="1secs" --authorizer="local" --cgroups_cpu_enable_pids_and_tids_count="false"
--cgroups_enable_cfs="false" --cgroups_hierarchy="/sys/fs/cgroup" --cgroups_limit_swap="false"
--cgroups_root="mesos" --container_disk_watch_interval="15secs" --containerizers="mesos" --credential="/tmp/Endpoint_SlaveEndpointTest_UnauthorizedRequest_2_Sx8Y28/credential"
--default_role="*" --disk_watch_interval="1mins" --docker="docker" --docker_kill_orphans="true"
--docker_registry="https://registry-1.docker.io" --docker_remove_delay="6hrs" --docker_socket="/var/run/docker.sock"
--docker_stop_timeout="0ns" --docker_store_dir="/tmp/mesos/store/docker" --docker_volume_checkpoint_dir="/var/run/mesos/isolators/docker/volume"
--enforce_container_disk_quota="false" --executor_registration_timeout="1mins" --executor_shutdown_grace_period="5secs"
--fetcher_cache_dir="/tmp/Endpoint_SlaveEndpointTest_UnauthorizedRequest_2_Sx8Y28/fetch" --fetcher_cache_size="2GB"
--frameworks_home="" --gc_delay="1weeks" --gc_disk_headroom="0.1" --hadoop_home="" --help="false"
--hostname_lookup="true" --http_authenticators="basic" --http_command_executor="false" --http_credentials="/tmp/Endpoint_SlaveEndpointTest_UnauthorizedRequest_2_Sx8Y28/http_credentials"
--image_provisioner_backend="copy" --initialize_driver_logging="true" --isolation="posix/cpu,posix/mem"
--launcher="posix" --launcher_dir="/mesos/mesos-1.2.0/_build/src" --logbufsecs="0" --logging_level="INFO"
--max_completed_executors_per_framework="150" --oversubscribed_resources_interval="15secs"
--perf_duration="10secs" --perf_interval="1mins" --qos_correction_interval_min="0ns" --quiet="false"
--recover="reconnect" --recovery_timeout="15mins" --registration_backoff_factor="10ms" --resources="cpus:2;gpus:0;mem:1024;disk:1024;ports:[31000-32000]"
--revocable_cpu_low_priority="true" --runtime_dir="/tmp/Endpoint_SlaveEndpointTest_UnauthorizedRequest_2_Sx8Y28"
--sandbox_directory="/mnt/mesos/sandbox" --strict="true" --switch_user="true" --systemd_enable_support="true"
--systemd_runtime_directory="/run/systemd/system" --version="false" --work_dir="/tmp/Endpoint_SlaveEndpointTest_UnauthorizedRequest_2_fajDad"
I1028 23:41:30.062796 29443 credentials.hpp:86] Loading credential for authentication from
'/tmp/Endpoint_SlaveEndpointTest_UnauthorizedRequest_2_Sx8Y28/credential'
I1028 23:41:30.063005 29443 slave.cpp:346] Agent using credential for: test-principal
I1028 23:41:30.063038 29443 credentials.hpp:37] Loading credentials for authentication from
'/tmp/Endpoint_SlaveEndpointTest_UnauthorizedRequest_2_Sx8Y28/http_credentials'
I1028 23:41:30.063413 29443 http.cpp:887] Using default 'basic' HTTP authenticator for realm
'mesos-agent-readonly'
I1028 23:41:30.063592 29443 http.cpp:887] Using default 'basic' HTTP authenticator for realm
'mesos-agent-readwrite'
I1028 23:41:30.065275 29443 slave.cpp:533] Agent resources: cpus(*):2; mem(*):1024; disk(*):1024;
ports(*):[31000-32000]
I1028 23:41:30.065384 29443 slave.cpp:541] Agent attributes: [  ]
I1028 23:41:30.065407 29443 slave.cpp:546] Agent hostname: 08fed81fdb8e
I1028 23:41:30.066936 29440 state.cpp:57] Recovering state from '/tmp/Endpoint_SlaveEndpointTest_UnauthorizedRequest_2_fajDad/meta'
I1028 23:41:30.067414 29444 status_update_manager.cpp:203] Recovering status update manager
I1028 23:41:30.067883 29443 containerizer.cpp:557] Recovering containerizer
I1028 23:41:30.069835 29452 provisioner.cpp:253] Provisioner recovery complete
I1028 23:41:30.070909 29443 slave.cpp:5399] Finished recovery
I1028 23:41:30.071830 29443 slave.cpp:5573] Querying resource estimator for oversubscribable
resources
I1028 23:41:30.072201 29443 slave.cpp:5587] Received oversubscribable resources {} from the
resource estimator
I1028 23:41:30.073690 29441 process.cpp:3570] Handling HTTP event for process 'slave(640)'
with path: '/slave(640)/containers'
I1028 23:41:30.074813 29453 http.cpp:839] Authorizing principal 'test-principal' to GET the
'/containers' endpoint
I1028 23:41:30.078279 29439 slave.cpp:787] Agent terminating
[       OK ] Endpoint/SlaveEndpointTest.UnauthorizedRequest/2 (31 ms)
[ RUN      ] Endpoint/SlaveEndpointTest.NoAuthorizer/0
I1028 23:41:30.090603 29419 containerizer.cpp:201] Using isolation: posix/cpu,posix/mem,filesystem/posix,network/cni
W1028 23:41:30.091310 29419 backend.cpp:76] Failed to create 'aufs' backend: AufsBackend requires
root privileges, but is running as user mesos
W1028 23:41:30.091477 29419 backend.cpp:76] Failed to create 'bind' backend: BindBackend requires
root privileges
I1028 23:41:30.093143 29419 cluster.cpp:435] Creating default 'local' authorizer
I1028 23:41:30.094771 29452 slave.cpp:208] Mesos agent started on (641)@172.17.0.2:58617
I1028 23:41:30.094789 29452 slave.cpp:209] Flags at startup: --acls="" --appc_simple_discovery_uri_prefix="http://"
--appc_store_dir="/tmp/mesos/store/appc" --authenticate_http_readonly="true" --authenticate_http_readwrite="true"
--authenticatee="crammd5" --authentication_backoff_factor="1secs" --authorizer="local" --cgroups_cpu_enable_pids_and_tids_count="false"
--cgroups_enable_cfs="false" --cgroups_hierarchy="/sys/fs/cgroup" --cgroups_limit_swap="false"
--cgroups_root="mesos" --container_disk_watch_interval="15secs" --containerizers="mesos" --credential="/tmp/Endpoint_SlaveEndpointTest_NoAuthorizer_0_4kamQS/credential"
--default_role="*" --disk_watch_interval="1mins" --docker="docker" --docker_kill_orphans="true"
--docker_registry="https://registry-1.docker.io" --docker_remove_delay="6hrs" --docker_socket="/var/run/docker.sock"
--docker_stop_timeout="0ns" --docker_store_dir="/tmp/mesos/store/docker" --docker_volume_checkpoint_dir="/var/run/mesos/isolators/docker/volume"
--enforce_container_disk_quota="false" --executor_registration_timeout="1mins" --executor_shutdown_grace_period="5secs"
--fetcher_cache_dir="/tmp/Endpoint_SlaveEndpointTest_NoAuthorizer_0_4kamQS/fetch" --fetcher_cache_size="2GB"
--frameworks_home="" --gc_delay="1weeks" --gc_disk_headroom="0.1" --hadoop_home="" --help="false"
--hostname_lookup="true" --http_authenticators="basic" --http_command_executor="false" --http_credentials="/tmp/Endpoint_SlaveEndpointTest_NoAuthorizer_0_4kamQS/http_credentials"
--image_provisioner_backend="copy" --initialize_driver_logging="true" --isolation="posix/cpu,posix/mem"
--launcher="posix" --launcher_dir="/mesos/mesos-1.2.0/_build/src" --logbufsecs="0" --logging_level="INFO"
--max_completed_executors_per_framework="150" --oversubscribed_resources_interval="15secs"
--perf_duration="10secs" --perf_interval="1mins" --qos_correction_interval_min="0ns" --quiet="false"
--recover="reconnect" --recovery_timeout="15mins" --registration_backoff_factor="10ms" --resources="cpus:2;gpus:0;mem:1024;disk:1024;ports:[31000-32000]"
--revocable_cpu_low_priority="true" --runtime_dir="/tmp/Endpoint_SlaveEndpointTest_NoAuthorizer_0_4kamQS"
--sandbox_directory="/mnt/mesos/sandbox" --strict="true" --switch_user="true" --systemd_enable_support="true"
--systemd_runtime_directory="/run/systemd/system" --version="false" --work_dir="/tmp/Endpoint_SlaveEndpointTest_NoAuthorizer_0_955KSW"
I1028 23:41:30.095247 29452 credentials.hpp:86] Loading credential for authentication from
'/tmp/Endpoint_SlaveEndpointTest_NoAuthorizer_0_4kamQS/credential'
I1028 23:41:30.095360 29452 slave.cpp:346] Agent using credential for: test-principal
I1028 23:41:30.095377 29452 credentials.hpp:37] Loading credentials for authentication from
'/tmp/Endpoint_SlaveEndpointTest_NoAuthorizer_0_4kamQS/http_credentials'
I1028 23:41:30.095562 29452 http.cpp:887] Using default 'basic' HTTP authenticator for realm
'mesos-agent-readonly'
I1028 23:41:30.095661 29452 http.cpp:887] Using default 'basic' HTTP authenticator for realm
'mesos-agent-readwrite'
I1028 23:41:30.096712 29452 slave.cpp:533] Agent resources: cpus(*):2; mem(*):1024; disk(*):1024;
ports(*):[31000-32000]
I1028 23:41:30.096812 29452 slave.cpp:541] Agent attributes: [  ]
I1028 23:41:30.096824 29452 slave.cpp:546] Agent hostname: 08fed81fdb8e
I1028 23:41:30.098330 29443 state.cpp:57] Recovering state from '/tmp/Endpoint_SlaveEndpointTest_NoAuthorizer_0_955KSW/meta'
I1028 23:41:30.098795 29441 status_update_manager.cpp:203] Recovering status update manager
I1028 23:41:30.099195 29441 containerizer.cpp:557] Recovering containerizer
I1028 23:41:30.100795 29439 provisioner.cpp:253] Provisioner recovery complete
I1028 23:41:30.101279 29445 slave.cpp:5399] Finished recovery
I1028 23:41:30.101838 29445 slave.cpp:5573] Querying resource estimator for oversubscribable
resources
I1028 23:41:30.102193 29439 slave.cpp:5587] Received oversubscribable resources {} from the
resource estimator
I1028 23:41:30.103938 29451 process.cpp:3570] Handling HTTP event for process 'slave(641)'
with path: '/slave(641)/monitor/statistics'
I1028 23:41:30.105039 29441 http.cpp:839] Authorizing principal 'test-principal' to GET the
'/monitor/statistics' endpoint
I1028 23:41:30.109506 29446 slave.cpp:787] Agent terminating
[       OK ] Endpoint/SlaveEndpointTest.NoAuthorizer/0 (31 ms)
[ RUN      ] Endpoint/SlaveEndpointTest.NoAuthorizer/1
I1028 23:41:30.122051 29419 containerizer.cpp:201] Using isolation: posix/cpu,posix/mem,filesystem/posix,network/cni
W1028 23:41:30.122766 29419 backend.cpp:76] Failed to create 'aufs' backend: AufsBackend requires
root privileges, but is running as user mesos
W1028 23:41:30.122930 29419 backend.cpp:76] Failed to create 'bind' backend: BindBackend requires
root privileges
I1028 23:41:30.124809 29419 cluster.cpp:435] Creating default 'local' authorizer
I1028 23:41:30.126762 29445 slave.cpp:208] Mesos agent started on (642)@172.17.0.2:58617
I1028 23:41:30.126791 29445 slave.cpp:209] Flags at startup: --acls="" --appc_simple_discovery_uri_prefix="http://"
--appc_store_dir="/tmp/mesos/store/appc" --authenticate_http_readonly="true" --authenticate_http_readwrite="true"
--authenticatee="crammd5" --authentication_backoff_factor="1secs" --authorizer="local" --cgroups_cpu_enable_pids_and_tids_count="false"
--cgroups_enable_cfs="false" --cgroups_hierarchy="/sys/fs/cgroup" --cgroups_limit_swap="false"
--cgroups_root="mesos" --container_disk_watch_interval="15secs" --containerizers="mesos" --credential="/tmp/Endpoint_SlaveEndpointTest_NoAuthorizer_1_2zf4XC/credential"
--default_role="*" --disk_watch_interval="1mins" --docker="docker" --docker_kill_orphans="true"
--docker_registry="https://registry-1.docker.io" --docker_remove_delay="6hrs" --docker_socket="/var/run/docker.sock"
--docker_stop_timeout="0ns" --docker_store_dir="/tmp/mesos/store/docker" --docker_volume_checkpoint_dir="/var/run/mesos/isolators/docker/volume"
--enforce_container_disk_quota="false" --executor_registration_timeout="1mins" --executor_shutdown_grace_period="5secs"
--fetcher_cache_dir="/tmp/Endpoint_SlaveEndpointTest_NoAuthorizer_1_2zf4XC/fetch" --fetcher_cache_size="2GB"
--frameworks_home="" --gc_delay="1weeks" --gc_disk_headroom="0.1" --hadoop_home="" --help="false"
--hostname_lookup="true" --http_authenticators="basic" --http_command_executor="false" --http_credentials="/tmp/Endpoint_SlaveEndpointTest_NoAuthorizer_1_2zf4XC/http_credentials"
--image_provisioner_backend="copy" --initialize_driver_logging="true" --isolation="posix/cpu,posix/mem"
--launcher="posix" --launcher_dir="/mesos/mesos-1.2.0/_build/src" --logbufsecs="0" --logging_level="INFO"
--max_completed_executors_per_framework="150" --oversubscribed_resources_interval="15secs"
--perf_duration="10secs" --perf_interval="1mins" --qos_correction_interval_min="0ns" --quiet="false"
--recover="reconnect" --recovery_timeout="15mins" --registration_backoff_factor="10ms" --resources="cpus:2;gpus:0;mem:1024;disk:1024;ports:[31000-32000]"
--revocable_cpu_low_priority="true" --runtime_dir="/tmp/Endpoint_SlaveEndpointTest_NoAuthorizer_1_2zf4XC"
--sandbox_directory="/mnt/mesos/sandbox" --strict="true" --switch_user="true" --systemd_enable_support="true"
--systemd_runtime_directory="/run/systemd/system" --version="false" --work_dir="/tmp/Endpoint_SlaveEndpointTest_NoAuthorizer_1_bUhlVG"
I1028 23:41:30.127364 29445 credentials.hpp:86] Loading credential for authentication from
'/tmp/Endpoint_SlaveEndpointTest_NoAuthorizer_1_2zf4XC/credential'
I1028 23:41:30.127518 29445 slave.cpp:346] Agent using credential for: test-principal
I1028 23:41:30.127543 29445 credentials.hpp:37] Loading credentials for authentication from
'/tmp/Endpoint_SlaveEndpointTest_NoAuthorizer_1_2zf4XC/http_credentials'
I1028 23:41:30.127804 29445 http.cpp:887] Using default 'basic' HTTP authenticator for realm
'mesos-agent-readonly'
I1028 23:41:30.127948 29445 http.cpp:887] Using default 'basic' HTTP authenticator for realm
'mesos-agent-readwrite'
I1028 23:41:30.129245 29445 slave.cpp:533] Agent resources: cpus(*):2; mem(*):1024; disk(*):1024;
ports(*):[31000-32000]
I1028 23:41:30.129344 29445 slave.cpp:541] Agent attributes: [  ]
I1028 23:41:30.129359 29445 slave.cpp:546] Agent hostname: 08fed81fdb8e
I1028 23:41:30.130873 29450 state.cpp:57] Recovering state from '/tmp/Endpoint_SlaveEndpointTest_NoAuthorizer_1_bUhlVG/meta'
I1028 23:41:30.131217 29445 status_update_manager.cpp:203] Recovering status update manager
I1028 23:41:30.131546 29453 containerizer.cpp:557] Recovering containerizer
I1028 23:41:30.133376 29439 provisioner.cpp:253] Provisioner recovery complete
I1028 23:41:30.133894 29452 slave.cpp:5399] Finished recovery
I1028 23:41:30.134449 29452 slave.cpp:5573] Querying resource estimator for oversubscribable
resources
I1028 23:41:30.134727 29445 slave.cpp:5587] Received oversubscribable resources {} from the
resource estimator
I1028 23:41:30.136626 29442 process.cpp:3570] Handling HTTP event for process 'slave(642)'
with path: '/slave(642)/monitor/statistics.json'
I1028 23:41:30.138180 29450 http.cpp:839] Authorizing principal 'test-principal' to GET the
'/monitor/statistics.json' endpoint
I1028 23:41:30.143200 29442 slave.cpp:787] Agent terminating
[       OK ] Endpoint/SlaveEndpointTest.NoAuthorizer/1 (32 ms)
[ RUN      ] Endpoint/SlaveEndpointTest.NoAuthorizer/2
I1028 23:41:30.153947 29419 containerizer.cpp:201] Using isolation: posix/cpu,posix/mem,filesystem/posix,network/cni
W1028 23:41:30.154635 29419 backend.cpp:76] Failed to create 'aufs' backend: AufsBackend requires
root privileges, but is running as user mesos
W1028 23:41:30.154803 29419 backend.cpp:76] Failed to create 'bind' backend: BindBackend requires
root privileges
I1028 23:41:30.156333 29419 cluster.cpp:435] Creating default 'local' authorizer
I1028 23:41:30.158020 29442 slave.cpp:208] Mesos agent started on (643)@172.17.0.2:58617
I1028 23:41:30.158043 29442 slave.cpp:209] Flags at startup: --acls="" --appc_simple_discovery_uri_prefix="http://"
--appc_store_dir="/tmp/mesos/store/appc" --authenticate_http_readonly="true" --authenticate_http_readwrite="true"
--authenticatee="crammd5" --authentication_backoff_factor="1secs" --authorizer="local" --cgroups_cpu_enable_pids_and_tids_count="false"
--cgroups_enable_cfs="false" --cgroups_hierarchy="/sys/fs/cgroup" --cgroups_limit_swap="false"
--cgroups_root="mesos" --container_disk_watch_interval="15secs" --containerizers="mesos" --credential="/tmp/Endpoint_SlaveEndpointTest_NoAuthorizer_2_AoyDqn/credential"
--default_role="*" --disk_watch_interval="1mins" --docker="docker" --docker_kill_orphans="true"
--docker_registry="https://registry-1.docker.io" --docker_remove_delay="6hrs" --docker_socket="/var/run/docker.sock"
--docker_stop_timeout="0ns" --docker_store_dir="/tmp/mesos/store/docker" --docker_volume_checkpoint_dir="/var/run/mesos/isolators/docker/volume"
--enforce_container_disk_quota="false" --executor_registration_timeout="1mins" --executor_shutdown_grace_period="5secs"
--fetcher_cache_dir="/tmp/Endpoint_SlaveEndpointTest_NoAuthorizer_2_AoyDqn/fetch" --fetcher_cache_size="2GB"
--frameworks_home="" --gc_delay="1weeks" --gc_disk_headroom="0.1" --hadoop_home="" --help="false"
--hostname_lookup="true" --http_authenticators="basic" --http_command_executor="false" --http_credentials="/tmp/Endpoint_SlaveEndpointTest_NoAuthorizer_2_AoyDqn/http_credentials"
--image_provisioner_backend="copy" --initialize_driver_logging="true" --isolation="posix/cpu,posix/mem"
--launcher="posix" --launcher_dir="/mesos/mesos-1.2.0/_build/src" --logbufsecs="0" --logging_level="INFO"
--max_completed_executors_per_framework="150" --oversubscribed_resources_interval="15secs"
--perf_duration="10secs" --perf_interval="1mins" --qos_correction_interval_min="0ns" --quiet="false"
--recover="reconnect" --recovery_timeout="15mins" --registration_backoff_factor="10ms" --resources="cpus:2;gpus:0;mem:1024;disk:1024;ports:[31000-32000]"
--revocable_cpu_low_priority="true" --runtime_dir="/tmp/Endpoint_SlaveEndpointTest_NoAuthorizer_2_AoyDqn"
--sandbox_directory="/mnt/mesos/sandbox" --strict="true" --switch_user="true" --systemd_enable_support="true"
--systemd_runtime_directory="/run/systemd/system" --version="false" --work_dir="/tmp/Endpoint_SlaveEndpointTest_NoAuthorizer_2_thVIir"
I1028 23:41:30.158507 29442 credentials.hpp:86] Loading credential for authentication from
'/tmp/Endpoint_SlaveEndpointTest_NoAuthorizer_2_AoyDqn/credential'
I1028 23:41:30.158632 29442 slave.cpp:346] Agent using credential for: test-principal
I1028 23:41:30.158650 29442 credentials.hpp:37] Loading credentials for authentication from
'/tmp/Endpoint_SlaveEndpointTest_NoAuthorizer_2_AoyDqn/http_credentials'
I1028 23:41:30.158856 29442 http.cpp:887] Using default 'basic' HTTP authenticator for realm
'mesos-agent-readonly'
I1028 23:41:30.158999 29442 http.cpp:887] Using default 'basic' HTTP authenticator for realm
'mesos-agent-readwrite'
I1028 23:41:30.160001 29442 slave.cpp:533] Agent resources: cpus(*):2; mem(*):1024; disk(*):1024;
ports(*):[31000-32000]
I1028 23:41:30.160073 29442 slave.cpp:541] Agent attributes: [  ]
I1028 23:41:30.160085 29442 slave.cpp:546] Agent hostname: 08fed81fdb8e
I1028 23:41:30.161252 29450 state.cpp:57] Recovering state from '/tmp/Endpoint_SlaveEndpointTest_NoAuthorizer_2_thVIir/meta'
I1028 23:41:30.161574 29447 status_update_manager.cpp:203] Recovering status update manager
I1028 23:41:30.161749 29439 containerizer.cpp:557] Recovering containerizer
I1028 23:41:30.162791 29444 provisioner.cpp:253] Provisioner recovery complete
I1028 23:41:30.163180 29446 slave.cpp:5399] Finished recovery
I1028 23:41:30.163573 29446 slave.cpp:5573] Querying resource estimator for oversubscribable
resources
I1028 23:41:30.163767 29444 slave.cpp:5587] Received oversubscribable resources {} from the
resource estimator
I1028 23:41:30.165418 29448 process.cpp:3570] Handling HTTP event for process 'slave(643)'
with path: '/slave(643)/containers'
I1028 23:41:30.166326 29439 http.cpp:839] Authorizing principal 'test-principal' to GET the
'/containers' endpoint
I1028 23:41:30.169329 29449 slave.cpp:787] Agent terminating
[       OK ] Endpoint/SlaveEndpointTest.NoAuthorizer/2 (26 ms)
[----------] 9 tests from Endpoint/SlaveEndpointTest (274 ms total)

[----------] Global test environment tear-down
[==========] 1370 tests from 155 test cases ran. (423636 ms total)
[  PASSED  ] 1369 tests.
[  FAILED  ] 1 test, listed below:
[  FAILED  ] RegistrarTest.PruneUnreachable

 1 FAILED TEST
  YOU HAVE 4 DISABLED TESTS

make[4]: *** [check-local] Error 1
make[4]: Leaving directory `/mesos/mesos-1.2.0/_build/src'
make[3]: *** [check-am] Error 2
make[3]: Leaving directory `/mesos/mesos-1.2.0/_build/src'
make[2]: *** [check] Error 2
make[2]: Leaving directory `/mesos/mesos-1.2.0/_build/src'
make[1]: *** [check-recursive] Error 1
make[1]: Leaving directory `/mesos/mesos-1.2.0/_build'
make: *** [distcheck] Error 1
+ docker rmi mesos-1477695921-30643
Untagged: mesos-1477695921-30643:latest
Deleted: sha256:72b444a9fcf27ae84fcb48b9c291b9e34fe44dfb4b57273a7b1d4bf15d854bb7
Deleted: sha256:e975c38f779d3a06c034c81388bc58778b6bfd1efb29428498c181947bba721e
Deleted: sha256:b6e7efe598433bda1e1c68f76a696be394250780e1fa218df4cbb21c55a23e06
Deleted: sha256:bc1432faebf2796d6ab1aa52eea2e0eaedecf5e1ca08ababb28d6356b1177c1e
Deleted: sha256:29b1551ee81503dd37de412869ee88ac82ee92e59b43cb731a35b3216ac78696
Deleted: sha256:ce37edfd7ce4f11182113908914e6ea8541d73be4871b138467743695b4c7281
Deleted: sha256:2f712072618b7e17ad8d6d860d219cc919a397c8d481f05298b1a8848deb876f
Deleted: sha256:554f6072d853057979387d802a44f0c30db419528a31f0c3b6d74aa0dc911301
Deleted: sha256:82e716734903d6930e338659949a3afc33c8cb8fbf188fe6fe2e0b719b03d79c
Deleted: sha256:da4580486b9834faa32361e21a5de93960d6bf5599337280ab671cf1ffb5f047
Deleted: sha256:c36f88378f422092d820d07937801cbde8dd8971406dd06966a0c9f35f7d9b30
Deleted: sha256:7a8e142abe783927d74f4deef17e467d6a4c21d3f1235db9e9f9ad651fd50f9b
Deleted: sha256:acb51f9141cf7e90cdaaa8f39fd8a3480a440b667bf9b9f9f4444d460ae0150c
Deleted: sha256:9899ef9431723abe6dacbfaee36005b667a42751856feb4a0768facdc23575a2
Deleted: sha256:e9a847903ae9b771635192a9863d29e4d06a386c3a1760b3e6bc99217ceee1d2
Deleted: sha256:03706aa0c82028e7d44b3a3ef9c189a3e48ef7dd369926fa5b14b97c6e236535
Deleted: sha256:e908f94dacf65a471bfd4d5d997414ccd16bd1d265392c71153f0e9e163f1d08
Deleted: sha256:07ff5b2b670acf35572e55711ff599cb364ddb49e17017e9ae48e50be9c1c8d4
Deleted: sha256:e5efcec579905a56b9d6aad96438f724baf53fbb0d96bbb4d9529b9890b537f6
Deleted: sha256:34b57db2e02e4ab87d3a938bdca479e460cdd2336a9d80ec60c176ea95ab707e
Deleted: sha256:2bbf05cf3ccd9c2dcf0b73cc6b58d4f336e527ea3c6202213aec29a2e29be269
Deleted: sha256:763d3eb1848f323cecc057d9bc7ac6f31e34f36664c4a723a9cef121ecbb3a76
Deleted: sha256:b286ff4f325781c829cb2c065fb6a2dca68e4e8954170ef9488edadbe11d6e9a
Deleted: sha256:6dd9bcb854289ce5f23e43d1103bb890c893b642ac71894171c5d96af139f879
Build step 'Execute shell' marked build as failure

Mime
View raw message