mesos-builds mailing list archives

Site index · List index
Message view « Date » · « Thread »
Top « Date » · « Thread »
From Apache Jenkins Server <jenk...@builds.apache.org>
Subject Build failed in Jenkins: Mesos » autotools,gcc,--verbose,GLOG_v=1 MESOS_VERBOSE=1,centos:7,(docker||Hadoop)&&(!ubuntu-us1)&&(!ubuntu-6) #2759
Date Mon, 10 Oct 2016 18:08:26 GMT
See <https://builds.apache.org/job/Mesos/BUILDTOOL=autotools,COMPILER=gcc,CONFIGURATION=--verbose,ENVIRONMENT=GLOG_v=1%20MESOS_VERBOSE=1,OS=centos%3A7,label_exp=(docker%7C%7CHadoop)&&(!ubuntu-us1)&&(!ubuntu-6)/2759/changes>

Changes:

[xujyan] Refactor parsing of resources.

------------------------------------------
[...truncated 160517 lines...]
I1010 18:07:38.479971 30223 replica.cpp:708] Persisted action APPEND at position 5
I1010 18:07:38.481021 30230 registrar.cpp:506] Successfully updated the registry in 0ns
I1010 18:07:38.481166 30230 log.cpp:596] Attempting to truncate the log to 5
I1010 18:07:38.481283 30228 coordinator.cpp:348] Coordinator attempting to write TRUNCATE
action at position 6
I1010 18:07:38.482003 30221 replica.cpp:537] Replica received write request for position 6
from __req_res__(5958)@172.17.0.3:53523
I1010 18:07:38.482159 30221 leveldb.cpp:341] Persisting action (16 bytes) to leveldb took
119289ns
I1010 18:07:38.482183 30221 replica.cpp:708] Persisted action TRUNCATE at position 6
I1010 18:07:38.482900 30217 replica.cpp:691] Replica received learned notice for position
6 from @0.0.0.0:0
I1010 18:07:38.483100 30217 leveldb.cpp:341] Persisting action (18 bytes) to leveldb took
172553ns
I1010 18:07:38.483155 30217 leveldb.cpp:399] Deleting ~2 keys from leveldb took 31620ns
I1010 18:07:38.483171 30217 replica.cpp:708] Persisted action TRUNCATE at position 6
I1010 18:07:38.483808 30226 master.cpp:7425] Removed agent a6050b79-6ac9-4786-9bf7-66201bb4e993-S0
(8d2a19c3db7a): the agent unregistered
I1010 18:07:38.484417 30223 sched.cpp:943] Rescinded offer a6050b79-6ac9-4786-9bf7-66201bb4e993-O0
I1010 18:07:38.484447 30221 hierarchical.cpp:517] Removed agent a6050b79-6ac9-4786-9bf7-66201bb4e993-S0
I1010 18:07:38.484479 30223 sched.cpp:954] Scheduler::offerRescinded took 23371ns
I1010 18:07:38.484613 30226 master.cpp:1930] Notifying framework a6050b79-6ac9-4786-9bf7-66201bb4e993-0000
(default) at scheduler-942729b5-5a88-4795-92bd-97f2cd84814b@172.17.0.3:53523 of lost agent
a6050b79-6ac9-4786-9bf7-66201bb4e993-S0 (8d2a19c3db7a)
I1010 18:07:38.484782 30228 sched.cpp:1087] Lost agent a6050b79-6ac9-4786-9bf7-66201bb4e993-S0
I1010 18:07:38.484829 30228 sched.cpp:1098] Scheduler::slaveLost took 23504ns
I1010 18:07:38.485219 30198 sched.cpp:1995] Asked to stop the driver
I1010 18:07:38.485303 30222 sched.cpp:1187] Stopping framework a6050b79-6ac9-4786-9bf7-66201bb4e993-0000
I1010 18:07:38.485499 30224 master.cpp:7043] Processing TEARDOWN call for framework a6050b79-6ac9-4786-9bf7-66201bb4e993-0000
(default) at scheduler-942729b5-5a88-4795-92bd-97f2cd84814b@172.17.0.3:53523
I1010 18:07:38.485533 30224 master.cpp:7055] Removing framework a6050b79-6ac9-4786-9bf7-66201bb4e993-0000
(default) at scheduler-942729b5-5a88-4795-92bd-97f2cd84814b@172.17.0.3:53523
I1010 18:07:38.485724 30226 hierarchical.cpp:386] Deactivated framework a6050b79-6ac9-4786-9bf7-66201bb4e993-0000
I1010 18:07:38.485996 30217 hierarchical.cpp:337] Removed framework a6050b79-6ac9-4786-9bf7-66201bb4e993-0000
I1010 18:07:38.486572 30220 slave.cpp:787] Agent terminating
I1010 18:07:38.490743 30221 master.cpp:1097] Master terminating
I1010 18:07:38.501951 30198 cluster.cpp:158] Creating default 'local' authorizer
I1010 18:07:38.504946 30198 leveldb.cpp:174] Opened db in 2.716633ms
I1010 18:07:38.505482 30198 leveldb.cpp:181] Compacted db in 500245ns
I1010 18:07:38.505533 30198 leveldb.cpp:196] Created db iterator in 18027ns
I1010 18:07:38.505556 30198 leveldb.cpp:202] Seeked to beginning of db in 2325ns
I1010 18:07:38.505568 30198 leveldb.cpp:271] Iterated through 0 keys in the db in 502ns
I1010 18:07:38.505605 30198 replica.cpp:776] Replica recovered with log positions 0 ->
0 with 1 holes and 0 unlearned
I1010 18:07:38.506100 30218 recover.cpp:451] Starting replica recovery
I1010 18:07:38.506458 30230 recover.cpp:477] Replica is in EMPTY status
I1010 18:07:38.507491 30231 replica.cpp:673] Replica in EMPTY status received a broadcasted
recover request from __req_res__(5959)@172.17.0.3:53523
I1010 18:07:38.507958 30232 recover.cpp:197] Received a recover response from a replica in
EMPTY status
I1010 18:07:38.508390 30229 recover.cpp:568] Updating replica status to STARTING
I1010 18:07:38.509096 30225 leveldb.cpp:304] Persisting metadata (8 bytes) to leveldb took
474999ns
I1010 18:07:38.509124 30225 replica.cpp:320] Persisted replica status to STARTING
I1010 18:07:38.509330 30223 recover.cpp:477] Replica is in STARTING status
I1010 18:07:38.510242 30231 replica.cpp:673] Replica in STARTING status received a broadcasted
recover request from __req_res__(5960)@172.17.0.3:53523
I1010 18:07:38.510602 30217 master.cpp:380] Master 9ab8c6ea-6cc5-4a89-8a4b-e0f7e463ba65 (8d2a19c3db7a)
started on 172.17.0.3:53523
I1010 18:07:38.510792 30219 recover.cpp:197] Received a recover response from a replica in
STARTING status
I1010 18:07:38.510625 30217 master.cpp:382] Flags at startup: --acls="" --agent_ping_timeout="15secs"
--agent_reregister_timeout="10mins" --allocation_interval="1secs" --allocator="HierarchicalDRF"
--authenticate_agents="true" --authenticate_frameworks="true" --authenticate_http_frameworks="true"
--authenticate_http_readonly="true" --authenticate_http_readwrite="true" --authenticators="crammd5"
--authorizers="local" --credentials="/tmp/X0q7qG/credentials" --framework_sorter="drf" --help="false"
--hostname_lookup="true" --http_authenticators="basic" --http_framework_authenticators="basic"
--initialize_driver_logging="true" --log_auto_initialize="true" --logbufsecs="0" --logging_level="INFO"
--max_agent_ping_timeouts="5" --max_completed_frameworks="50" --max_completed_tasks_per_framework="1000"
--quiet="false" --recovery_agent_removal_limit="100%" --registry="replicated_log" --registry_fetch_timeout="1mins"
--registry_gc_interval="15mins" --registry_max_agent_age="2weeks" --registry_max_agent_count="102400"
--registry_store_timeout="100secs" --registry_strict="false" --root_submissions="true" --user_sorter="drf"
--version="false" --webui_dir="/mesos/mesos-1.1.0/_inst/share/mesos/webui" --work_dir="/tmp/X0q7qG/master"
--zk_session_timeout="10secs"
I1010 18:07:38.511139 30217 master.cpp:432] Master only allowing authenticated frameworks
to register
I1010 18:07:38.511153 30217 master.cpp:446] Master only allowing authenticated agents to register
I1010 18:07:38.511162 30217 master.cpp:459] Master only allowing authenticated HTTP frameworks
to register
I1010 18:07:38.511170 30217 credentials.hpp:37] Loading credentials for authentication from
'/tmp/X0q7qG/credentials'
I1010 18:07:38.511385 30221 recover.cpp:568] Updating replica status to VOTING
I1010 18:07:38.511627 30217 master.cpp:504] Using default 'crammd5' authenticator
I1010 18:07:38.511761 30217 http.cpp:883] Using default 'basic' HTTP authenticator for realm
'mesos-master-readonly'
I1010 18:07:38.512018 30217 http.cpp:883] Using default 'basic' HTTP authenticator for realm
'mesos-master-readwrite'
I1010 18:07:38.512163 30225 leveldb.cpp:304] Persisting metadata (8 bytes) to leveldb took
597121ns
I1010 18:07:38.512197 30225 replica.cpp:320] Persisted replica status to VOTING
I1010 18:07:38.512214 30217 http.cpp:883] Using default 'basic' HTTP authenticator for realm
'mesos-master-scheduler'
I1010 18:07:38.512325 30227 recover.cpp:582] Successfully joined the Paxos group
I1010 18:07:38.512387 30217 master.cpp:584] Authorization enabled
I1010 18:07:38.512567 30228 hierarchical.cpp:149] Initialized hierarchical allocator process
I1010 18:07:38.512626 30227 recover.cpp:466] Recover process terminated
I1010 18:07:38.512631 30232 whitelist_watcher.cpp:77] No whitelist given
I1010 18:07:38.515213 30232 master.cpp:2013] Elected as the leading master!
I1010 18:07:38.515249 30232 master.cpp:1560] Recovering from registrar
I1010 18:07:38.515460 30229 registrar.cpp:329] Recovering registrar
I1010 18:07:38.516029 30232 log.cpp:553] Attempting to start the writer
I1010 18:07:38.517360 30230 replica.cpp:493] Replica received implicit promise request from
__req_res__(5961)@172.17.0.3:53523 with proposal 1
I1010 18:07:38.517837 30230 leveldb.cpp:304] Persisting metadata (8 bytes) to leveldb took
440260ns
I1010 18:07:38.517863 30230 replica.cpp:342] Persisted promised to 1
I1010 18:07:38.518519 30230 coordinator.cpp:238] Coordinator attempting to fill missing positions
I1010 18:07:38.519973 30221 replica.cpp:388] Replica received explicit promise request from
__req_res__(5962)@172.17.0.3:53523 for position 0 with proposal 2
I1010 18:07:38.520362 30221 leveldb.cpp:341] Persisting action (8 bytes) to leveldb took 340693ns
I1010 18:07:38.520390 30221 replica.cpp:708] Persisted action NOP at position 0
I1010 18:07:38.521507 30222 replica.cpp:537] Replica received write request for position 0
from __req_res__(5963)@172.17.0.3:53523
I1010 18:07:38.521569 30222 leveldb.cpp:436] Reading position from leveldb took 30157ns
I1010 18:07:38.521739 30222 leveldb.cpp:341] Persisting action (14 bytes) to leveldb took
128261ns
I1010 18:07:38.521767 30222 replica.cpp:708] Persisted action NOP at position 0
I1010 18:07:38.522411 30227 replica.cpp:691] Replica received learned notice for position
0 from @0.0.0.0:0
I1010 18:07:38.522586 30227 leveldb.cpp:341] Persisting action (16 bytes) to leveldb took
138458ns
I1010 18:07:38.522619 30227 replica.cpp:708] Persisted action NOP at position 0
I1010 18:07:38.523301 30227 log.cpp:569] Writer started with ending position 0
I1010 18:07:38.524482 30223 leveldb.cpp:436] Reading position from leveldb took 35866ns
I1010 18:07:38.525478 30228 registrar.cpp:362] Successfully fetched the registry (0B) in 9.968128ms
I1010 18:07:38.525602 30228 registrar.cpp:461] Applied 1 operations in 20574ns; attempting
to update the registry
I1010 18:07:38.526408 30227 log.cpp:577] Attempting to append 168 bytes to the log
I1010 18:07:38.526547 30224 coordinator.cpp:348] Coordinator attempting to write APPEND action
at position 1
I1010 18:07:38.527367 30226 replica.cpp:537] Replica received write request for position 1
from __req_res__(5964)@172.17.0.3:53523
I1010 18:07:38.527832 30226 leveldb.cpp:341] Persisting action (187 bytes) to leveldb took
419750ns
I1010 18:07:38.527859 30226 replica.cpp:708] Persisted action APPEND at position 1
I1010 18:07:38.528506 30218 replica.cpp:691] Replica received learned notice for position
1 from @0.0.0.0:0
I1010 18:07:38.528676 30218 leveldb.cpp:341] Persisting action (189 bytes) to leveldb took
137460ns
I1010 18:07:38.528703 30218 replica.cpp:708] Persisted action APPEND at position 1
I1010 18:07:38.529845 30229 registrar.cpp:506] Successfully updated the registry in 4.178176ms
I1010 18:07:38.529997 30229 registrar.cpp:392] Successfully recovered registrar
I1010 18:07:38.530117 30218 log.cpp:596] Attempting to truncate the log to 1
I1010 18:07:38.530249 30223 coordinator.cpp:348] Coordinator attempting to write TRUNCATE
action at position 2
I1010 18:07:38.530629 30221 master.cpp:1676] Recovered 0 agents from the registry (129B);
allowing 10mins for agents to re-register
I1010 18:07:38.530665 30224 hierarchical.cpp:176] Skipping recovery of hierarchical allocator:
nothing to recover
I1010 18:07:38.531301 30226 replica.cpp:537] Replica received write request for position 2
from __req_res__(5965)@172.17.0.3:53523
I1010 18:07:38.531605 30226 leveldb.cpp:341] Persisting action (16 bytes) to leveldb took
263511ns
I1010 18:07:38.531631 30226 replica.cpp:708] Persisted action TRUNCATE at position 2
I1010 18:07:38.532328 30230 replica.cpp:691] Replica received learned notice for position
2 from @0.0.0.0:0
I1010 18:07:38.532498 30230 leveldb.cpp:341] Persisting action (18 bytes) to leveldb took
136332ns
I1010 18:07:38.532558 30230 leveldb.cpp:399] Deleting ~1 keys from leveldb took 32721ns
I1010 18:07:38.532579 30230 replica.cpp:708] Persisted action TRUNCATE at position 2
I1010 18:07:38.538681 30224 slave.cpp:208] Mesos agent started on 172.17.0.3:53523
I1010 18:07:38.538712 30224 slave.cpp:209] Flags at startup: --acls="" --appc_simple_discovery_uri_prefix="http://"
--appc_store_dir="/tmp/mesos/store/appc" --authenticate_http_readonly="true" --authenticate_http_readwrite="true"
--authenticatee="crammd5" --authentication_backoff_factor="1secs" --authorizer="local" --cgroups_cpu_enable_pids_and_tids_count="false"
--cgroups_enable_cfs="false" --cgroups_hierarchy="/sys/fs/cgroup" --cgroups_limit_swap="false"
--cgroups_root="mesos" --container_disk_watch_interval="15secs" --containerizers="mesos" --credential="/tmp/SlaveTest_KillTaskBetweenRunTaskParts_LH82HY/credential"
--default_role="*" --disk_watch_interval="1mins" --docker="docker" --docker_kill_orphans="true"
--docker_registry="https://registry-1.docker.io" --docker_remove_delay="6hrs" --docker_socket="/var/run/docker.sock"
--docker_stop_timeout="0ns" --docker_store_dir="/tmp/mesos/store/docker" --docker_volume_checkpoint_dir="/var/run/mesos/isolators/docker/volume"
--enforce_container_disk_quota="false" --executor_registration_timeout="1mins" --executor_shutdown_grace_period="5secs"
--fetcher_cache_dir="/tmp/SlaveTest_KillTaskBetweenRunTaskParts_LH82HY/fetch" --fetcher_cache_size="2GB"
--frameworks_home="" --gc_delay="1weeks" --gc_disk_headroom="0.1" --hadoop_home="" --help="false"
--hostname_lookup="true" --http_authenticators="basic" --http_command_executor="false" --http_credentials="/tmp/SlaveTest_KillTaskBetweenRunTaskParts_LH82HY/http_credentials"
--image_provisioner_backend="copy" --initialize_driver_logging="true" --isolation="posix/cpu,posix/mem"
--launcher="posix" --launcher_dir="/mesos/mesos-1.1.0/_build/src" --logbufsecs="0" --logging_level="INFO"
--oversubscribed_resources_interval="15secs" --perf_duration="10secs" --perf_interval="1mins"
--qos_correction_interval_min="0ns" --quiet="false" --recover="reconnect" --recovery_timeout="15mins"
--registration_backoff_factor="10ms" --resources="cpus:2;gpus:0;mem:1024;disk:1024;ports:[31000-32000]"
--revocable_cpu_low_priority="true" --runtime_dir="/tmp/SlaveTest_KillTaskBetweenRunTaskParts_LH82HY"
--sandbox_directory="/mnt/mesos/sandbox" --strict="true" --switch_user="true" --systemd_enable_support="true"
--systemd_runtime_directory="/run/systemd/system" --version="false" --work_dir="/tmp/SlaveTest_KillTaskBetweenRunTaskParts_R2GzzP"
I1010 18:07:38.539330 30224 credentials.hpp:86] Loading credential for authentication from
'/tmp/SlaveTest_KillTaskBetweenRunTaskParts_LH82HY/credential'
I1010 18:07:38.539499 30224 slave.cpp:346] Agent using credential for: test-principal
I1010 18:07:38.539521 30224 credentials.hpp:37] Loading credentials for authentication from
'/tmp/SlaveTest_KillTaskBetweenRunTaskParts_LH82HY/http_credentials'
I1010 18:07:38.539813 30224 http.cpp:883] Using default 'basic' HTTP authenticator for realm
'mesos-agent-readonly'
I1010 18:07:38.539966 30224 http.cpp:883] Using default 'basic' HTTP authenticator for realm
'mesos-agent-readwrite'
I1010 18:07:38.539994 30198 sched.cpp:226] Version: 1.1.0
I1010 18:07:38.540570 30230 sched.cpp:330] New master detected at master@172.17.0.3:53523
I1010 18:07:38.540678 30230 sched.cpp:396] Authenticating with master master@172.17.0.3:53523
I1010 18:07:38.540704 30230 sched.cpp:403] Using default CRAM-MD5 authenticatee
I1010 18:07:38.540943 30226 authenticatee.cpp:121] Creating new client SASL connection
I1010 18:07:38.541204 30219 master.cpp:6640] Authenticating scheduler-3a27f757-31ba-4084-843a-04ad92708a75@172.17.0.3:53523
I1010 18:07:38.541327 30222 authenticator.cpp:414] Starting authentication session for crammd5-authenticatee(927)@172.17.0.3:53523
I1010 18:07:38.541574 30228 authenticator.cpp:98] Creating new server SASL connection
I1010 18:07:38.541646 30224 slave.cpp:533] Agent resources: cpus(*):2; mem(*):1024; disk(*):1024;
ports(*):[31000-32000]
I1010 18:07:38.541744 30224 slave.cpp:541] Agent attributes: [  ]
I1010 18:07:38.541759 30224 slave.cpp:546] Agent hostname: 8d2a19c3db7a
I1010 18:07:38.541849 30220 authenticatee.cpp:213] Received SASL authentication mechanisms:
CRAM-MD5
I1010 18:07:38.541889 30220 authenticatee.cpp:239] Attempting to authenticate with mechanism
'CRAM-MD5'
I1010 18:07:38.543469 30227 state.cpp:57] Recovering state from '/tmp/SlaveTest_KillTaskBetweenRunTaskParts_R2GzzP/meta'
I1010 18:07:39.513914 30218 hierarchical.cpp:1694] No allocations performed
W1010 18:07:43.542052 30226 sched.cpp:526] Authentication timed out
W1010 18:07:43.542181 30231 master.cpp:6687] Authentication timed out
W1010 18:07:53.038166 30231 master.cpp:6667] Failed to authenticate scheduler-3a27f757-31ba-4084-843a-04ad92708a75@172.17.0.3:53523:
Authentication discarded
I1010 18:07:53.038154 30218 hierarchical.cpp:1286] Performed allocation for 0 agents in 13.524282771secs
I1010 18:07:43.542399 30230 authenticator.cpp:432] Authentication session cleanup for crammd5-authenticatee(927)@172.17.0.3:53523
I1010 18:07:53.038666 30231 status_update_manager.cpp:203] Recovering status update manager
I1010 18:07:53.038849 30223 sched.cpp:466] Failed to authenticate with master master@172.17.0.3:53523:
Authentication discarded
I1010 18:07:53.039058 30230 slave.cpp:5276] Finished recovery
I1010 18:07:53.039726 30230 slave.cpp:5448] Querying resource estimator for oversubscribable
resources
I1010 18:07:53.040017 30230 slave.cpp:915] New master detected at master@172.17.0.3:53523
I1010 18:07:53.040026 30229 status_update_manager.cpp:177] Pausing sending status updates
I1010 18:07:53.040060 30230 slave.cpp:974] Authenticating with master master@172.17.0.3:53523
I1010 18:07:53.040160 30230 slave.cpp:985] Using default CRAM-MD5 authenticatee
I1010 18:07:53.040349 30230 slave.cpp:947] Detecting new master
I1010 18:07:53.040436 30225 authenticatee.cpp:121] Creating new client SASL connection
I1010 18:07:53.040755 30221 master.cpp:6640] Authenticating (75)@172.17.0.3:53523
I1010 18:07:53.040894 30232 authenticator.cpp:414] Starting authentication session for crammd5-authenticatee(928)@172.17.0.3:53523
I1010 18:07:53.041174 30228 authenticator.cpp:98] Creating new server SASL connection
I1010 18:07:53.041430 30231 authenticatee.cpp:213] Received SASL authentication mechanisms:
CRAM-MD5
I1010 18:07:53.041471 30231 authenticatee.cpp:239] Attempting to authenticate with mechanism
'CRAM-MD5'
I1010 18:07:53.041594 30227 authenticator.cpp:204] Received SASL authentication start
I1010 18:07:53.041668 30227 authenticator.cpp:326] Authentication requires more steps
I1010 18:07:53.041784 30231 authenticatee.cpp:259] Received SASL authentication step
I1010 18:07:53.041940 30227 authenticator.cpp:232] Received SASL authentication step
I1010 18:07:53.041978 30227 auxprop.cpp:109] Request to lookup properties for user: 'test-principal'
realm: '8d2a19c3db7a' server FQDN: '8d2a19c3db7a' SASL_AUXPROP_VERIFY_AGAINST_HASH: false
SASL_AUXPROP_OVERRIDE: false SASL_AUXPROP_AUTHZID: false 
I1010 18:07:53.041996 30227 auxprop.cpp:181] Looking up auxiliary property '*userPassword'
I1010 18:07:53.042042 30227 auxprop.cpp:181] Looking up auxiliary property '*cmusaslsecretCRAM-MD5'
I1010 18:07:53.042070 30227 auxprop.cpp:109] Request to lookup properties for user: 'test-principal'
realm: '8d2a19c3db7a' server FQDN: '8d2a19c3db7a' SASL_AUXPROP_VERIFY_AGAINST_HASH: false
SASL_AUXPROP_OVERRIDE: false SASL_AUXPROP_AUTHZID: true 
I1010 18:07:53.042086 30227 auxprop.cpp:131] Skipping auxiliary property '*userPassword' since
SASL_AUXPROP_AUTHZID == true
I1010 18:07:53.042098 30227 auxprop.cpp:131] Skipping auxiliary property '*cmusaslsecretCRAM-MD5'
since SASL_AUXPROP_AUTHZID == true
I1010 18:07:53.042119 30227 authenticator.cpp:318] Authentication success
I1010 18:07:53.042207 30231 authenticatee.cpp:299] Authentication success
I1010 18:07:53.042292 30229 master.cpp:6670] Successfully authenticated principal 'test-principal'
at (75)@172.17.0.3:53523
I1010 18:07:53.042502 30222 authenticator.cpp:432] Authentication session cleanup for crammd5-authenticatee(928)@172.17.0.3:53523
I1010 18:07:53.042697 30226 slave.cpp:1069] Successfully authenticated with master master@172.17.0.3:53523
I1010 18:07:53.042927 30226 slave.cpp:1475] Will retry registration in 11.780387ms if necessary
I1010 18:07:53.043169 30230 master.cpp:5074] Registering agent at (75)@172.17.0.3:53523 (8d2a19c3db7a)
with id 9ab8c6ea-6cc5-4a89-8a4b-e0f7e463ba65-S0
I1010 18:07:53.043812 30217 registrar.cpp:461] Applied 1 operations in 70413ns; attempting
to update the registry
I1010 18:07:53.044795 30225 log.cpp:577] Attempting to append 337 bytes to the log
I1010 18:07:53.044945 30221 coordinator.cpp:348] Coordinator attempting to write APPEND action
at position 3
I1010 18:07:53.045892 30224 replica.cpp:537] Replica received write request for position 3
from __req_res__(5966)@172.17.0.3:53523
I1010 18:07:53.046506 30224 leveldb.cpp:341] Persisting action (356 bytes) to leveldb took
564076ns
I1010 18:07:53.046540 30224 replica.cpp:708] Persisted action APPEND at position 3
I1010 18:07:53.047380 30226 replica.cpp:691] Replica received learned notice for position
3 from @0.0.0.0:0
I1010 18:07:53.047972 30226 leveldb.cpp:341] Persisting action (358 bytes) to leveldb took
512104ns
I1010 18:07:53.048054 30226 replica.cpp:708] Persisted action APPEND at position 3
I1010 18:07:53.050914 30218 registrar.cpp:506] Successfully updated the registry in 6.892032ms
I1010 18:07:53.051568 30222 log.cpp:596] Attempting to truncate the log to 3
I1010 18:07:53.051863 30228 coordinator.cpp:348] Coordinator attempting to write TRUNCATE
action at position 4
I1010 18:07:53.052305 30217 master.cpp:5145] Registered agent 9ab8c6ea-6cc5-4a89-8a4b-e0f7e463ba65-S0
at (75)@172.17.0.3:53523 (8d2a19c3db7a) with cpus(*):2; mem(*):1024; disk(*):1024; ports(*):[31000-32000]
I1010 18:07:53.052770 30229 hierarchical.cpp:485] Added agent 9ab8c6ea-6cc5-4a89-8a4b-e0f7e463ba65-S0
(8d2a19c3db7a) with cpus(*):2; mem(*):1024; disk(*):1024; ports(*):[31000-32000] (allocated:
{})
I1010 18:07:53.053025 30229 hierarchical.cpp:1694] No allocations performed
I1010 18:07:53.053125 30220 replica.cpp:537] Replica received write request for position 4
from __req_res__(5967)@172.17.0.3:53523
I1010 18:07:53.053131 30229 hierarchical.cpp:1309] Performed allocation for agent 9ab8c6ea-6cc5-4a89-8a4b-e0f7e463ba65-S0
in 270738ns
I1010 18:07:53.053413 30219 slave.cpp:4128] Received ping from slave-observer(429)@172.17.0.3:53523
I1010 18:07:53.053601 30220 leveldb.cpp:341] Persisting action (16 bytes) to leveldb took
416968ns
I1010 18:07:53.053642 30220 replica.cpp:708] Persisted action TRUNCATE at position 4
I1010 18:07:53.053658 30219 slave.cpp:1115] Registered with master master@172.17.0.3:53523;
given agent ID 9ab8c6ea-6cc5-4a89-8a4b-e0f7e463ba65-S0
I1010 18:07:53.053697 30219 fetcher.cpp:86] Clearing fetcher cache
I1010 18:07:53.053962 30220 status_update_manager.cpp:184] Resuming sending status updates
I1010 18:07:53.054205 30219 slave.cpp:1138] Checkpointing SlaveInfo to '/tmp/SlaveTest_KillTaskBetweenRunTaskParts_R2GzzP/meta/slaves/9ab8c6ea-6cc5-4a89-8a4b-e0f7e463ba65-S0/slave.info'
I1010 18:07:53.054571 30224 replica.cpp:691] Replica received learned notice for position
4 from @0.0.0.0:0
I1010 18:07:53.054750 30224 leveldb.cpp:341] Persisting action (18 bytes) to leveldb took
139356ns
I1010 18:07:53.054823 30224 leveldb.cpp:399] Deleting ~2 keys from leveldb took 42248ns
I1010 18:07:53.054850 30224 replica.cpp:708] Persisted action TRUNCATE at position 4
../../src/tests/slave_tests.cpp:3154: Failure
Failed to wait 15secs for offers
../../src/tests/slave_tests.cpp:3148: Failure
Actual function call count doesn't match EXPECT_CALL(sched, resourceOffers(&driver, _))...
         Expected: to be called at least once
           Actual: never called - unsatisfied and active
../../src/tests/slave_tests.cpp:3144: Failure
Actual function call count doesn't match EXPECT_CALL(sched, registered(&driver, _, _))...
         Expected: to be called once
           Actual: never called - unsatisfied and active
I1010 18:07:53.546015 30198 master.cpp:1097] Master terminating
*** Aborted at 1476122873 (unix time) try "date -d @1476122873" if you are using GNU date
***
I1010 18:07:53.552243 30228 hierarchical.cpp:517] Removed agent 9ab8c6ea-6cc5-4a89-8a4b-e0f7e463ba65-S0
PC: @                0x0 (unknown)
*** SIGSEGV (@0x0) received by PID 30198 (TID 0x7f0a58309700) from PID 0; stack trace: ***
    @     0x7f0a54a3f2f5 (unknown)
    @     0x7f0a54a43ec1 (unknown)
[  FAILED  ] SlaveTest.KillTaskBetweenRunTaskParts (15056 ms)
[ RUN      ] SlaveTest.KillTaskUnregisteredExecutor
    @     0x7f0a54a381b8 (unknown)
    @     0x7f0a66ce7100 (unknown)
make[4]: *** [check-local] Segmentation fault
make[4]: Leaving directory `/mesos/mesos-1.1.0/_build/src'
make[3]: *** [check-am] Error 2
make[3]: Leaving directory `/mesos/mesos-1.1.0/_build/src'
make[2]: *** [check] Error 2
make[2]: Leaving directory `/mesos/mesos-1.1.0/_build/src'
make[1]: *** [check-recursive] Error 1
make[1]: Leaving directory `/mesos/mesos-1.1.0/_build'
make: *** [distcheck] Error 1
+ docker rmi mesos-1476120761-2444
Untagged: mesos-1476120761-2444:latest
Deleted: sha256:48e43c493104368c8118f55a46111b49069f9d0fdccdce8dc13ff38b241064e7
Deleted: sha256:a2e89c7fe3c8222a2060a28d7c623a0d16e53b7e39755280825ff2feec8b62e6
Deleted: sha256:3fe7fcbb3302e3bf0c15e1d75f47234c0c6880962d60c872bddc35e59f145a02
Deleted: sha256:64fea026f1233c35dd5bc065754891c911b4a58700cdf5110c1d101eba0fcc0d
Deleted: sha256:4983b2ad40599f81224088bcf3be1d32306a868f23a47d98b0d8944797844fbc
Deleted: sha256:91b06e03fb16b9e175bfbb27c285312c9918ffd4964c14c52d3b3531bc3fe66e
Deleted: sha256:3d45027b3a819d69a0b24df40e967ed3075329cacb35e80effcdafd49f26be86
Deleted: sha256:b6a921bbef3be52614cc0a863610176ca21eab8383987972c9b5ace3a2e69797
Deleted: sha256:de09aa1536fd5d6f2abfe3948870e19c6bbdbb5ec4c1cb07d774f91434375332
Deleted: sha256:3d98ea826bdf5830781b45070e99e08c72a9d8e0835a6775d747c6f492f97c0c
Deleted: sha256:2399ef61d46be9a1ece426c2ff0b0382128d7edfb1728e2161ed32c2a74c4249
Deleted: sha256:f401772256afea1060320b51559daf2eeef4c746d6078207a536e4880065524e
Deleted: sha256:1a9973c00d9ba08873107abfcbc82b61718f35cf1f2048158b8d4acd3db8e460
Deleted: sha256:462d1b7fa8fae1075891684385aa7df683427cedd2027f60ce259fff7b5a8030
Deleted: sha256:4e8ffa65a01f8b9d522304c460fa404f340c7fd358dfe42176a3fd765b774f00
Deleted: sha256:a7360be5455bd53c5c67f9d022624002e524c65bf9f2200a0bfe366cad2a960f
Deleted: sha256:5db45ad9f026362ab39324e44fad3ea04c343f2bdc92953f302c5436ae07afa6
Deleted: sha256:116d00712c6259eee822e97317f9a17746c9302695635963a302008dd95fe835
Deleted: sha256:c981da7baca2a480839d37f0cbef3d9520da24c91c400c03c51432507b7f4062
Deleted: sha256:6245cdb9afa490a72dc90e07d8655f6dd875b86f2eba79bef17014fa3eb4296e
Deleted: sha256:ec00ee63fdaf6d86a8092b03988f66bc1954213fd26b538fed7db9e8938f54fb
Deleted: sha256:19fa65790ba57310d324ed3668d5b292ec6f300cbf64989c1a7d665c09855331
Deleted: sha256:e79dd0b9f7f78715bf41c6ef4a1d02124aac76f1cfd03fa2092fea663195e3d9
Deleted: sha256:39bf0efd21bd68ab23d29b5a8bc11ba59c0eaaf33f42f64aff12b13d8d782777
Deleted: sha256:82f1ffe7ccdaa9e22fe58b59864ee907cd256886522bbb81821aea1f98f4294e
Build step 'Execute shell' marked build as failure

Mime
View raw message