mesos-builds mailing list archives

Site index · List index
Message view « Date » · « Thread »
Top « Date » · « Thread »
From Apache Jenkins Server <jenk...@builds.apache.org>
Subject Build failed in Jenkins: Mesos » autotools,gcc,--verbose,GLOG_v=1 MESOS_VERBOSE=1,centos:7,(docker||Hadoop)&&(!ubuntu-us1)&&(!ubuntu-6) #2830
Date Thu, 27 Oct 2016 18:15:06 GMT
See <https://builds.apache.org/job/Mesos/BUILDTOOL=autotools,COMPILER=gcc,CONFIGURATION=--verbose,ENVIRONMENT=GLOG_v=1%20MESOS_VERBOSE=1,OS=centos%3A7,label_exp=(docker%7C%7CHadoop)&&(!ubuntu-us1)&&(!ubuntu-6)/2830/changes>

Changes:

[vinodkone] Show the leading master's information in `/master/state` endpoint.

[vinodkone] Fixed the broken metrics information of master in WebUI.

------------------------------------------
[...truncated 213055 lines...]
I1027 18:14:09.822800 30430 provisioner.cpp:253] Provisioner recovery complete
I1027 18:14:09.823185 30420 slave.cpp:5399] Finished recovery
I1027 18:14:09.824056 30420 slave.cpp:5573] Querying resource estimator for oversubscribable
resources
I1027 18:14:09.824465 30432 slave.cpp:5587] Received oversubscribable resources {} from the
resource estimator
I1027 18:14:09.826601 30427 process.cpp:3570] Handling HTTP event for process 'slave(632)'
with path: '/slave(632)/monitor/statistics.json'
I1027 18:14:09.827659 30427 http.cpp:839] Authorizing principal 'test-principal' to GET the
'/monitor/statistics.json' endpoint
I1027 18:14:09.832908 30424 slave.cpp:787] Agent terminating
I1027 18:14:09.841260 30398 containerizer.cpp:201] Using isolation: posix/cpu,posix/mem,filesystem/posix,network/cni
W1027 18:14:09.842046 30398 backend.cpp:76] Failed to create 'aufs' backend: AufsBackend requires
root privileges, but is running as user mesos
W1027 18:14:09.842219 30398 backend.cpp:76] Failed to create 'bind' backend: BindBackend requires
root privileges
I1027 18:14:09.846267 30427 slave.cpp:208] Mesos agent started on (633)@172.17.0.2:59478
I1027 18:14:09.846307 30427 slave.cpp:209] Flags at startup: --acls="" --appc_simple_discovery_uri_prefix="http://"
--appc_store_dir="/tmp/mesos/store/appc" --authenticate_http_readonly="true" --authenticate_http_readwrite="true"
--authenticatee="crammd5" --authentication_backoff_factor="1secs" --authorizer="local" --cgroups_cpu_enable_pids_and_tids_count="false"
--cgroups_enable_cfs="false" --cgroups_hierarchy="/sys/fs/cgroup" --cgroups_limit_swap="false"
--cgroups_root="mesos" --container_disk_watch_interval="15secs" --containerizers="mesos" --credential="/tmp/Endpoint_SlaveEndpointTest_AuthorizedRequest_2_aEVrk2/credential"
--default_role="*" --disk_watch_interval="1mins" --docker="docker" --docker_kill_orphans="true"
--docker_registry="https://registry-1.docker.io" --docker_remove_delay="6hrs" --docker_socket="/var/run/docker.sock"
--docker_stop_timeout="0ns" --docker_store_dir="/tmp/mesos/store/docker" --docker_volume_checkpoint_dir="/var/run/mesos/isolators/docker/volume"
--enforce_container_disk_quota="false" --executor_registration_timeout="1mins" --executor_shutdown_grace_period="5secs"
--fetcher_cache_dir="/tmp/Endpoint_SlaveEndpointTest_AuthorizedRequest_2_aEVrk2/fetch" --fetcher_cache_size="2GB"
--frameworks_home="" --gc_delay="1weeks" --gc_disk_headroom="0.1" --hadoop_home="" --help="false"
--hostname_lookup="true" --http_authenticators="basic" --http_command_executor="false" --http_credentials="/tmp/Endpoint_SlaveEndpointTest_AuthorizedRequest_2_aEVrk2/http_credentials"
--image_provisioner_backend="copy" --initialize_driver_logging="true" --isolation="posix/cpu,posix/mem"
--launcher="posix" --launcher_dir="/mesos/mesos-1.2.0/_build/src" --logbufsecs="0" --logging_level="INFO"
--max_completed_executors_per_framework="150" --oversubscribed_resources_interval="15secs"
--perf_duration="10secs" --perf_interval="1mins" --qos_correction_interval_min="0ns" --quiet="false"
--recover="reconnect" --recovery_timeout="15mins" --registration_backoff_factor="10ms" --resources="cpus:2;gpus:0;mem:1024;disk:1024;ports:[31000-32000]"
--revocable_cpu_low_priority="true" --runtime_dir="/tmp/Endpoint_SlaveEndpointTest_AuthorizedRequest_2_aEVrk2"
--sandbox_directory="/mnt/mesos/sandbox" --strict="true" --switch_user="true" --systemd_enable_support="true"
--systemd_runtime_directory="/run/systemd/system" --version="false" --work_dir="/tmp/Endpoint_SlaveEndpointTest_AuthorizedRequest_2_3v1h5s"
I1027 18:14:09.846783 30427 credentials.hpp:86] Loading credential for authentication from
'/tmp/Endpoint_SlaveEndpointTest_AuthorizedRequest_2_aEVrk2/credential'
I1027 18:14:09.847000 30427 slave.cpp:346] Agent using credential for: test-principal
I1027 18:14:09.847024 30427 credentials.hpp:37] Loading credentials for authentication from
'/tmp/Endpoint_SlaveEndpointTest_AuthorizedRequest_2_aEVrk2/http_credentials'
I1027 18:14:09.847275 30427 http.cpp:887] Using default 'basic' HTTP authenticator for realm
'mesos-agent-readonly'
I1027 18:14:09.847446 30427 http.cpp:887] Using default 'basic' HTTP authenticator for realm
'mesos-agent-readwrite'
I1027 18:14:09.848417 30427 slave.cpp:533] Agent resources: cpus(*):2; mem(*):1024; disk(*):1024;
ports(*):[31000-32000]
I1027 18:14:09.848500 30427 slave.cpp:541] Agent attributes: [  ]
I1027 18:14:09.848520 30427 slave.cpp:546] Agent hostname: 543acfca2ff7
I1027 18:14:09.850167 30418 state.cpp:57] Recovering state from '/tmp/Endpoint_SlaveEndpointTest_AuthorizedRequest_2_3v1h5s/meta'
I1027 18:14:09.850529 30427 status_update_manager.cpp:203] Recovering status update manager
I1027 18:14:09.850775 30417 containerizer.cpp:557] Recovering containerizer
I1027 18:14:09.852479 30417 provisioner.cpp:253] Provisioner recovery complete
I1027 18:14:09.852960 30425 slave.cpp:5399] Finished recovery
I1027 18:14:09.853802 30425 slave.cpp:5573] Querying resource estimator for oversubscribable
resources
I1027 18:14:09.854245 30425 slave.cpp:5587] Received oversubscribable resources {} from the
resource estimator
I1027 18:14:09.856427 30418 process.cpp:3570] Handling HTTP event for process 'slave(633)'
with path: '/slave(633)/containers'
I1027 18:14:09.858041 30418 http.cpp:839] Authorizing principal 'test-principal' to GET the
'/containers' endpoint
I1027 18:14:09.867915 30398 slave.cpp:787] Agent terminating
I1027 18:14:09.877128 30398 containerizer.cpp:201] Using isolation: posix/cpu,posix/mem,filesystem/posix,network/cni
W1027 18:14:09.877840 30398 backend.cpp:76] Failed to create 'aufs' backend: AufsBackend requires
root privileges, but is running as user mesos
W1027 18:14:09.878029 30398 backend.cpp:76] Failed to create 'bind' backend: BindBackend requires
root privileges
I1027 18:14:09.881882 30431 slave.cpp:208] Mesos agent started on (634)@172.17.0.2:59478
I1027 18:14:09.881914 30431 slave.cpp:209] Flags at startup: --acls="" --appc_simple_discovery_uri_prefix="http://"
--appc_store_dir="/tmp/mesos/store/appc" --authenticate_http_readonly="true" --authenticate_http_readwrite="true"
--authenticatee="crammd5" --authentication_backoff_factor="1secs" --authorizer="local" --cgroups_cpu_enable_pids_and_tids_count="false"
--cgroups_enable_cfs="false" --cgroups_hierarchy="/sys/fs/cgroup" --cgroups_limit_swap="false"
--cgroups_root="mesos" --container_disk_watch_interval="15secs" --containerizers="mesos" --credential="/tmp/Endpoint_SlaveEndpointTest_UnauthorizedRequest_0_pigICj/credential"
--default_role="*" --disk_watch_interval="1mins" --docker="docker" --docker_kill_orphans="true"
--docker_registry="https://registry-1.docker.io" --docker_remove_delay="6hrs" --docker_socket="/var/run/docker.sock"
--docker_stop_timeout="0ns" --docker_store_dir="/tmp/mesos/store/docker" --docker_volume_checkpoint_dir="/var/run/mesos/isolators/docker/volume"
--enforce_container_disk_quota="false" --executor_registration_timeout="1mins" --executor_shutdown_grace_period="5secs"
--fetcher_cache_dir="/tmp/Endpoint_SlaveEndpointTest_UnauthorizedRequest_0_pigICj/fetch" --fetcher_cache_size="2GB"
--frameworks_home="" --gc_delay="1weeks" --gc_disk_headroom="0.1" --hadoop_home="" --help="false"
--hostname_lookup="true" --http_authenticators="basic" --http_command_executor="false" --http_credentials="/tmp/Endpoint_SlaveEndpointTest_UnauthorizedRequest_0_pigICj/http_credentials"
--image_provisioner_backend="copy" --initialize_driver_logging="true" --isolation="posix/cpu,posix/mem"
--launcher="posix" --launcher_dir="/mesos/mesos-1.2.0/_build/src" --logbufsecs="0" --logging_level="INFO"
--max_completed_executors_per_framework="150" --oversubscribed_resources_interval="15secs"
--perf_duration="10secs" --perf_interval="1mins" --qos_correction_interval_min="0ns" --quiet="false"
--recover="reconnect" --recovery_timeout="15mins" --registration_backoff_factor="10ms" --resources="cpus:2;gpus:0;mem:1024;disk:1024;ports:[31000-32000]"
--revocable_cpu_low_priority="true" --runtime_dir="/tmp/Endpoint_SlaveEndpointTest_UnauthorizedRequest_0_pigICj"
--sandbox_directory="/mnt/mesos/sandbox" --strict="true" --switch_user="true" --systemd_enable_support="true"
--systemd_runtime_directory="/run/systemd/system" --version="false" --work_dir="/tmp/Endpoint_SlaveEndpointTest_UnauthorizedRequest_0_X18GhK"
I1027 18:14:09.882364 30431 credentials.hpp:86] Loading credential for authentication from
'/tmp/Endpoint_SlaveEndpointTest_UnauthorizedRequest_0_pigICj/credential'
I1027 18:14:09.882560 30431 slave.cpp:346] Agent using credential for: test-principal
I1027 18:14:09.882582 30431 credentials.hpp:37] Loading credentials for authentication from
'/tmp/Endpoint_SlaveEndpointTest_UnauthorizedRequest_0_pigICj/http_credentials'
I1027 18:14:09.882817 30431 http.cpp:887] Using default 'basic' HTTP authenticator for realm
'mesos-agent-readonly'
I1027 18:14:09.882944 30431 http.cpp:887] Using default 'basic' HTTP authenticator for realm
'mesos-agent-readwrite'
I1027 18:14:09.883980 30431 slave.cpp:533] Agent resources: cpus(*):2; mem(*):1024; disk(*):1024;
ports(*):[31000-32000]
I1027 18:14:09.884055 30431 slave.cpp:541] Agent attributes: [  ]
I1027 18:14:09.884094 30431 slave.cpp:546] Agent hostname: 543acfca2ff7
I1027 18:14:09.885567 30430 state.cpp:57] Recovering state from '/tmp/Endpoint_SlaveEndpointTest_UnauthorizedRequest_0_X18GhK/meta'
I1027 18:14:09.885900 30430 status_update_manager.cpp:203] Recovering status update manager
I1027 18:14:09.886121 30430 containerizer.cpp:557] Recovering containerizer
I1027 18:14:09.887488 30432 provisioner.cpp:253] Provisioner recovery complete
I1027 18:14:09.888080 30417 slave.cpp:5399] Finished recovery
I1027 18:14:09.888880 30417 slave.cpp:5573] Querying resource estimator for oversubscribable
resources
I1027 18:14:09.889227 30417 slave.cpp:5587] Received oversubscribable resources {} from the
resource estimator
I1027 18:14:09.891489 30430 process.cpp:3570] Handling HTTP event for process 'slave(634)'
with path: '/slave(634)/monitor/statistics'
I1027 18:14:09.892498 30425 http.cpp:839] Authorizing principal 'test-principal' to GET the
'/monitor/statistics' endpoint
I1027 18:14:09.894668 30398 slave.cpp:787] Agent terminating
I1027 18:14:09.902458 30398 containerizer.cpp:201] Using isolation: posix/cpu,posix/mem,filesystem/posix,network/cni
W1027 18:14:09.903069 30398 backend.cpp:76] Failed to create 'aufs' backend: AufsBackend requires
root privileges, but is running as user mesos
W1027 18:14:09.903240 30398 backend.cpp:76] Failed to create 'bind' backend: BindBackend requires
root privileges
I1027 18:14:09.907341 30430 slave.cpp:208] Mesos agent started on (635)@172.17.0.2:59478
I1027 18:14:09.907388 30430 slave.cpp:209] Flags at startup: --acls="" --appc_simple_discovery_uri_prefix="http://"
--appc_store_dir="/tmp/mesos/store/appc" --authenticate_http_readonly="true" --authenticate_http_readwrite="true"
--authenticatee="crammd5" --authentication_backoff_factor="1secs" --authorizer="local" --cgroups_cpu_enable_pids_and_tids_count="false"
--cgroups_enable_cfs="false" --cgroups_hierarchy="/sys/fs/cgroup" --cgroups_limit_swap="false"
--cgroups_root="mesos" --container_disk_watch_interval="15secs" --containerizers="mesos" --credential="/tmp/Endpoint_SlaveEndpointTest_UnauthorizedRequest_1_gXF7cB/credential"
--default_role="*" --disk_watch_interval="1mins" --docker="docker" --docker_kill_orphans="true"
--docker_registry="https://registry-1.docker.io" --docker_remove_delay="6hrs" --docker_socket="/var/run/docker.sock"
--docker_stop_timeout="0ns" --docker_store_dir="/tmp/mesos/store/docker" --docker_volume_checkpoint_dir="/var/run/mesos/isolators/docker/volume"
--enforce_container_disk_quota="false" --executor_registration_timeout="1mins" --executor_shutdown_grace_period="5secs"
--fetcher_cache_dir="/tmp/Endpoint_SlaveEndpointTest_UnauthorizedRequest_1_gXF7cB/fetch" --fetcher_cache_size="2GB"
--frameworks_home="" --gc_delay="1weeks" --gc_disk_headroom="0.1" --hadoop_home="" --help="false"
--hostname_lookup="true" --http_authenticators="basic" --http_command_executor="false" --http_credentials="/tmp/Endpoint_SlaveEndpointTest_UnauthorizedRequest_1_gXF7cB/http_credentials"
--image_provisioner_backend="copy" --initialize_driver_logging="true" --isolation="posix/cpu,posix/mem"
--launcher="posix" --launcher_dir="/mesos/mesos-1.2.0/_build/src" --logbufsecs="0" --logging_level="INFO"
--max_completed_executors_per_framework="150" --oversubscribed_resources_interval="15secs"
--perf_duration="10secs" --perf_interval="1mins" --qos_correction_interval_min="0ns" --quiet="false"
--recover="reconnect" --recovery_timeout="15mins" --registration_backoff_factor="10ms" --resources="cpus:2;gpus:0;mem:1024;disk:1024;ports:[31000-32000]"
--revocable_cpu_low_priority="true" --runtime_dir="/tmp/Endpoint_SlaveEndpointTest_UnauthorizedRequest_1_gXF7cB"
--sandbox_directory="/mnt/mesos/sandbox" --strict="true" --switch_user="true" --systemd_enable_support="true"
--systemd_runtime_directory="/run/systemd/system" --version="false" --work_dir="/tmp/Endpoint_SlaveEndpointTest_UnauthorizedRequest_1_UR7WN1"
I1027 18:14:09.907951 30430 credentials.hpp:86] Loading credential for authentication from
'/tmp/Endpoint_SlaveEndpointTest_UnauthorizedRequest_1_gXF7cB/credential'
I1027 18:14:09.908174 30430 slave.cpp:346] Agent using credential for: test-principal
I1027 18:14:09.908197 30430 credentials.hpp:37] Loading credentials for authentication from
'/tmp/Endpoint_SlaveEndpointTest_UnauthorizedRequest_1_gXF7cB/http_credentials'
I1027 18:14:09.908440 30430 http.cpp:887] Using default 'basic' HTTP authenticator for realm
'mesos-agent-readonly'
I1027 18:14:09.908620 30430 http.cpp:887] Using default 'basic' HTTP authenticator for realm
'mesos-agent-readwrite'
I1027 18:14:09.909610 30430 slave.cpp:533] Agent resources: cpus(*):2; mem(*):1024; disk(*):1024;
ports(*):[31000-32000]
I1027 18:14:09.909693 30430 slave.cpp:541] Agent attributes: [  ]
I1027 18:14:09.909713 30430 slave.cpp:546] Agent hostname: 543acfca2ff7
I1027 18:14:09.911346 30417 state.cpp:57] Recovering state from '/tmp/Endpoint_SlaveEndpointTest_UnauthorizedRequest_1_UR7WN1/meta'
I1027 18:14:09.911618 30428 status_update_manager.cpp:203] Recovering status update manager
I1027 18:14:09.915802 30426 containerizer.cpp:557] Recovering containerizer
I1027 18:14:09.917278 30423 provisioner.cpp:253] Provisioner recovery complete
I1027 18:14:09.917642 30426 slave.cpp:5399] Finished recovery
I1027 18:14:09.918447 30426 slave.cpp:5573] Querying resource estimator for oversubscribable
resources
I1027 18:14:09.918798 30432 slave.cpp:5587] Received oversubscribable resources {} from the
resource estimator
I1027 18:14:09.920913 30421 process.cpp:3570] Handling HTTP event for process 'slave(635)'
with path: '/slave(635)/monitor/statistics.json'
I1027 18:14:09.921847 30419 http.cpp:839] Authorizing principal 'test-principal' to GET the
'/monitor/statistics.json' endpoint
I1027 18:14:09.924918 30426 slave.cpp:787] Agent terminating
I1027 18:14:09.934272 30398 containerizer.cpp:201] Using isolation: posix/cpu,posix/mem,filesystem/posix,network/cni
W1027 18:14:09.934891 30398 backend.cpp:76] Failed to create 'aufs' backend: AufsBackend requires
root privileges, but is running as user mesos
W1027 18:14:09.935045 30398 backend.cpp:76] Failed to create 'bind' backend: BindBackend requires
root privileges
I1027 18:14:09.937873 30419 slave.cpp:208] Mesos agent started on (636)@172.17.0.2:59478
I1027 18:14:09.937912 30419 slave.cpp:209] Flags at startup: --acls="" --appc_simple_discovery_uri_prefix="http://"
--appc_store_dir="/tmp/mesos/store/appc" --authenticate_http_readonly="true" --authenticate_http_readwrite="true"
--authenticatee="crammd5" --authentication_backoff_factor="1secs" --authorizer="local" --cgroups_cpu_enable_pids_and_tids_count="false"
--cgroups_enable_cfs="false" --cgroups_hierarchy="/sys/fs/cgroup" --cgroups_limit_swap="false"
--cgroups_root="mesos" --container_disk_watch_interval="15secs" --containerizers="mesos" --credential="/tmp/Endpoint_SlaveEndpointTest_UnauthorizedRequest_2_W5LH7S/credential"
--default_role="*" --disk_watch_interval="1mins" --docker="docker" --docker_kill_orphans="true"
--docker_registry="https://registry-1.docker.io" --docker_remove_delay="6hrs" --docker_socket="/var/run/docker.sock"
--docker_stop_timeout="0ns" --docker_store_dir="/tmp/mesos/store/docker" --docker_volume_checkpoint_dir="/var/run/mesos/isolators/docker/volume"
--enforce_container_disk_quota="false" --executor_registration_timeout="1mins" --executor_shutdown_grace_period="5secs"
--fetcher_cache_dir="/tmp/Endpoint_SlaveEndpointTest_UnauthorizedRequest_2_W5LH7S/fetch" --fetcher_cache_size="2GB"
--frameworks_home="" --gc_delay="1weeks" --gc_disk_headroom="0.1" --hadoop_home="" --help="false"
--hostname_lookup="true" --http_authenticators="basic" --http_command_executor="false" --http_credentials="/tmp/Endpoint_SlaveEndpointTest_UnauthorizedRequest_2_W5LH7S/http_credentials"
--image_provisioner_backend="copy" --initialize_driver_logging="true" --isolation="posix/cpu,posix/mem"
--launcher="posix" --launcher_dir="/mesos/mesos-1.2.0/_build/src" --logbufsecs="0" --logging_level="INFO"
--max_completed_executors_per_framework="150" --oversubscribed_resources_interval="15secs"
--perf_duration="10secs" --perf_interval="1mins" --qos_correction_interval_min="0ns" --quiet="false"
--recover="reconnect" --recovery_timeout="15mins" --registration_backoff_factor="10ms" --resources="cpus:2;gpus:0;mem:1024;disk:1024;ports:[31000-32000]"
--revocable_cpu_low_priority="true" --runtime_dir="/tmp/Endpoint_SlaveEndpointTest_UnauthorizedRequest_2_W5LH7S"
--sandbox_directory="/mnt/mesos/sandbox" --strict="true" --switch_user="true" --systemd_enable_support="true"
--systemd_runtime_directory="/run/systemd/system" --version="false" --work_dir="/tmp/Endpoint_SlaveEndpointTest_UnauthorizedRequest_2_XxBpDj"
I1027 18:14:09.938434 30419 credentials.hpp:86] Loading credential for authentication from
'/tmp/Endpoint_SlaveEndpointTest_UnauthorizedRequest_2_W5LH7S/credential'
I1027 18:14:09.938618 30419 slave.cpp:346] Agent using credential for: test-principal
I1027 18:14:09.938638 30419 credentials.hpp:37] Loading credentials for authentication from
'/tmp/Endpoint_SlaveEndpointTest_UnauthorizedRequest_2_W5LH7S/http_credentials'
I1027 18:14:09.938839 30419 http.cpp:887] Using default 'basic' HTTP authenticator for realm
'mesos-agent-readonly'
I1027 18:14:09.938977 30419 http.cpp:887] Using default 'basic' HTTP authenticator for realm
'mesos-agent-readwrite'
I1027 18:14:09.940011 30419 slave.cpp:533] Agent resources: cpus(*):2; mem(*):1024; disk(*):1024;
ports(*):[31000-32000]
I1027 18:14:09.940088 30419 slave.cpp:541] Agent attributes: [  ]
I1027 18:14:09.940109 30419 slave.cpp:546] Agent hostname: 543acfca2ff7
I1027 18:14:09.941614 30429 state.cpp:57] Recovering state from '/tmp/Endpoint_SlaveEndpointTest_UnauthorizedRequest_2_XxBpDj/meta'
I1027 18:14:09.941874 30423 status_update_manager.cpp:203] Recovering status update manager
I1027 18:14:09.942095 30428 containerizer.cpp:557] Recovering containerizer
I1027 18:14:09.943351 30421 provisioner.cpp:253] Provisioner recovery complete
I1027 18:14:09.944036 30430 slave.cpp:5399] Finished recovery
I1027 18:14:09.944618 30430 slave.cpp:5573] Querying resource estimator for oversubscribable
resources
I1027 18:14:09.944931 30430 slave.cpp:5587] Received oversubscribable resources {} from the
resource estimator
I1027 18:14:09.947058 30423 process.cpp:3570] Handling HTTP event for process 'slave(636)'
with path: '/slave(636)/containers'
I1027 18:14:09.948207 30423 http.cpp:839] Authorizing principal 'test-principal' to GET the
'/containers' endpoint
I1027 18:14:09.951237 30427 slave.cpp:787] Agent terminating
I1027 18:14:09.965085 30398 containerizer.cpp:201] Using isolation: posix/cpu,posix/mem,filesystem/posix,network/cni
W1027 18:14:09.965967 30398 backend.cpp:76] Failed to create 'aufs' backend: AufsBackend requires
root privileges, but is running as user mesos
W1027 18:14:09.966152 30398 backend.cpp:76] Failed to create 'bind' backend: BindBackend requires
root privileges
I1027 18:14:09.967978 30398 cluster.cpp:435] Creating default 'local' authorizer
I1027 18:14:09.970345 30424 slave.cpp:208] Mesos agent started on (637)@172.17.0.2:59478
I1027 18:14:09.970382 30424 slave.cpp:209] Flags at startup: --acls="" --appc_simple_discovery_uri_prefix="http://"
--appc_store_dir="/tmp/mesos/store/appc" --authenticate_http_readonly="true" --authenticate_http_readwrite="true"
--authenticatee="crammd5" --authentication_backoff_factor="1secs" --authorizer="local" --cgroups_cpu_enable_pids_and_tids_count="false"
--cgroups_enable_cfs="false" --cgroups_hierarchy="/sys/fs/cgroup" --cgroups_limit_swap="false"
--cgroups_root="mesos" --container_disk_watch_interval="15secs" --containerizers="mesos" --credential="/tmp/Endpoint_SlaveEndpointTest_NoAuthorizer_0_mJKskb/credential"
--default_role="*" --disk_watch_interval="1mins" --docker="docker" --docker_kill_orphans="true"
--docker_registry="https://registry-1.docker.io" --docker_remove_delay="6hrs" --docker_socket="/var/run/docker.sock"
--docker_stop_timeout="0ns" --docker_store_dir="/tmp/mesos/store/docker" --docker_volume_checkpoint_dir="/var/run/mesos/isolators/docker/volume"
--enforce_container_disk_quota="false" --executor_registration_timeout="1mins" --executor_shutdown_grace_period="5secs"
--fetcher_cache_dir="/tmp/Endpoint_SlaveEndpointTest_NoAuthorizer_0_mJKskb/fetch" --fetcher_cache_size="2GB"
--frameworks_home="" --gc_delay="1weeks" --gc_disk_headroom="0.1" --hadoop_home="" --help="false"
--hostname_lookup="true" --http_authenticators="basic" --http_command_executor="false" --http_credentials="/tmp/Endpoint_SlaveEndpointTest_NoAuthorizer_0_mJKskb/http_credentials"
--image_provisioner_backend="copy" --initialize_driver_logging="true" --isolation="posix/cpu,posix/mem"
--launcher="posix" --launcher_dir="/mesos/mesos-1.2.0/_build/src" --logbufsecs="0" --logging_level="INFO"
--max_completed_executors_per_framework="150" --oversubscribed_resources_interval="15secs"
--perf_duration="10secs" --perf_interval="1mins" --qos_correction_interval_min="0ns" --quiet="false"
--recover="reconnect" --recovery_timeout="15mins" --registration_backoff_factor="10ms" --resources="cpus:2;gpus:0;mem:1024;disk:1024;ports:[31000-32000]"
--revocable_cpu_low_priority="true" --runtime_dir="/tmp/Endpoint_SlaveEndpointTest_NoAuthorizer_0_mJKskb"
--sandbox_directory="/mnt/mesos/sandbox" --strict="true" --switch_user="true" --systemd_enable_support="true"
--systemd_runtime_directory="/run/systemd/system" --version="false" --work_dir="/tmp/Endpoint_SlaveEndpointTest_NoAuthorizer_0_TqHtLB"
I1027 18:14:09.970842 30424 credentials.hpp:86] Loading credential for authentication from
'/tmp/Endpoint_SlaveEndpointTest_NoAuthorizer_0_mJKskb/credential'
I1027 18:14:09.971091 30424 slave.cpp:346] Agent using credential for: test-principal
I1027 18:14:09.971117 30424 credentials.hpp:37] Loading credentials for authentication from
'/tmp/Endpoint_SlaveEndpointTest_NoAuthorizer_0_mJKskb/http_credentials'
I1027 18:14:09.971441 30424 http.cpp:887] Using default 'basic' HTTP authenticator for realm
'mesos-agent-readonly'
I1027 18:14:09.971657 30424 http.cpp:887] Using default 'basic' HTTP authenticator for realm
'mesos-agent-readwrite'
I1027 18:14:09.972684 30424 slave.cpp:533] Agent resources: cpus(*):2; mem(*):1024; disk(*):1024;
ports(*):[31000-32000]
I1027 18:14:09.972769 30424 slave.cpp:541] Agent attributes: [  ]
I1027 18:14:09.972789 30424 slave.cpp:546] Agent hostname: 543acfca2ff7
I1027 18:14:09.974409 30422 state.cpp:57] Recovering state from '/tmp/Endpoint_SlaveEndpointTest_NoAuthorizer_0_TqHtLB/meta'
I1027 18:14:09.974751 30423 status_update_manager.cpp:203] Recovering status update manager
I1027 18:14:09.975023 30432 containerizer.cpp:557] Recovering containerizer
I1027 18:14:09.976413 30420 provisioner.cpp:253] Provisioner recovery complete
I1027 18:14:09.976804 30432 slave.cpp:5399] Finished recovery
I1027 18:14:09.977465 30432 slave.cpp:5573] Querying resource estimator for oversubscribable
resources
I1027 18:14:09.977846 30426 slave.cpp:5587] Received oversubscribable resources {} from the
resource estimator
I1027 18:14:09.979926 30420 process.cpp:3570] Handling HTTP event for process 'slave(637)'
with path: '/slave(637)/monitor/statistics'
I1027 18:14:09.981086 30430 http.cpp:839] Authorizing principal 'test-principal' to GET the
'/monitor/statistics' endpoint
I1027 18:14:09.985018 30426 slave.cpp:787] Agent terminating
I1027 18:14:10.000540 30398 containerizer.cpp:201] Using isolation: posix/cpu,posix/mem,filesystem/posix,network/cni
W1027 18:14:10.001207 30398 backend.cpp:76] Failed to create 'aufs' backend: AufsBackend requires
root privileges, but is running as user mesos
W1027 18:14:10.001374 30398 backend.cpp:76] Failed to create 'bind' backend: BindBackend requires
root privileges
I1027 18:14:10.002739 30398 cluster.cpp:435] Creating default 'local' authorizer
I1027 18:14:10.005594 30427 slave.cpp:208] Mesos agent started on (638)@172.17.0.2:59478
I1027 18:14:10.005630 30427 slave.cpp:209] Flags at startup: --acls="" --appc_simple_discovery_uri_prefix="http://"
--appc_store_dir="/tmp/mesos/store/appc" --authenticate_http_readonly="true" --authenticate_http_readwrite="true"
--authenticatee="crammd5" --authentication_backoff_factor="1secs" --authorizer="local" --cgroups_cpu_enable_pids_and_tids_count="false"
--cgroups_enable_cfs="false" --cgroups_hierarchy="/sys/fs/cgroup" --cgroups_limit_swap="false"
--cgroups_root="mesos" --container_disk_watch_interval="15secs" --containerizers="mesos" --credential="/tmp/Endpoint_SlaveEndpointTest_NoAuthorizer_1_l6EAUt/credential"
--default_role="*" --disk_watch_interval="1mins" --docker="docker" --docker_kill_orphans="true"
--docker_registry="https://registry-1.docker.io" --docker_remove_delay="6hrs" --docker_socket="/var/run/docker.sock"
--docker_stop_timeout="0ns" --docker_store_dir="/tmp/mesos/store/docker" --docker_volume_checkpoint_dir="/var/run/mesos/isolators/docker/volume"
--enforce_container_disk_quota="false" --executor_registration_timeout="1mins" --executor_shutdown_grace_period="5secs"
--fetcher_cache_dir="/tmp/Endpoint_SlaveEndpointTest_NoAuthorizer_1_l6EAUt/fetch" --fetcher_cache_size="2GB"
--frameworks_home="" --gc_delay="1weeks" --gc_disk_headroom="0.1" --hadoop_home="" --help="false"
--hostname_lookup="true" --http_authenticators="basic" --http_command_executor="false" --http_credentials="/tmp/Endpoint_SlaveEndpointTest_NoAuthorizer_1_l6EAUt/http_credentials"
--image_provisioner_backend="copy" --initialize_driver_logging="true" --isolation="posix/cpu,posix/mem"
--launcher="posix" --launcher_dir="/mesos/mesos-1.2.0/_build/src" --logbufsecs="0" --logging_level="INFO"
--max_completed_executors_per_framework="150" --oversubscribed_resources_interval="15secs"
--perf_duration="10secs" --perf_interval="1mins" --qos_correction_interval_min="0ns" --quiet="false"
--recover="reconnect" --recovery_timeout="15mins" --registration_backoff_factor="10ms" --resources="cpus:2;gpus:0;mem:1024;disk:1024;ports:[31000-32000]"
--revocable_cpu_low_priority="true" --runtime_dir="/tmp/Endpoint_SlaveEndpointTest_NoAuthorizer_1_l6EAUt"
--sandbox_directory="/mnt/mesos/sandbox" --strict="true" --switch_user="true" --systemd_enable_support="true"
--systemd_runtime_directory="/run/systemd/system" --version="false" --work_dir="/tmp/Endpoint_SlaveEndpointTest_NoAuthorizer_1_1S5CfU"
I1027 18:14:10.006108 30427 credentials.hpp:86] Loading credential for authentication from
'/tmp/Endpoint_SlaveEndpointTest_NoAuthorizer_1_l6EAUt/credential'
I1027 18:14:10.006323 30427 slave.cpp:346] Agent using credential for: test-principal
I1027 18:14:10.006347 30427 credentials.hpp:37] Loading credentials for authentication from
'/tmp/Endpoint_SlaveEndpointTest_NoAuthorizer_1_l6EAUt/http_credentials'
I1027 18:14:10.006583 30427 http.cpp:887] Using default 'basic' HTTP authenticator for realm
'mesos-agent-readonly'
I1027 18:14:10.006726 30427 http.cpp:887] Using default 'basic' HTTP authenticator for realm
'mesos-agent-readwrite'
I1027 18:14:10.007792 30427 slave.cpp:533] Agent resources: cpus(*):2; mem(*):1024; disk(*):1024;
ports(*):[31000-32000]
I1027 18:14:10.007876 30427 slave.cpp:541] Agent attributes: [  ]
I1027 18:14:10.007895 30427 slave.cpp:546] Agent hostname: 543acfca2ff7
I1027 18:14:10.009464 30419 state.cpp:57] Recovering state from '/tmp/Endpoint_SlaveEndpointTest_NoAuthorizer_1_1S5CfU/meta'
I1027 18:14:10.009743 30427 status_update_manager.cpp:203] Recovering status update manager
I1027 18:14:10.010015 30427 containerizer.cpp:557] Recovering containerizer
I1027 18:14:10.011603 30419 provisioner.cpp:253] Provisioner recovery complete
I1027 18:14:10.012017 30419 slave.cpp:5399] Finished recovery
I1027 18:14:10.012717 30419 slave.cpp:5573] Querying resource estimator for oversubscribable
resources
I1027 18:14:10.013059 30419 slave.cpp:5587] Received oversubscribable resources {} from the
resource estimator
I1027 18:14:10.021222 30422 process.cpp:3570] Handling HTTP event for process 'slave(638)'
with path: '/slave(638)/monitor/statistics.json'
I1027 18:14:10.022580 30422 http.cpp:839] Authorizing principal 'test-principal' to GET the
'/monitor/statistics.json' endpoint
I1027 18:14:10.027221 30398 slave.cpp:787] Agent terminating
I1027 18:14:10.036119 30398 containerizer.cpp:201] Using isolation: posix/cpu,posix/mem,filesystem/posix,network/cni
W1027 18:14:10.036748 30398 backend.cpp:76] Failed to create 'aufs' backend: AufsBackend requires
root privileges, but is running as user mesos
W1027 18:14:10.036929 30398 backend.cpp:76] Failed to create 'bind' backend: BindBackend requires
root privileges
I1027 18:14:10.038305 30398 cluster.cpp:435] Creating default 'local' authorizer
I1027 18:14:10.040971 30423 slave.cpp:208] Mesos agent started on (639)@172.17.0.2:59478
I1027 18:14:10.040997 30423 slave.cpp:209] Flags at startup: --acls="" --appc_simple_discovery_uri_prefix="http://"
--appc_store_dir="/tmp/mesos/store/appc" --authenticate_http_readonly="true" --authenticate_http_readwrite="true"
--authenticatee="crammd5" --authentication_backoff_factor="1secs" --authorizer="local" --cgroups_cpu_enable_pids_and_tids_count="false"
--cgroups_enable_cfs="false" --cgroups_hierarchy="/sys/fs/cgroup" --cgroups_limit_swap="false"
--cgroups_root="mesos" --container_disk_watch_interval="15secs" --containerizers="mesos" --credential="/tmp/Endpoint_SlaveEndpointTest_NoAuthorizer_2_ehF8RM/credential"
--default_role="*" --disk_watch_interval="1mins" --docker="docker" --docker_kill_orphans="true"
--docker_registry="https://registry-1.docker.io" --docker_remove_delay="6hrs" --docker_socket="/var/run/docker.sock"
--docker_stop_timeout="0ns" --docker_store_dir="/tmp/mesos/store/docker" --docker_volume_checkpoint_dir="/var/run/mesos/isolators/docker/volume"
--enforce_container_disk_quota="false" --executor_registration_timeout="1mins" --executor_shutdown_grace_period="5secs"
--fetcher_cache_dir="/tmp/Endpoint_SlaveEndpointTest_NoAuthorizer_2_ehF8RM/fetch" --fetcher_cache_size="2GB"
--frameworks_home="" --gc_delay="1weeks" --gc_disk_headroom="0.1" --hadoop_home="" --help="false"
--hostname_lookup="true" --http_authenticators="basic" --http_command_executor="false" --http_credentials="/tmp/Endpoint_SlaveEndpointTest_NoAuthorizer_2_ehF8RM/http_credentials"
--image_provisioner_backend="copy" --initialize_driver_logging="true" --isolation="posix/cpu,posix/mem"
--launcher="posix" --launcher_dir="/mesos/mesos-1.2.0/_build/src" --logbufsecs="0" --logging_level="INFO"
--max_completed_executors_per_framework="150" --oversubscribed_resources_interval="15secs"
--perf_duration="10secs" --perf_interval="1mins" --qos_correction_interval_min="0ns" --quiet="false"
--recover="reconnect" --recovery_timeout="15mins" --registration_backoff_factor="10ms" --resources="cpus:2;gpus:0;mem:1024;disk:1024;ports:[31000-32000]"
--revocable_cpu_low_priority="true" --runtime_dir="/tmp/Endpoint_SlaveEndpointTest_NoAuthorizer_2_ehF8RM"
--sandbox_directory="/mnt/mesos/sandbox" --strict="true" --switch_user="true" --systemd_enable_support="true"
--systemd_runtime_directory="/run/systemd/system" --version="false" --work_dir="/tmp/Endpoint_SlaveEndpointTest_NoAuthorizer_2_9rRi7c"
I1027 18:14:10.041574 30423 credentials.hpp:86] Loading credential for authentication from
'/tmp/Endpoint_SlaveEndpointTest_NoAuthorizer_2_ehF8RM/credential'
I1027 18:14:10.041810 30423 slave.cpp:346] Agent using credential for: test-principal
I1027 18:14:10.041836 30423 credentials.hpp:37] Loading credentials for authentication from
'/tmp/Endpoint_SlaveEndpointTest_NoAuthorizer_2_ehF8RM/http_credentials'
I1027 18:14:10.042109 30423 http.cpp:887] Using default 'basic' HTTP authenticator for realm
'mesos-agent-readonly'
I1027 18:14:10.042251 30423 http.cpp:887] Using default 'basic' HTTP authenticator for realm
'mesos-agent-readwrite'
I1027 18:14:10.043491 30423 slave.cpp:533] Agent resources: cpus(*):2; mem(*):1024; disk(*):1024;
ports(*):[31000-32000]
I1027 18:14:10.043588 30423 slave.cpp:541] Agent attributes: [  ]
I1027 18:14:10.043603 30423 slave.cpp:546] Agent hostname: 543acfca2ff7
I1027 18:14:10.045308 30417 state.cpp:57] Recovering state from '/tmp/Endpoint_SlaveEndpointTest_NoAuthorizer_2_9rRi7c/meta'
I1027 18:14:10.045663 30418 status_update_manager.cpp:203] Recovering status update manager
I1027 18:14:10.045863 30429 containerizer.cpp:557] Recovering containerizer
I1027 18:14:10.047513 30426 provisioner.cpp:253] Provisioner recovery complete
I1027 18:14:10.047986 30420 slave.cpp:5399] Finished recovery
I1027 18:14:10.048679 30420 slave.cpp:5573] Querying resource estimator for oversubscribable
resources
I1027 18:14:10.049080 30426 slave.cpp:5587] Received oversubscribable resources {} from the
resource estimator
I1027 18:14:10.051817 30426 process.cpp:3570] Handling HTTP event for process 'slave(639)'
with path: '/slave(639)/containers'
I1027 18:14:10.053191 30426 http.cpp:839] Authorizing principal 'test-principal' to GET the
'/containers' endpoint
I1027 18:14:10.058434 30398 slave.cpp:787] Agent terminating
make[4]: *** [check-local] Error 1
make[3]: *** [check-am] Error 2
make[2]: *** [check] Error 2
make[1]: *** [check-recursive] Error 1
make: *** [distcheck] Error 1
[       OK ] ContentType/SchedulerTest.Message/1 (179 ms)
[ RUN      ] ContentType/SchedulerTest.Request/0
[       OK ] ContentType/SchedulerTest.Request/0 (75 ms)
[ RUN      ] ContentType/SchedulerTest.Request/1
[       OK ] ContentType/SchedulerTest.Request/1 (82 ms)
[ RUN      ] ContentType/SchedulerTest.SchedulerReconnect/0
[       OK ] ContentType/SchedulerTest.SchedulerReconnect/0 (68 ms)
[ RUN      ] ContentType/SchedulerTest.SchedulerReconnect/1
[       OK ] ContentType/SchedulerTest.SchedulerReconnect/1 (73 ms)
[----------] 32 tests from ContentType/SchedulerTest (4285 ms total)

[----------] 9 tests from Endpoint/SlaveEndpointTest
[ RUN      ] Endpoint/SlaveEndpointTest.AuthorizedRequest/0
[       OK ] Endpoint/SlaveEndpointTest.AuthorizedRequest/0 (33 ms)
[ RUN      ] Endpoint/SlaveEndpointTest.AuthorizedRequest/1
[       OK ] Endpoint/SlaveEndpointTest.AuthorizedRequest/1 (31 ms)
[ RUN      ] Endpoint/SlaveEndpointTest.AuthorizedRequest/2
[       OK ] Endpoint/SlaveEndpointTest.AuthorizedRequest/2 (36 ms)
[ RUN      ] Endpoint/SlaveEndpointTest.UnauthorizedRequest/0
[       OK ] Endpoint/SlaveEndpointTest.UnauthorizedRequest/0 (25 ms)
[ RUN      ] Endpoint/SlaveEndpointTest.UnauthorizedRequest/1
[       OK ] Endpoint/SlaveEndpointTest.UnauthorizedRequest/1 (31 ms)
[ RUN      ] Endpoint/SlaveEndpointTest.UnauthorizedRequest/2
[       OK ] Endpoint/SlaveEndpointTest.UnauthorizedRequest/2 (28 ms)
[ RUN      ] Endpoint/SlaveEndpointTest.NoAuthorizer/0
[       OK ] Endpoint/SlaveEndpointTest.NoAuthorizer/0 (37 ms)
[ RUN      ] Endpoint/SlaveEndpointTest.NoAuthorizer/1
[       OK ] Endpoint/SlaveEndpointTest.NoAuthorizer/1 (36 ms)
[ RUN      ] Endpoint/SlaveEndpointTest.NoAuthorizer/2
[       OK ] Endpoint/SlaveEndpointTest.NoAuthorizer/2 (33 ms)
[----------] 9 tests from Endpoint/SlaveEndpointTest (293 ms total)

[----------] Global test environment tear-down
[==========] 1362 tests from 154 test cases ran. (494673 ms total)
[  PASSED  ] 1361 tests.
[  FAILED  ] 1 test, listed below:
[  FAILED  ] DiskResource/PersistentVolumeTest.SharedPersistentVolumeRescindOnDestroy/0, where
GetParam() = 0

 1 FAILED TEST
  YOU HAVE 5 DISABLED TESTS

make[4]: Leaving directory `/mesos/mesos-1.2.0/_build/src'
make[3]: Leaving directory `/mesos/mesos-1.2.0/_build/src'
make[2]: Leaving directory `/mesos/mesos-1.2.0/_build/src'
make[1]: Leaving directory `/mesos/mesos-1.2.0/_build'
+ docker rmi mesos-1477589924-19940
Untagged: mesos-1477589924-19940:latest
Deleted: sha256:10e28354331d5ef5c52c340788e6e33d5232df5018475cc4e0e3938d1cb35a0c
Deleted: sha256:0d04b790ea3889e803ddafd4ba7f448d9abe0fcc751f7b9c4f19b5967b79c91e
Deleted: sha256:4bc7823ccf7d01848d70ac6338a1489c628dc8b2320234db9dd8e45aa247c2f5
Deleted: sha256:c29d51938666afd30bf5bdc1c25652ce2eb1e249d7747225b3a7663a367bcc92
Deleted: sha256:c0e117232e0bad49991fab652c275a398b506b1f75050b64e9caabc250cc0160
Deleted: sha256:701efa3b28112dcd6a8fc40294bf74c796397b713992b3a66cc1dfe005433188
Deleted: sha256:81a3628566d9b4f00709d1b49645de6e9802abad62732fad607ab1aa904e957c
Deleted: sha256:aca2523f7d2dd2ab06a2f2af0b401259345c216269f717c8419f06ade6c1c012
Deleted: sha256:486d5af36a5a80159de636e7e13503032df3e2049ed9ede28f7fdaa0102344af
Deleted: sha256:ffa1ac0be4fefb4198740e0b4f01b0c2e2d94100a1a60075660894d4ea8bc4b6
Deleted: sha256:0a8d0c49ddfb8974d85ab21ace45ea7eab14f9ed58e11246c471d8c8e858fa80
Deleted: sha256:f29c001ed5d2d3e0d69b98f449edbdffde12d37c9e463bf8d10dee8c91b2a3d5
Deleted: sha256:4fead44f3bd2c0d1cebc18057ac8e52b96cc5d50a5cd14da0db2082da25a7b6d
Deleted: sha256:662ee8fef0ba9bc435188bcbea24c80502c1ea4f505e7078122df3e448fb45a1
Deleted: sha256:71602dd07d5323bdafd1263e52e03205538bf9eeab44925f9e9266abf768b6fd
Deleted: sha256:0320d1f5ecdc69a6c3705d3d26324905ebb1ef98e35ef68ab96f5fdeb4f5bb92
Deleted: sha256:239a3c231e05a053362fc98228504d579f94589b37545383790abdb34eb0e9ab
Deleted: sha256:f4fadb482018eda60a538120e8449c7ea453dc3bd67f262481ee159adeee01fd
Deleted: sha256:c8b97599dea79905cbd68b2fc8f0bcdf3a15a5aef81dba77158bbfdb2a8c5b56
Deleted: sha256:e4d50df76c2c594ba676d8c97c03e19f18a968317dfdba85dc7d5e39810dd9e1
Deleted: sha256:16ed59c862689583bba67cd3df23c1da9cffcc70d1a52823c892590109ea6c13
Deleted: sha256:74f6630b27c120ec09299a8be73a068fb539c8616157bcb21fc51396bf44b2f8
Deleted: sha256:0f9494ed5f3d22b5ae2a56a7cd12479391db43e478a1814f237288bca0b05349
Deleted: sha256:ab51bef1eb16f650050e93a10d421aba11ae0c1d6be07c15e37e14a02b3b6057
Deleted: sha256:ef981de4e7c08063411984cb1c6fb4ed936bf99bd2bedf0c53c5107167b2cb28
Build step 'Execute shell' marked build as failure

Mime
View raw message