mesos-builds mailing list archives

Site index · List index
Message view « Date » · « Thread »
Top « Date » · « Thread »
From Apache Jenkins Server <jenk...@builds.apache.org>
Subject Build failed in Jenkins: mesos-reviewbot #15797
Date Mon, 24 Oct 2016 12:29:50 GMT
See <https://builds.apache.org/job/mesos-reviewbot/15797/>

------------------------------------------
[...truncated 214335 lines...]
I1024 12:29:40.184288 29396 containerizer.cpp:201] Using isolation: posix/cpu,posix/mem,filesystem/posix,network/cni
W1024 12:29:40.184976 29396 backend.cpp:76] Failed to create 'aufs' backend: AufsBackend requires
root privileges, but is running as user mesos
W1024 12:29:40.185151 29396 backend.cpp:76] Failed to create 'bind' backend: BindBackend requires
root privileges
I1024 12:29:40.188271 29426 slave.cpp:208] Mesos agent started on (633)@172.17.0.2:60294
I1024 12:29:40.188505 29426 slave.cpp:209] Flags at startup: --acls="" --appc_simple_discovery_uri_prefix="http://"
--appc_store_dir="/tmp/mesos/store/appc" --authenticate_http_readonly="true" --authenticate_http_readwrite="true"
--authenticatee="crammd5" --authentication_backoff_factor="1secs" --authorizer="local" --cgroups_cpu_enable_pids_and_tids_count="false"
--cgroups_enable_cfs="false" --cgroups_hierarchy="/sys/fs/cgroup" --cgroups_limit_swap="false"
--cgroups_root="mesos" --container_disk_watch_interval="15secs" --containerizers="mesos" --credential="/tmp/Endpoint_SlaveEndpointTest_AuthorizedRequest_1_x9s0Zb/credential"
--default_role="*" --disk_watch_interval="1mins" --docker="docker" --docker_kill_orphans="true"
--docker_registry="https://registry-1.docker.io" --docker_remove_delay="6hrs" --docker_socket="/var/run/docker.sock"
--docker_stop_timeout="0ns" --docker_store_dir="/tmp/mesos/store/docker" --docker_volume_checkpoint_dir="/var/run/mesos/isolators/docker/volume"
--enforce_container_disk_quota="false" --executor_registration_timeout="1mins" --executor_shutdown_grace_period="5secs"
--fetcher_cache_dir="/tmp/Endpoint_SlaveEndpointTest_AuthorizedRequest_1_x9s0Zb/fetch" --fetcher_cache_size="2GB"
--frameworks_home="" --gc_delay="1weeks" --gc_disk_headroom="0.1" --hadoop_home="" --help="false"
--hostname_lookup="true" --http_authenticators="basic" --http_command_executor="false" --http_credentials="/tmp/Endpoint_SlaveEndpointTest_AuthorizedRequest_1_x9s0Zb/http_credentials"
--image_provisioner_backend="copy" --initialize_driver_logging="true" --isolation="posix/cpu,posix/mem"
--launcher="posix" --launcher_dir="/mesos/mesos-1.2.0/_build/src" --logbufsecs="0" --logging_level="INFO"
--max_completed_executors_per_framework="150" --oversubscribed_resources_interval="15secs"
--perf_duration="10secs" --perf_interval="1mins" --qos_correction_interval_min="0ns" --quiet="false"
--recover="reconnect" --recovery_timeout="15mins" --registration_backoff_factor="10ms" --resources="cpus:2;gpus:0;mem:1024;disk:1024;ports:[31000-32000]"
--revocable_cpu_low_priority="true" --runtime_dir="/tmp/Endpoint_SlaveEndpointTest_AuthorizedRequest_1_x9s0Zb"
--sandbox_directory="/mnt/mesos/sandbox" --strict="true" --switch_user="true" --systemd_enable_support="true"
--systemd_runtime_directory="/run/systemd/system" --version="false" --work_dir="/tmp/Endpoint_SlaveEndpointTest_AuthorizedRequest_1_PkiC2s"
I1024 12:29:40.189050 29426 credentials.hpp:86] Loading credential for authentication from
'/tmp/Endpoint_SlaveEndpointTest_AuthorizedRequest_1_x9s0Zb/credential'
I1024 12:29:40.189196 29426 slave.cpp:346] Agent using credential for: test-principal
I1024 12:29:40.189219 29426 credentials.hpp:37] Loading credentials for authentication from
'/tmp/Endpoint_SlaveEndpointTest_AuthorizedRequest_1_x9s0Zb/http_credentials'
I1024 12:29:40.189467 29426 http.cpp:887] Using default 'basic' HTTP authenticator for realm
'mesos-agent-readonly'
I1024 12:29:40.189656 29426 http.cpp:887] Using default 'basic' HTTP authenticator for realm
'mesos-agent-readwrite'
I1024 12:29:40.190853 29426 slave.cpp:533] Agent resources: cpus(*):2; mem(*):1024; disk(*):1024;
ports(*):[31000-32000]
I1024 12:29:40.190939 29426 slave.cpp:541] Agent attributes: [  ]
I1024 12:29:40.190953 29426 slave.cpp:546] Agent hostname: 9e46fc0feabc
I1024 12:29:40.192502 29416 state.cpp:57] Recovering state from '/tmp/Endpoint_SlaveEndpointTest_AuthorizedRequest_1_PkiC2s/meta'
I1024 12:29:40.192726 29429 status_update_manager.cpp:203] Recovering status update manager
I1024 12:29:40.193126 29427 containerizer.cpp:557] Recovering containerizer
I1024 12:29:40.194488 29416 provisioner.cpp:253] Provisioner recovery complete
I1024 12:29:40.194882 29425 slave.cpp:5399] Finished recovery
I1024 12:29:40.195446 29425 slave.cpp:5573] Querying resource estimator for oversubscribable
resources
I1024 12:29:40.195734 29423 slave.cpp:5587] Received oversubscribable resources {} from the
resource estimator
I1024 12:29:40.197942 29420 process.cpp:3377] Handling HTTP event for process 'slave(633)'
with path: '/slave(633)/monitor/statistics.json'
I1024 12:29:40.199189 29429 http.cpp:839] Authorizing principal 'test-principal' to GET the
'/monitor/statistics.json' endpoint
I1024 12:29:40.203454 29415 slave.cpp:787] Agent terminating
[       OK ] Endpoint/SlaveEndpointTest.AuthorizedRequest/1 (30 ms)
[ RUN      ] Endpoint/SlaveEndpointTest.AuthorizedRequest/2
I1024 12:29:40.214880 29396 containerizer.cpp:201] Using isolation: posix/cpu,posix/mem,filesystem/posix,network/cni
W1024 12:29:40.215610 29396 backend.cpp:76] Failed to create 'aufs' backend: AufsBackend requires
root privileges, but is running as user mesos
W1024 12:29:40.215765 29396 backend.cpp:76] Failed to create 'bind' backend: BindBackend requires
root privileges
I1024 12:29:40.219183 29418 slave.cpp:208] Mesos agent started on (634)@172.17.0.2:60294
I1024 12:29:40.219208 29418 slave.cpp:209] Flags at startup: --acls="" --appc_simple_discovery_uri_prefix="http://"
--appc_store_dir="/tmp/mesos/store/appc" --authenticate_http_readonly="true" --authenticate_http_readwrite="true"
--authenticatee="crammd5" --authentication_backoff_factor="1secs" --authorizer="local" --cgroups_cpu_enable_pids_and_tids_count="false"
--cgroups_enable_cfs="false" --cgroups_hierarchy="/sys/fs/cgroup" --cgroups_limit_swap="false"
--cgroups_root="mesos" --container_disk_watch_interval="15secs" --containerizers="mesos" --credential="/tmp/Endpoint_SlaveEndpointTest_AuthorizedRequest_2_VRrj65/credential"
--default_role="*" --disk_watch_interval="1mins" --docker="docker" --docker_kill_orphans="true"
--docker_registry="https://registry-1.docker.io" --docker_remove_delay="6hrs" --docker_socket="/var/run/docker.sock"
--docker_stop_timeout="0ns" --docker_store_dir="/tmp/mesos/store/docker" --docker_volume_checkpoint_dir="/var/run/mesos/isolators/docker/volume"
--enforce_container_disk_quota="false" --executor_registration_timeout="1mins" --executor_shutdown_grace_period="5secs"
--fetcher_cache_dir="/tmp/Endpoint_SlaveEndpointTest_AuthorizedRequest_2_VRrj65/fetch" --fetcher_cache_size="2GB"
--frameworks_home="" --gc_delay="1weeks" --gc_disk_headroom="0.1" --hadoop_home="" --help="false"
--hostname_lookup="true" --http_authenticators="basic" --http_command_executor="false" --http_credentials="/tmp/Endpoint_SlaveEndpointTest_AuthorizedRequest_2_VRrj65/http_credentials"
--image_provisioner_backend="copy" --initialize_driver_logging="true" --isolation="posix/cpu,posix/mem"
--launcher="posix" --launcher_dir="/mesos/mesos-1.2.0/_build/src" --logbufsecs="0" --logging_level="INFO"
--max_completed_executors_per_framework="150" --oversubscribed_resources_interval="15secs"
--perf_duration="10secs" --perf_interval="1mins" --qos_correction_interval_min="0ns" --quiet="false"
--recover="reconnect" --recovery_timeout="15mins" --registration_backoff_factor="10ms" --resources="cpus:2;gpus:0;mem:1024;disk:1024;ports:[31000-32000]"
--revocable_cpu_low_priority="true" --runtime_dir="/tmp/Endpoint_SlaveEndpointTest_AuthorizedRequest_2_VRrj65"
--sandbox_directory="/mnt/mesos/sandbox" --strict="true" --switch_user="true" --systemd_enable_support="true"
--systemd_runtime_directory="/run/systemd/system" --version="false" --work_dir="/tmp/Endpoint_SlaveEndpointTest_AuthorizedRequest_2_1v7W3m"
I1024 12:29:40.219947 29418 credentials.hpp:86] Loading credential for authentication from
'/tmp/Endpoint_SlaveEndpointTest_AuthorizedRequest_2_VRrj65/credential'
I1024 12:29:40.220126 29418 slave.cpp:346] Agent using credential for: test-principal
I1024 12:29:40.220155 29418 credentials.hpp:37] Loading credentials for authentication from
'/tmp/Endpoint_SlaveEndpointTest_AuthorizedRequest_2_VRrj65/http_credentials'
I1024 12:29:40.220427 29418 http.cpp:887] Using default 'basic' HTTP authenticator for realm
'mesos-agent-readonly'
I1024 12:29:40.220567 29418 http.cpp:887] Using default 'basic' HTTP authenticator for realm
'mesos-agent-readwrite'
I1024 12:29:40.221907 29418 slave.cpp:533] Agent resources: cpus(*):2; mem(*):1024; disk(*):1024;
ports(*):[31000-32000]
I1024 12:29:40.222008 29418 slave.cpp:541] Agent attributes: [  ]
I1024 12:29:40.222024 29418 slave.cpp:546] Agent hostname: 9e46fc0feabc
I1024 12:29:40.223572 29417 state.cpp:57] Recovering state from '/tmp/Endpoint_SlaveEndpointTest_AuthorizedRequest_2_1v7W3m/meta'
I1024 12:29:40.223928 29419 status_update_manager.cpp:203] Recovering status update manager
I1024 12:29:40.224195 29424 containerizer.cpp:557] Recovering containerizer
I1024 12:29:40.225749 29424 provisioner.cpp:253] Provisioner recovery complete
I1024 12:29:40.226279 29428 slave.cpp:5399] Finished recovery
I1024 12:29:40.226758 29428 slave.cpp:5573] Querying resource estimator for oversubscribable
resources
I1024 12:29:40.227087 29421 slave.cpp:5587] Received oversubscribable resources {} from the
resource estimator
I1024 12:29:40.229010 29421 process.cpp:3377] Handling HTTP event for process 'slave(634)'
with path: '/slave(634)/containers'
I1024 12:29:40.230028 29429 http.cpp:839] Authorizing principal 'test-principal' to GET the
'/containers' endpoint
I1024 12:29:40.233748 29416 slave.cpp:787] Agent terminating
[       OK ] Endpoint/SlaveEndpointTest.AuthorizedRequest/2 (29 ms)
[ RUN      ] Endpoint/SlaveEndpointTest.UnauthorizedRequest/0
I1024 12:29:40.244158 29396 containerizer.cpp:201] Using isolation: posix/cpu,posix/mem,filesystem/posix,network/cni
W1024 12:29:40.244843 29396 backend.cpp:76] Failed to create 'aufs' backend: AufsBackend requires
root privileges, but is running as user mesos
W1024 12:29:40.245020 29396 backend.cpp:76] Failed to create 'bind' backend: BindBackend requires
root privileges
I1024 12:29:40.248468 29423 slave.cpp:208] Mesos agent started on (635)@172.17.0.2:60294
I1024 12:29:40.248498 29423 slave.cpp:209] Flags at startup: --acls="" --appc_simple_discovery_uri_prefix="http://"
--appc_store_dir="/tmp/mesos/store/appc" --authenticate_http_readonly="true" --authenticate_http_readwrite="true"
--authenticatee="crammd5" --authentication_backoff_factor="1secs" --authorizer="local" --cgroups_cpu_enable_pids_and_tids_count="false"
--cgroups_enable_cfs="false" --cgroups_hierarchy="/sys/fs/cgroup" --cgroups_limit_swap="false"
--cgroups_root="mesos" --container_disk_watch_interval="15secs" --containerizers="mesos" --credential="/tmp/Endpoint_SlaveEndpointTest_UnauthorizedRequest_0_V8sZv0/credential"
--default_role="*" --disk_watch_interval="1mins" --docker="docker" --docker_kill_orphans="true"
--docker_registry="https://registry-1.docker.io" --docker_remove_delay="6hrs" --docker_socket="/var/run/docker.sock"
--docker_stop_timeout="0ns" --docker_store_dir="/tmp/mesos/store/docker" --docker_volume_checkpoint_dir="/var/run/mesos/isolators/docker/volume"
--enforce_container_disk_quota="false" --executor_registration_timeout="1mins" --executor_shutdown_grace_period="5secs"
--fetcher_cache_dir="/tmp/Endpoint_SlaveEndpointTest_UnauthorizedRequest_0_V8sZv0/fetch" --fetcher_cache_size="2GB"
--frameworks_home="" --gc_delay="1weeks" --gc_disk_headroom="0.1" --hadoop_home="" --help="false"
--hostname_lookup="true" --http_authenticators="basic" --http_command_executor="false" --http_credentials="/tmp/Endpoint_SlaveEndpointTest_UnauthorizedRequest_0_V8sZv0/http_credentials"
--image_provisioner_backend="copy" --initialize_driver_logging="true" --isolation="posix/cpu,posix/mem"
--launcher="posix" --launcher_dir="/mesos/mesos-1.2.0/_build/src" --logbufsecs="0" --logging_level="INFO"
--max_completed_executors_per_framework="150" --oversubscribed_resources_interval="15secs"
--perf_duration="10secs" --perf_interval="1mins" --qos_correction_interval_min="0ns" --quiet="false"
--recover="reconnect" --recovery_timeout="15mins" --registration_backoff_factor="10ms" --resources="cpus:2;gpus:0;mem:1024;disk:1024;ports:[31000-32000]"
--revocable_cpu_low_priority="true" --runtime_dir="/tmp/Endpoint_SlaveEndpointTest_UnauthorizedRequest_0_V8sZv0"
--sandbox_directory="/mnt/mesos/sandbox" --strict="true" --switch_user="true" --systemd_enable_support="true"
--systemd_runtime_directory="/run/systemd/system" --version="false" --work_dir="/tmp/Endpoint_SlaveEndpointTest_UnauthorizedRequest_0_xLiSoh"
I1024 12:29:40.249130 29423 credentials.hpp:86] Loading credential for authentication from
'/tmp/Endpoint_SlaveEndpointTest_UnauthorizedRequest_0_V8sZv0/credential'
I1024 12:29:40.249294 29423 slave.cpp:346] Agent using credential for: test-principal
I1024 12:29:40.249320 29423 credentials.hpp:37] Loading credentials for authentication from
'/tmp/Endpoint_SlaveEndpointTest_UnauthorizedRequest_0_V8sZv0/http_credentials'
I1024 12:29:40.249519 29423 http.cpp:887] Using default 'basic' HTTP authenticator for realm
'mesos-agent-readonly'
I1024 12:29:40.249673 29423 http.cpp:887] Using default 'basic' HTTP authenticator for realm
'mesos-agent-readwrite'
I1024 12:29:40.250882 29423 slave.cpp:533] Agent resources: cpus(*):2; mem(*):1024; disk(*):1024;
ports(*):[31000-32000]
I1024 12:29:40.250952 29423 slave.cpp:541] Agent attributes: [  ]
I1024 12:29:40.250962 29423 slave.cpp:546] Agent hostname: 9e46fc0feabc
I1024 12:29:40.252328 29429 state.cpp:57] Recovering state from '/tmp/Endpoint_SlaveEndpointTest_UnauthorizedRequest_0_xLiSoh/meta'
I1024 12:29:40.252866 29426 status_update_manager.cpp:203] Recovering status update manager
I1024 12:29:40.253021 29426 containerizer.cpp:557] Recovering containerizer
I1024 12:29:40.254638 29430 provisioner.cpp:253] Provisioner recovery complete
I1024 12:29:40.255144 29429 slave.cpp:5399] Finished recovery
I1024 12:29:40.255827 29429 slave.cpp:5573] Querying resource estimator for oversubscribable
resources
I1024 12:29:40.256175 29427 slave.cpp:5587] Received oversubscribable resources {} from the
resource estimator
I1024 12:29:40.257978 29416 process.cpp:3377] Handling HTTP event for process 'slave(635)'
with path: '/slave(635)/monitor/statistics'
I1024 12:29:40.259382 29422 http.cpp:839] Authorizing principal 'test-principal' to GET the
'/monitor/statistics' endpoint
I1024 12:29:40.262351 29430 slave.cpp:787] Agent terminating
[       OK ] Endpoint/SlaveEndpointTest.UnauthorizedRequest/0 (29 ms)
[ RUN      ] Endpoint/SlaveEndpointTest.UnauthorizedRequest/1
I1024 12:29:40.274170 29396 containerizer.cpp:201] Using isolation: posix/cpu,posix/mem,filesystem/posix,network/cni
W1024 12:29:40.274852 29396 backend.cpp:76] Failed to create 'aufs' backend: AufsBackend requires
root privileges, but is running as user mesos
W1024 12:29:40.275017 29396 backend.cpp:76] Failed to create 'bind' backend: BindBackend requires
root privileges
I1024 12:29:40.278627 29424 slave.cpp:208] Mesos agent started on (636)@172.17.0.2:60294
I1024 12:29:40.278655 29424 slave.cpp:209] Flags at startup: --acls="" --appc_simple_discovery_uri_prefix="http://"
--appc_store_dir="/tmp/mesos/store/appc" --authenticate_http_readonly="true" --authenticate_http_readwrite="true"
--authenticatee="crammd5" --authentication_backoff_factor="1secs" --authorizer="local" --cgroups_cpu_enable_pids_and_tids_count="false"
--cgroups_enable_cfs="false" --cgroups_hierarchy="/sys/fs/cgroup" --cgroups_limit_swap="false"
--cgroups_root="mesos" --container_disk_watch_interval="15secs" --containerizers="mesos" --credential="/tmp/Endpoint_SlaveEndpointTest_UnauthorizedRequest_1_VwCYeV/credential"
--default_role="*" --disk_watch_interval="1mins" --docker="docker" --docker_kill_orphans="true"
--docker_registry="https://registry-1.docker.io" --docker_remove_delay="6hrs" --docker_socket="/var/run/docker.sock"
--docker_stop_timeout="0ns" --docker_store_dir="/tmp/mesos/store/docker" --docker_volume_checkpoint_dir="/var/run/mesos/isolators/docker/volume"
--enforce_container_disk_quota="false" --executor_registration_timeout="1mins" --executor_shutdown_grace_period="5secs"
--fetcher_cache_dir="/tmp/Endpoint_SlaveEndpointTest_UnauthorizedRequest_1_VwCYeV/fetch" --fetcher_cache_size="2GB"
--frameworks_home="" --gc_delay="1weeks" --gc_disk_headroom="0.1" --hadoop_home="" --help="false"
--hostname_lookup="true" --http_authenticators="basic" --http_command_executor="false" --http_credentials="/tmp/Endpoint_SlaveEndpointTest_UnauthorizedRequest_1_VwCYeV/http_credentials"
--image_provisioner_backend="copy" --initialize_driver_logging="true" --isolation="posix/cpu,posix/mem"
--launcher="posix" --launcher_dir="/mesos/mesos-1.2.0/_build/src" --logbufsecs="0" --logging_level="INFO"
--max_completed_executors_per_framework="150" --oversubscribed_resources_interval="15secs"
--perf_duration="10secs" --perf_interval="1mins" --qos_correction_interval_min="0ns" --quiet="false"
--recover="reconnect" --recovery_timeout="15mins" --registration_backoff_factor="10ms" --resources="cpus:2;gpus:0;mem:1024;disk:1024;ports:[31000-32000]"
--revocable_cpu_low_priority="true" --runtime_dir="/tmp/Endpoint_SlaveEndpointTest_UnauthorizedRequest_1_VwCYeV"
--sandbox_directory="/mnt/mesos/sandbox" --strict="true" --switch_user="true" --systemd_enable_support="true"
--systemd_runtime_directory="/run/systemd/system" --version="false" --work_dir="/tmp/Endpoint_SlaveEndpointTest_UnauthorizedRequest_1_7RGZ2b"
I1024 12:29:40.279317 29424 credentials.hpp:86] Loading credential for authentication from
'/tmp/Endpoint_SlaveEndpointTest_UnauthorizedRequest_1_VwCYeV/credential'
I1024 12:29:40.279479 29424 slave.cpp:346] Agent using credential for: test-principal
I1024 12:29:40.279503 29424 credentials.hpp:37] Loading credentials for authentication from
'/tmp/Endpoint_SlaveEndpointTest_UnauthorizedRequest_1_VwCYeV/http_credentials'
I1024 12:29:40.279768 29424 http.cpp:887] Using default 'basic' HTTP authenticator for realm
'mesos-agent-readonly'
I1024 12:29:40.279911 29424 http.cpp:887] Using default 'basic' HTTP authenticator for realm
'mesos-agent-readwrite'
I1024 12:29:40.282356 29424 slave.cpp:533] Agent resources: cpus(*):2; mem(*):1024; disk(*):1024;
ports(*):[31000-32000]
I1024 12:29:40.282454 29424 slave.cpp:541] Agent attributes: [  ]
I1024 12:29:40.282466 29424 slave.cpp:546] Agent hostname: 9e46fc0feabc
I1024 12:29:40.284207 29415 state.cpp:57] Recovering state from '/tmp/Endpoint_SlaveEndpointTest_UnauthorizedRequest_1_7RGZ2b/meta'
I1024 12:29:40.284618 29418 status_update_manager.cpp:203] Recovering status update manager
I1024 12:29:40.285339 29421 containerizer.cpp:557] Recovering containerizer
I1024 12:29:40.286861 29422 provisioner.cpp:253] Provisioner recovery complete
I1024 12:29:40.287570 29418 slave.cpp:5399] Finished recovery
I1024 12:29:40.288101 29418 slave.cpp:5573] Querying resource estimator for oversubscribable
resources
I1024 12:29:40.288404 29419 slave.cpp:5587] Received oversubscribable resources {} from the
resource estimator
I1024 12:29:40.290397 29430 process.cpp:3377] Handling HTTP event for process 'slave(636)'
with path: '/slave(636)/monitor/statistics.json'
I1024 12:29:40.291486 29430 http.cpp:839] Authorizing principal 'test-principal' to GET the
'/monitor/statistics.json' endpoint
I1024 12:29:40.295071 29422 slave.cpp:787] Agent terminating
[       OK ] Endpoint/SlaveEndpointTest.UnauthorizedRequest/1 (32 ms)
[ RUN      ] Endpoint/SlaveEndpointTest.UnauthorizedRequest/2
I1024 12:29:40.307034 29396 containerizer.cpp:201] Using isolation: posix/cpu,posix/mem,filesystem/posix,network/cni
W1024 12:29:40.307659 29396 backend.cpp:76] Failed to create 'aufs' backend: AufsBackend requires
root privileges, but is running as user mesos
W1024 12:29:40.307788 29396 backend.cpp:76] Failed to create 'bind' backend: BindBackend requires
root privileges
I1024 12:29:40.310739 29422 slave.cpp:208] Mesos agent started on (637)@172.17.0.2:60294
I1024 12:29:40.310767 29422 slave.cpp:209] Flags at startup: --acls="" --appc_simple_discovery_uri_prefix="http://"
--appc_store_dir="/tmp/mesos/store/appc" --authenticate_http_readonly="true" --authenticate_http_readwrite="true"
--authenticatee="crammd5" --authentication_backoff_factor="1secs" --authorizer="local" --cgroups_cpu_enable_pids_and_tids_count="false"
--cgroups_enable_cfs="false" --cgroups_hierarchy="/sys/fs/cgroup" --cgroups_limit_swap="false"
--cgroups_root="mesos" --container_disk_watch_interval="15secs" --containerizers="mesos" --credential="/tmp/Endpoint_SlaveEndpointTest_UnauthorizedRequest_2_rL45iQ/credential"
--default_role="*" --disk_watch_interval="1mins" --docker="docker" --docker_kill_orphans="true"
--docker_registry="https://registry-1.docker.io" --docker_remove_delay="6hrs" --docker_socket="/var/run/docker.sock"
--docker_stop_timeout="0ns" --docker_store_dir="/tmp/mesos/store/docker" --docker_volume_checkpoint_dir="/var/run/mesos/isolators/docker/volume"
--enforce_container_disk_quota="false" --executor_registration_timeout="1mins" --executor_shutdown_grace_period="5secs"
--fetcher_cache_dir="/tmp/Endpoint_SlaveEndpointTest_UnauthorizedRequest_2_rL45iQ/fetch" --fetcher_cache_size="2GB"
--frameworks_home="" --gc_delay="1weeks" --gc_disk_headroom="0.1" --hadoop_home="" --help="false"
--hostname_lookup="true" --http_authenticators="basic" --http_command_executor="false" --http_credentials="/tmp/Endpoint_SlaveEndpointTest_UnauthorizedRequest_2_rL45iQ/http_credentials"
--image_provisioner_backend="copy" --initialize_driver_logging="true" --isolation="posix/cpu,posix/mem"
--launcher="posix" --launcher_dir="/mesos/mesos-1.2.0/_build/src" --logbufsecs="0" --logging_level="INFO"
--max_completed_executors_per_framework="150" --oversubscribed_resources_interval="15secs"
--perf_duration="10secs" --perf_interval="1mins" --qos_correction_interval_min="0ns" --quiet="false"
--recover="reconnect" --recovery_timeout="15mins" --registration_backoff_factor="10ms" --resources="cpus:2;gpus:0;mem:1024;disk:1024;ports:[31000-32000]"
--revocable_cpu_low_priority="true" --runtime_dir="/tmp/Endpoint_SlaveEndpointTest_UnauthorizedRequest_2_rL45iQ"
--sandbox_directory="/mnt/mesos/sandbox" --strict="true" --switch_user="true" --systemd_enable_support="true"
--systemd_runtime_directory="/run/systemd/system" --version="false" --work_dir="/tmp/Endpoint_SlaveEndpointTest_UnauthorizedRequest_2_NKzO16"
I1024 12:29:40.311455 29422 credentials.hpp:86] Loading credential for authentication from
'/tmp/Endpoint_SlaveEndpointTest_UnauthorizedRequest_2_rL45iQ/credential'
I1024 12:29:40.311645 29422 slave.cpp:346] Agent using credential for: test-principal
I1024 12:29:40.311673 29422 credentials.hpp:37] Loading credentials for authentication from
'/tmp/Endpoint_SlaveEndpointTest_UnauthorizedRequest_2_rL45iQ/http_credentials'
I1024 12:29:40.311978 29422 http.cpp:887] Using default 'basic' HTTP authenticator for realm
'mesos-agent-readonly'
I1024 12:29:40.312149 29422 http.cpp:887] Using default 'basic' HTTP authenticator for realm
'mesos-agent-readwrite'
I1024 12:29:40.313678 29422 slave.cpp:533] Agent resources: cpus(*):2; mem(*):1024; disk(*):1024;
ports(*):[31000-32000]
I1024 12:29:40.313776 29422 slave.cpp:541] Agent attributes: [  ]
I1024 12:29:40.313791 29422 slave.cpp:546] Agent hostname: 9e46fc0feabc
I1024 12:29:40.315304 29425 state.cpp:57] Recovering state from '/tmp/Endpoint_SlaveEndpointTest_UnauthorizedRequest_2_NKzO16/meta'
I1024 12:29:40.315701 29430 status_update_manager.cpp:203] Recovering status update manager
I1024 12:29:40.316064 29425 containerizer.cpp:557] Recovering containerizer
I1024 12:29:40.317828 29419 provisioner.cpp:253] Provisioner recovery complete
I1024 12:29:40.318388 29428 slave.cpp:5399] Finished recovery
I1024 12:29:40.319031 29428 slave.cpp:5573] Querying resource estimator for oversubscribable
resources
I1024 12:29:40.319355 29421 slave.cpp:5587] Received oversubscribable resources {} from the
resource estimator
I1024 12:29:40.321518 29422 process.cpp:3377] Handling HTTP event for process 'slave(637)'
with path: '/slave(637)/containers'
I1024 12:29:40.322932 29421 http.cpp:839] Authorizing principal 'test-principal' to GET the
'/containers' endpoint
I1024 12:29:40.327203 29424 slave.cpp:787] Agent terminating
[       OK ] Endpoint/SlaveEndpointTest.UnauthorizedRequest/2 (32 ms)
[ RUN      ] Endpoint/SlaveEndpointTest.NoAuthorizer/0
I1024 12:29:40.338929 29396 containerizer.cpp:201] Using isolation: posix/cpu,posix/mem,filesystem/posix,network/cni
W1024 12:29:40.339629 29396 backend.cpp:76] Failed to create 'aufs' backend: AufsBackend requires
root privileges, but is running as user mesos
W1024 12:29:40.339828 29396 backend.cpp:76] Failed to create 'bind' backend: BindBackend requires
root privileges
I1024 12:29:40.341429 29396 cluster.cpp:435] Creating default 'local' authorizer
I1024 12:29:40.343575 29424 slave.cpp:208] Mesos agent started on (638)@172.17.0.2:60294
I1024 12:29:40.343607 29424 slave.cpp:209] Flags at startup: --acls="" --appc_simple_discovery_uri_prefix="http://"
--appc_store_dir="/tmp/mesos/store/appc" --authenticate_http_readonly="true" --authenticate_http_readwrite="true"
--authenticatee="crammd5" --authentication_backoff_factor="1secs" --authorizer="local" --cgroups_cpu_enable_pids_and_tids_count="false"
--cgroups_enable_cfs="false" --cgroups_hierarchy="/sys/fs/cgroup" --cgroups_limit_swap="false"
--cgroups_root="mesos" --container_disk_watch_interval="15secs" --containerizers="mesos" --credential="/tmp/Endpoint_SlaveEndpointTest_NoAuthorizer_0_Tv5KHL/credential"
--default_role="*" --disk_watch_interval="1mins" --docker="docker" --docker_kill_orphans="true"
--docker_registry="https://registry-1.docker.io" --docker_remove_delay="6hrs" --docker_socket="/var/run/docker.sock"
--docker_stop_timeout="0ns" --docker_store_dir="/tmp/mesos/store/docker" --docker_volume_checkpoint_dir="/var/run/mesos/isolators/docker/volume"
--enforce_container_disk_quota="false" --executor_registration_timeout="1mins" --executor_shutdown_grace_period="5secs"
--fetcher_cache_dir="/tmp/Endpoint_SlaveEndpointTest_NoAuthorizer_0_Tv5KHL/fetch" --fetcher_cache_size="2GB"
--frameworks_home="" --gc_delay="1weeks" --gc_disk_headroom="0.1" --hadoop_home="" --help="false"
--hostname_lookup="true" --http_authenticators="basic" --http_command_executor="false" --http_credentials="/tmp/Endpoint_SlaveEndpointTest_NoAuthorizer_0_Tv5KHL/http_credentials"
--image_provisioner_backend="copy" --initialize_driver_logging="true" --isolation="posix/cpu,posix/mem"
--launcher="posix" --launcher_dir="/mesos/mesos-1.2.0/_build/src" --logbufsecs="0" --logging_level="INFO"
--max_completed_executors_per_framework="150" --oversubscribed_resources_interval="15secs"
--perf_duration="10secs" --perf_interval="1mins" --qos_correction_interval_min="0ns" --quiet="false"
--recover="reconnect" --recovery_timeout="15mins" --registration_backoff_factor="10ms" --resources="cpus:2;gpus:0;mem:1024;disk:1024;ports:[31000-32000]"
--revocable_cpu_low_priority="true" --runtime_dir="/tmp/Endpoint_SlaveEndpointTest_NoAuthorizer_0_Tv5KHL"
--sandbox_directory="/mnt/mesos/sandbox" --strict="true" --switch_user="true" --systemd_enable_support="true"
--systemd_runtime_directory="/run/systemd/system" --version="false" --work_dir="/tmp/Endpoint_SlaveEndpointTest_NoAuthorizer_0_1U7il2"
I1024 12:29:40.344250 29424 credentials.hpp:86] Loading credential for authentication from
'/tmp/Endpoint_SlaveEndpointTest_NoAuthorizer_0_Tv5KHL/credential'
I1024 12:29:40.344449 29424 slave.cpp:346] Agent using credential for: test-principal
I1024 12:29:40.344478 29424 credentials.hpp:37] Loading credentials for authentication from
'/tmp/Endpoint_SlaveEndpointTest_NoAuthorizer_0_Tv5KHL/http_credentials'
I1024 12:29:40.344758 29424 http.cpp:887] Using default 'basic' HTTP authenticator for realm
'mesos-agent-readonly'
I1024 12:29:40.344933 29424 http.cpp:887] Using default 'basic' HTTP authenticator for realm
'mesos-agent-readwrite'
I1024 12:29:40.346285 29424 slave.cpp:533] Agent resources: cpus(*):2; mem(*):1024; disk(*):1024;
ports(*):[31000-32000]
I1024 12:29:40.346387 29424 slave.cpp:541] Agent attributes: [  ]
I1024 12:29:40.346410 29424 slave.cpp:546] Agent hostname: 9e46fc0feabc
I1024 12:29:40.347864 29417 state.cpp:57] Recovering state from '/tmp/Endpoint_SlaveEndpointTest_NoAuthorizer_0_1U7il2/meta'
I1024 12:29:40.348201 29416 status_update_manager.cpp:203] Recovering status update manager
I1024 12:29:40.348531 29420 containerizer.cpp:557] Recovering containerizer
I1024 12:29:40.350028 29415 provisioner.cpp:253] Provisioner recovery complete
I1024 12:29:40.350513 29424 slave.cpp:5399] Finished recovery
I1024 12:29:40.351040 29424 slave.cpp:5573] Querying resource estimator for oversubscribable
resources
I1024 12:29:40.352133 29430 slave.cpp:5587] Received oversubscribable resources {} from the
resource estimator
I1024 12:29:40.354445 29419 process.cpp:3377] Handling HTTP event for process 'slave(638)'
with path: '/slave(638)/monitor/statistics'
I1024 12:29:40.355634 29420 http.cpp:839] Authorizing principal 'test-principal' to GET the
'/monitor/statistics' endpoint
I1024 12:29:40.360687 29420 slave.cpp:787] Agent terminating
[       OK ] Endpoint/SlaveEndpointTest.NoAuthorizer/0 (36 ms)
[ RUN      ] Endpoint/SlaveEndpointTest.NoAuthorizer/1
I1024 12:29:40.376863 29396 containerizer.cpp:201] Using isolation: posix/cpu,posix/mem,filesystem/posix,network/cni
W1024 12:29:40.377632 29396 backend.cpp:76] Failed to create 'aufs' backend: AufsBackend requires
root privileges, but is running as user mesos
W1024 12:29:40.377846 29396 backend.cpp:76] Failed to create 'bind' backend: BindBackend requires
root privileges
I1024 12:29:40.379644 29396 cluster.cpp:435] Creating default 'local' authorizer
I1024 12:29:40.381878 29424 slave.cpp:208] Mesos agent started on (639)@172.17.0.2:60294
I1024 12:29:40.381901 29424 slave.cpp:209] Flags at startup: --acls="" --appc_simple_discovery_uri_prefix="http://"
--appc_store_dir="/tmp/mesos/store/appc" --authenticate_http_readonly="true" --authenticate_http_readwrite="true"
--authenticatee="crammd5" --authentication_backoff_factor="1secs" --authorizer="local" --cgroups_cpu_enable_pids_and_tids_count="false"
--cgroups_enable_cfs="false" --cgroups_hierarchy="/sys/fs/cgroup" --cgroups_limit_swap="false"
--cgroups_root="mesos" --container_disk_watch_interval="15secs" --containerizers="mesos" --credential="/tmp/Endpoint_SlaveEndpointTest_NoAuthorizer_1_HWeKtH/credential"
--default_role="*" --disk_watch_interval="1mins" --docker="docker" --docker_kill_orphans="true"
--docker_registry="https://registry-1.docker.io" --docker_remove_delay="6hrs" --docker_socket="/var/run/docker.sock"
--docker_stop_timeout="0ns" --docker_store_dir="/tmp/mesos/store/docker" --docker_volume_checkpoint_dir="/var/run/mesos/isolators/docker/volume"
--enforce_container_disk_quota="false" --executor_registration_timeout="1mins" --executor_shutdown_grace_period="5secs"
--fetcher_cache_dir="/tmp/Endpoint_SlaveEndpointTest_NoAuthorizer_1_HWeKtH/fetch" --fetcher_cache_size="2GB"
--frameworks_home="" --gc_delay="1weeks" --gc_disk_headroom="0.1" --hadoop_home="" --help="false"
--hostname_lookup="true" --http_authenticators="basic" --http_command_executor="false" --http_credentials="/tmp/Endpoint_SlaveEndpointTest_NoAuthorizer_1_HWeKtH/http_credentials"
--image_provisioner_backend="copy" --initialize_driver_logging="true" --isolation="posix/cpu,posix/mem"
--launcher="posix" --launcher_dir="/mesos/mesos-1.2.0/_build/src" --logbufsecs="0" --logging_level="INFO"
--max_completed_executors_per_framework="150" --oversubscribed_resources_interval="15secs"
--perf_duration="10secs" --perf_interval="1mins" --qos_correction_interval_min="0ns" --quiet="false"
--recover="reconnect" --recovery_timeout="15mins" --registration_backoff_factor="10ms" --resources="cpus:2;gpus:0;mem:1024;disk:1024;ports:[31000-32000]"
--revocable_cpu_low_priority="true" --runtime_dir="/tmp/Endpoint_SlaveEndpointTest_NoAuthorizer_1_HWeKtH"
--sandbox_directory="/mnt/mesos/sandbox" --strict="true" --switch_user="true" --systemd_enable_support="true"
--systemd_runtime_directory="/run/systemd/system" --version="false" --work_dir="/tmp/Endpoint_SlaveEndpointTest_NoAuthorizer_1_7wLe1X"
I1024 12:29:40.382467 29424 credentials.hpp:86] Loading credential for authentication from
'/tmp/Endpoint_SlaveEndpointTest_NoAuthorizer_1_HWeKtH/credential'
I1024 12:29:40.382782 29424 slave.cpp:346] Agent using credential for: test-principal
I1024 12:29:40.382803 29424 credentials.hpp:37] Loading credentials for authentication from
'/tmp/Endpoint_SlaveEndpointTest_NoAuthorizer_1_HWeKtH/http_credentials'
I1024 12:29:40.383040 29424 http.cpp:887] Using default 'basic' HTTP authenticator for realm
'mesos-agent-readonly'
I1024 12:29:40.383147 29424 http.cpp:887] Using default 'basic' HTTP authenticator for realm
'mesos-agent-readwrite'
I1024 12:29:40.384408 29424 slave.cpp:533] Agent resources: cpus(*):2; mem(*):1024; disk(*):1024;
ports(*):[31000-32000]
I1024 12:29:40.384505 29424 slave.cpp:541] Agent attributes: [  ]
I1024 12:29:40.384521 29424 slave.cpp:546] Agent hostname: 9e46fc0feabc
I1024 12:29:40.385993 29426 state.cpp:57] Recovering state from '/tmp/Endpoint_SlaveEndpointTest_NoAuthorizer_1_7wLe1X/meta'
I1024 12:29:40.386356 29430 status_update_manager.cpp:203] Recovering status update manager
I1024 12:29:40.386631 29426 containerizer.cpp:557] Recovering containerizer
I1024 12:29:40.388444 29428 provisioner.cpp:253] Provisioner recovery complete
I1024 12:29:40.389123 29423 slave.cpp:5399] Finished recovery
I1024 12:29:40.389673 29423 slave.cpp:5573] Querying resource estimator for oversubscribable
resources
I1024 12:29:40.389935 29421 slave.cpp:5587] Received oversubscribable resources {} from the
resource estimator
I1024 12:29:40.391595 29415 process.cpp:3377] Handling HTTP event for process 'slave(639)'
with path: '/slave(639)/monitor/statistics.json'
I1024 12:29:40.392500 29416 http.cpp:839] Authorizing principal 'test-principal' to GET the
'/monitor/statistics.json' endpoint
I1024 12:29:40.397722 29430 slave.cpp:787] Agent terminating
[       OK ] Endpoint/SlaveEndpointTest.NoAuthorizer/1 (33 ms)
[ RUN      ] Endpoint/SlaveEndpointTest.NoAuthorizer/2
I1024 12:29:40.409373 29396 containerizer.cpp:201] Using isolation: posix/cpu,posix/mem,filesystem/posix,network/cni
W1024 12:29:40.409986 29396 backend.cpp:76] Failed to create 'aufs' backend: AufsBackend requires
root privileges, but is running as user mesos
W1024 12:29:40.410171 29396 backend.cpp:76] Failed to create 'bind' backend: BindBackend requires
root privileges
I1024 12:29:40.411520 29396 cluster.cpp:435] Creating default 'local' authorizer
I1024 12:29:40.413686 29427 slave.cpp:208] Mesos agent started on (640)@172.17.0.2:60294
I1024 12:29:40.413714 29427 slave.cpp:209] Flags at startup: --acls="" --appc_simple_discovery_uri_prefix="http://"
--appc_store_dir="/tmp/mesos/store/appc" --authenticate_http_readonly="true" --authenticate_http_readwrite="true"
--authenticatee="crammd5" --authentication_backoff_factor="1secs" --authorizer="local" --cgroups_cpu_enable_pids_and_tids_count="false"
--cgroups_enable_cfs="false" --cgroups_hierarchy="/sys/fs/cgroup" --cgroups_limit_swap="false"
--cgroups_root="mesos" --container_disk_watch_interval="15secs" --containerizers="mesos" --credential="/tmp/Endpoint_SlaveEndpointTest_NoAuthorizer_2_1H2mCD/credential"
--default_role="*" --disk_watch_interval="1mins" --docker="docker" --docker_kill_orphans="true"
--docker_registry="https://registry-1.docker.io" --docker_remove_delay="6hrs" --docker_socket="/var/run/docker.sock"
--docker_stop_timeout="0ns" --docker_store_dir="/tmp/mesos/store/docker" --docker_volume_checkpoint_dir="/var/run/mesos/isolators/docker/volume"
--enforce_container_disk_quota="false" --executor_registration_timeout="1mins" --executor_shutdown_grace_period="5secs"
--fetcher_cache_dir="/tmp/Endpoint_SlaveEndpointTest_NoAuthorizer_2_1H2mCD/fetch" --fetcher_cache_size="2GB"
--frameworks_home="" --gc_delay="1weeks" --gc_disk_headroom="0.1" --hadoop_home="" --help="false"
--hostname_lookup="true" --http_authenticators="basic" --http_command_executor="false" --http_credentials="/tmp/Endpoint_SlaveEndpointTest_NoAuthorizer_2_1H2mCD/http_credentials"
--image_provisioner_backend="copy" --initialize_driver_logging="true" --isolation="posix/cpu,posix/mem"
--launcher="posix" --launcher_dir="/mesos/mesos-1.2.0/_build/src" --logbufsecs="0" --logging_level="INFO"
--max_completed_executors_per_framework="150" --oversubscribed_resources_interval="15secs"
--perf_duration="10secs" --perf_interval="1mins" --qos_correction_interval_min="0ns" --quiet="false"
--recover="reconnect" --recovery_timeout="15mins" --registration_backoff_factor="10ms" --resources="cpus:2;gpus:0;mem:1024;disk:1024;ports:[31000-32000]"
--revocable_cpu_low_priority="true" --runtime_dir="/tmp/Endpoint_SlaveEndpointTest_NoAuthorizer_2_1H2mCD"
--sandbox_directory="/mnt/mesos/sandbox" --strict="true" --switch_user="true" --systemd_enable_support="true"
--systemd_runtime_directory="/run/systemd/system" --version="false" --work_dir="/tmp/Endpoint_SlaveEndpointTest_NoAuthorizer_2_v4uq4T"
I1024 12:29:40.414436 29427 credentials.hpp:86] Loading credential for authentication from
'/tmp/Endpoint_SlaveEndpointTest_NoAuthorizer_2_1H2mCD/credential'
I1024 12:29:40.414604 29427 slave.cpp:346] Agent using credential for: test-principal
I1024 12:29:40.414638 29427 credentials.hpp:37] Loading credentials for authentication from
'/tmp/Endpoint_SlaveEndpointTest_NoAuthorizer_2_1H2mCD/http_credentials'
I1024 12:29:40.414943 29427 http.cpp:887] Using default 'basic' HTTP authenticator for realm
'mesos-agent-readonly'
I1024 12:29:40.415091 29427 http.cpp:887] Using default 'basic' HTTP authenticator for realm
'mesos-agent-readwrite'
I1024 12:29:40.416509 29427 slave.cpp:533] Agent resources: cpus(*):2; mem(*):1024; disk(*):1024;
ports(*):[31000-32000]
I1024 12:29:40.416616 29427 slave.cpp:541] Agent attributes: [  ]
I1024 12:29:40.416641 29427 slave.cpp:546] Agent hostname: 9e46fc0feabc
I1024 12:29:40.418242 29428 state.cpp:57] Recovering state from '/tmp/Endpoint_SlaveEndpointTest_NoAuthorizer_2_v4uq4T/meta'
I1024 12:29:40.418530 29415 status_update_manager.cpp:203] Recovering status update manager
I1024 12:29:40.418817 29422 containerizer.cpp:557] Recovering containerizer
I1024 12:29:40.420413 29424 provisioner.cpp:253] Provisioner recovery complete
I1024 12:29:40.420883 29418 slave.cpp:5399] Finished recovery
I1024 12:29:40.421408 29418 slave.cpp:5573] Querying resource estimator for oversubscribable
resources
I1024 12:29:40.421681 29420 slave.cpp:5587] Received oversubscribable resources {} from the
resource estimator
I1024 12:29:40.423406 29417 process.cpp:3377] Handling HTTP event for process 'slave(640)'
with path: '/slave(640)/containers'
I1024 12:29:40.424549 29420 http.cpp:839] Authorizing principal 'test-principal' to GET the
'/containers' endpoint
I1024 12:29:40.429299 29421 slave.cpp:787] Agent terminating
[       OK ] Endpoint/SlaveEndpointTest.NoAuthorizer/2 (30 ms)
[----------] 9 tests from Endpoint/SlaveEndpointTest (287 ms total)

[----------] Global test environment tear-down
[==========] 1367 tests from 155 test cases ran. (440999 ms total)
[  PASSED  ] 1366 tests.
[  FAILED  ] 1 test, listed below:
[  FAILED  ] MasterTest.ExecutorLabels

 1 FAILED TEST
  YOU HAVE 5 DISABLED TESTS

make[4]: *** [check-local] Error 1
make[4]: Leaving directory `/mesos/mesos-1.2.0/_build/src'
make[3]: *** [check-am] Error 2
make[3]: Leaving directory `/mesos/mesos-1.2.0/_build/src'
make[2]: *** [check] Error 2
make[2]: Leaving directory `/mesos/mesos-1.2.0/_build/src'
make[1]: *** [check-recursive] Error 1
make[1]: Leaving directory `/mesos/mesos-1.2.0/_build'
make: *** [distcheck] Error 1
+ docker rmi mesos-1477309981-12722
Untagged: mesos-1477309981-12722:latest
Deleted: sha256:300f4d9cb1d71cc6ac28b0fb175ef4054a386db3028580e72f4009b636318290
Deleted: sha256:0f760d1e3c08928e61424e97d50bfb9ada208cc7c7a89d3b3c86c7abfec2b333
Deleted: sha256:1d1971c9da286439b0e659647e02ffa99d1b371362cf9c08ea6e684a82e17d77
Deleted: sha256:ed4ab1efad12379cd0fc230a28ad7b68ccc86a43076b37fad654ab7227e0ca7d
Deleted: sha256:f9a3baba6a94ae33fb8dce4cab3778e52186514f8356c46af7200a4e5af3b189
Deleted: sha256:3c33096d45b07a3dff4d42d632045c2fe74129b6fb30aa61bbcc982d127f868d
Deleted: sha256:d6767a2696b590e4909781ba841203da9f5ddc9ca5a9b1c9ba9ddc04ca8ec0b4
Deleted: sha256:b5218e3511f655928904d412771f4b9e7abc706818be3437abf85d6bbc9a2f94
Deleted: sha256:bebe2f15f9a4a1d1dd50fa4d73cbc0c44e5688731b95df7b990b73b8d8263799
Deleted: sha256:2dea8bc3bb86933f7b83a30c19beac305377163c9736c91aa54f1af80c80be32
Deleted: sha256:26a07c00a02b79decb86150f39ec3969f6711eb291553cc555dcc735bdabcdea
Deleted: sha256:c63d259f1057000342a37871efef070a47e494d99424a786a0f3b8eb377e8414
Deleted: sha256:b4b09b32b1482b782a123ceee0c565c412530fd4dac01ace02e3ed121d963681
Deleted: sha256:4e4d0946271920e2b3928a45762b36b2b4ca59174bd90641b5ee6b41a5e1deee
Deleted: sha256:533319ae9ef75548f941f0469c01cf73a8f536a50ed3b152034996589925d46b
Deleted: sha256:52d540649f9b5c0d3c61bcd122d987a82a56cf9dd9075bdfa13a63bf21d4f15d
Deleted: sha256:d9a28705c04a88ace4a7c336bb4b550182d7723c9d100ab33e50e3b18140c94a
Deleted: sha256:27db59d383778254d9e384b29f9db0830c9e73b6605966aa55ba058870ab7b28
Deleted: sha256:76d83a11998cf4c64588c9b3221d1c62897e08c45a912501af081e0e00b828a7
Deleted: sha256:51a23e2088635f5eb46154b289c059130c65b73de04122e85cbdad4ac46600e4
Deleted: sha256:cb568c8a6f5df2d4a5885b12380f23134f2e294b93f95c0ee20a8ba7c5f85416
Deleted: sha256:1fba55b6ea4180f6d9e60afaef90a0834f9ce269c9400d98ce08516ebbd4f34d
Deleted: sha256:3dcfe5eef01ec9b67df9974613c22f889f593a6597dfa8a4e027c6926153e938
Deleted: sha256:5ee3011909764c73cafcfcc04be6add41686ac0c695f0260dbbb458a761283aa
Build step 'Execute shell' marked build as failure

Mime
View raw message