mesos-builds mailing list archives

Site index · List index
Message view « Date » · « Thread »
Top « Date » · « Thread »
From Apache Jenkins Server <jenk...@builds.apache.org>
Subject Build failed in Jenkins: mesos-reviewbot #15481
Date Sat, 01 Oct 2016 12:52:23 GMT
See <https://builds.apache.org/job/mesos-reviewbot/15481/>

------------------------------------------
[...truncated 205820 lines...]
W1001 12:51:51.407851 29116 backend.cpp:75] Failed to create 'bind' backend: BindBackend requires
root privileges
I1001 12:51:51.411581 29140 slave.cpp:208] Mesos agent started on (607)@172.17.0.2:49758
I1001 12:51:51.411613 29140 slave.cpp:209] Flags at startup: --acls="" --appc_simple_discovery_uri_prefix="http://"
--appc_store_dir="/tmp/mesos/store/appc" --authenticate_http_readonly="true" --authenticate_http_readwrite="true"
--authenticatee="crammd5" --authentication_backoff_factor="1secs" --authorizer="local" --cgroups_cpu_enable_pids_and_tids_count="false"
--cgroups_enable_cfs="false" --cgroups_hierarchy="/sys/fs/cgroup" --cgroups_limit_swap="false"
--cgroups_root="mesos" --container_disk_watch_interval="15secs" --containerizers="mesos" --credential="/tmp/Endpoint_SlaveEndpointTest_AuthorizedRequest_1_UeR0Bl/credential"
--default_role="*" --disk_watch_interval="1mins" --docker="docker" --docker_kill_orphans="true"
--docker_registry="https://registry-1.docker.io" --docker_remove_delay="6hrs" --docker_socket="/var/run/docker.sock"
--docker_stop_timeout="0ns" --docker_store_dir="/tmp/mesos/store/docker" --docker_volume_checkpoint_dir="/var/run/mesos/isolators/docker/volume"
--enforce_container_disk_quota="false" --executor_registration_timeout="1mins" --executor_shutdown_grace_period="5secs"
--fetcher_cache_dir="/tmp/Endpoint_SlaveEndpointTest_AuthorizedRequest_1_UeR0Bl/fetch" --fetcher_cache_size="2GB"
--frameworks_home="" --gc_delay="1weeks" --gc_disk_headroom="0.1" --hadoop_home="" --help="false"
--hostname_lookup="true" --http_authenticators="basic" --http_command_executor="false" --http_credentials="/tmp/Endpoint_SlaveEndpointTest_AuthorizedRequest_1_UeR0Bl/http_credentials"
--image_provisioner_backend="copy" --initialize_driver_logging="true" --isolation="posix/cpu,posix/mem"
--launcher="posix" --launcher_dir="/mesos/mesos-1.1.0/_build/src" --logbufsecs="0" --logging_level="INFO"
--oversubscribed_resources_interval="15secs" --perf_duration="10secs" --perf_interval="1mins"
--qos_correction_interval_min="0ns" --quiet="false" --recover="reconnect" --recovery_timeout="15mins"
--registration_backoff_factor="10ms" --resources="cpus:2;gpus:0;mem:1024;disk:1024;ports:[31000-32000]"
--revocable_cpu_low_priority="true" --runtime_dir="/tmp/Endpoint_SlaveEndpointTest_AuthorizedRequest_1_UeR0Bl"
--sandbox_directory="/mnt/mesos/sandbox" --strict="true" --switch_user="true" --systemd_enable_support="true"
--systemd_runtime_directory="/run/systemd/system" --version="false" --work_dir="/tmp/Endpoint_SlaveEndpointTest_AuthorizedRequest_1_sdyKX9"
I1001 12:51:51.412328 29140 credentials.hpp:86] Loading credential for authentication from
'/tmp/Endpoint_SlaveEndpointTest_AuthorizedRequest_1_UeR0Bl/credential'
I1001 12:51:51.412575 29140 slave.cpp:346] Agent using credential for: test-principal
I1001 12:51:51.412603 29140 credentials.hpp:37] Loading credentials for authentication from
'/tmp/Endpoint_SlaveEndpointTest_AuthorizedRequest_1_UeR0Bl/http_credentials'
I1001 12:51:51.412921 29140 http.cpp:883] Using default 'basic' HTTP authenticator for realm
'mesos-agent-readonly'
I1001 12:51:51.413075 29140 http.cpp:883] Using default 'basic' HTTP authenticator for realm
'mesos-agent-readwrite'
I1001 12:51:51.414289 29140 slave.cpp:533] Agent resources: cpus(*):2; mem(*):1024; disk(*):1024;
ports(*):[31000-32000]
I1001 12:51:51.414391 29140 slave.cpp:541] Agent attributes: [  ]
I1001 12:51:51.414409 29140 slave.cpp:546] Agent hostname: a275b475f56e
I1001 12:51:51.415932 29147 state.cpp:57] Recovering state from '/tmp/Endpoint_SlaveEndpointTest_AuthorizedRequest_1_sdyKX9/meta'
I1001 12:51:51.416002 29140 process.cpp:3377] Handling HTTP event for process 'slave(607)'
with path: '/slave(607)/monitor/statistics.json'
I1001 12:51:51.416501 29138 status_update_manager.cpp:203] Recovering status update manager
I1001 12:51:51.416648 29136 containerizer.cpp:581] Recovering containerizer
I1001 12:51:51.416959 29149 http.cpp:835] Authorizing principal 'test-principal' to GET the
'/monitor/statistics.json' endpoint
I1001 12:51:51.418195 29143 provisioner.cpp:253] Provisioner recovery complete
I1001 12:51:51.418522 29146 slave.cpp:5256] Finished recovery
I1001 12:51:51.419039 29146 slave.cpp:5428] Querying resource estimator for oversubscribable
resources
I1001 12:51:51.419307 29136 slave.cpp:5442] Received oversubscribable resources {} from the
resource estimator
I1001 12:51:51.420689 29145 slave.cpp:787] Agent terminating
[       OK ] Endpoint/SlaveEndpointTest.AuthorizedRequest/1 (24 ms)
[ RUN      ] Endpoint/SlaveEndpointTest.AuthorizedRequest/2
I1001 12:51:51.431450 29116 containerizer.cpp:227] Using isolation: posix/cpu,posix/mem,filesystem/posix,network/cni
W1001 12:51:51.431995 29116 backend.cpp:75] Failed to create 'aufs' backend: AufsBackend requires
root privileges, but is running as user mesos
W1001 12:51:51.432170 29116 backend.cpp:75] Failed to create 'bind' backend: BindBackend requires
root privileges
I1001 12:51:51.434995 29147 slave.cpp:208] Mesos agent started on (608)@172.17.0.2:49758
I1001 12:51:51.435025 29147 slave.cpp:209] Flags at startup: --acls="" --appc_simple_discovery_uri_prefix="http://"
--appc_store_dir="/tmp/mesos/store/appc" --authenticate_http_readonly="true" --authenticate_http_readwrite="true"
--authenticatee="crammd5" --authentication_backoff_factor="1secs" --authorizer="local" --cgroups_cpu_enable_pids_and_tids_count="false"
--cgroups_enable_cfs="false" --cgroups_hierarchy="/sys/fs/cgroup" --cgroups_limit_swap="false"
--cgroups_root="mesos" --container_disk_watch_interval="15secs" --containerizers="mesos" --credential="/tmp/Endpoint_SlaveEndpointTest_AuthorizedRequest_2_y31Yq6/credential"
--default_role="*" --disk_watch_interval="1mins" --docker="docker" --docker_kill_orphans="true"
--docker_registry="https://registry-1.docker.io" --docker_remove_delay="6hrs" --docker_socket="/var/run/docker.sock"
--docker_stop_timeout="0ns" --docker_store_dir="/tmp/mesos/store/docker" --docker_volume_checkpoint_dir="/var/run/mesos/isolators/docker/volume"
--enforce_container_disk_quota="false" --executor_registration_timeout="1mins" --executor_shutdown_grace_period="5secs"
--fetcher_cache_dir="/tmp/Endpoint_SlaveEndpointTest_AuthorizedRequest_2_y31Yq6/fetch" --fetcher_cache_size="2GB"
--frameworks_home="" --gc_delay="1weeks" --gc_disk_headroom="0.1" --hadoop_home="" --help="true"
--hostname_lookup="true" --http_authenticators="basic" --http_command_executor="false" --http_credentials="/tmp/Endpoint_SlaveEndpointTest_AuthorizedRequest_2_y31Yq6/http_credentials"
--image_provisioner_backend="copy" --initialize_driver_logging="true" --isolation="posix/cpu,posix/mem"
--launcher="posix" --launcher_dir="/mesos/mesos-1.1.0/_build/src" --logbufsecs="0" --logging_level="INFO"
--oversubscribed_resources_interval="15secs" --perf_duration="10secs" --perf_interval="1mins"
--qos_correction_interval_min="0ns" --quiet="false" --recover="reconnect" --recovery_timeout="15mins"
--registration_backoff_factor="10ms" --resources="cpus:2;gpus:0;mem:1024;disk:1024;ports:[31000-32000]"
--revocable_cpu_low_priority="true" --runtime_dir="/tmp/Endpoint_SlaveEndpointTest_AuthorizedRequest_2_y31Yq6"
--sandbox_directory="/mnt/mesos/sandbox" --strict="true" --switch_user="true" --systemd_enable_support="true"
--systemd_runtime_directory="/run/systemd/system" --version="false" --work_dir="/tmp/Endpoint_SlaveEndpointTest_AuthorizedRequest_2_0T8JIU"
I1001 12:51:51.435642 29147 credentials.hpp:86] Loading credential for authentication from
'/tmp/Endpoint_SlaveEndpointTest_AuthorizedRequest_2_y31Yq6/credential'
I1001 12:51:51.435864 29147 slave.cpp:346] Agent using credential for: test-principal
I1001 12:51:51.435894 29147 credentials.hpp:37] Loading credentials for authentication from
'/tmp/Endpoint_SlaveEndpointTest_AuthorizedRequest_2_y31Yq6/http_credentials'
I1001 12:51:51.436143 29147 http.cpp:883] Using default 'basic' HTTP authenticator for realm
'mesos-agent-readonly'
I1001 12:51:51.436298 29147 http.cpp:883] Using default 'basic' HTTP authenticator for realm
'mesos-agent-readwrite'
I1001 12:51:51.437412 29147 slave.cpp:533] Agent resources: cpus(*):2; mem(*):1024; disk(*):1024;
ports(*):[31000-32000]
I1001 12:51:51.437495 29147 slave.cpp:541] Agent attributes: [  ]
I1001 12:51:51.437516 29147 slave.cpp:546] Agent hostname: a275b475f56e
I1001 12:51:51.438796 29141 state.cpp:57] Recovering state from '/tmp/Endpoint_SlaveEndpointTest_AuthorizedRequest_2_0T8JIU/meta'
I1001 12:51:51.438858 29147 process.cpp:3377] Handling HTTP event for process 'slave(608)'
with path: '/slave(608)/containers'
I1001 12:51:51.439273 29138 status_update_manager.cpp:203] Recovering status update manager
I1001 12:51:51.439455 29145 containerizer.cpp:581] Recovering containerizer
I1001 12:51:51.439782 29150 http.cpp:835] Authorizing principal 'test-principal' to GET the
'/containers' endpoint
I1001 12:51:51.440982 29145 provisioner.cpp:253] Provisioner recovery complete
I1001 12:51:51.441225 29144 slave.cpp:5256] Finished recovery
I1001 12:51:51.441684 29144 slave.cpp:5428] Querying resource estimator for oversubscribable
resources
I1001 12:51:51.441951 29145 slave.cpp:5442] Received oversubscribable resources {} from the
resource estimator
I1001 12:51:51.443186 29141 slave.cpp:787] Agent terminating
[       OK ] Endpoint/SlaveEndpointTest.AuthorizedRequest/2 (21 ms)
[ RUN      ] Endpoint/SlaveEndpointTest.UnauthorizedRequest/0
I1001 12:51:51.452591 29116 containerizer.cpp:227] Using isolation: posix/cpu,posix/mem,filesystem/posix,network/cni
W1001 12:51:51.453282 29116 backend.cpp:75] Failed to create 'aufs' backend: AufsBackend requires
root privileges, but is running as user mesos
W1001 12:51:51.453441 29116 backend.cpp:75] Failed to create 'bind' backend: BindBackend requires
root privileges
I1001 12:51:51.456504 29146 slave.cpp:208] Mesos agent started on (609)@172.17.0.2:49758
I1001 12:51:51.456526 29146 slave.cpp:209] Flags at startup: --acls="" --appc_simple_discovery_uri_prefix="http://"
--appc_store_dir="/tmp/mesos/store/appc" --authenticate_http_readonly="true" --authenticate_http_readwrite="true"
--authenticatee="crammd5" --authentication_backoff_factor="1secs" --authorizer="local" --cgroups_cpu_enable_pids_and_tids_count="false"
--cgroups_enable_cfs="false" --cgroups_hierarchy="/sys/fs/cgroup" --cgroups_limit_swap="false"
--cgroups_root="mesos" --container_disk_watch_interval="15secs" --containerizers="mesos" --credential="/tmp/Endpoint_SlaveEndpointTest_UnauthorizedRequest_0_es4YtR/credential"
--default_role="*" --disk_watch_interval="1mins" --docker="docker" --docker_kill_orphans="true"
--docker_registry="https://registry-1.docker.io" --docker_remove_delay="6hrs" --docker_socket="/var/run/docker.sock"
--docker_stop_timeout="0ns" --docker_store_dir="/tmp/mesos/store/docker" --docker_volume_checkpoint_dir="/var/run/mesos/isolators/docker/volume"
--enforce_container_disk_quota="false" --executor_registration_timeout="1mins" --executor_shutdown_grace_period="5secs"
--fetcher_cache_dir="/tmp/Endpoint_SlaveEndpointTest_UnauthorizedRequest_0_es4YtR/fetch" --fetcher_cache_size="2GB"
--frameworks_home="" --gc_delay="1weeks" --gc_disk_headroom="0.1" --hadoop_home="" --help="true"
--hostname_lookup="true" --http_authenticators="basic" --http_command_executor="false" --http_credentials="/tmp/Endpoint_SlaveEndpointTest_UnauthorizedRequest_0_es4YtR/http_credentials"
--image_provisioner_backend="copy" --initialize_driver_logging="true" --isolation="posix/cpu,posix/mem"
--launcher="posix" --launcher_dir="/mesos/mesos-1.1.0/_build/src" --logbufsecs="0" --logging_level="INFO"
--oversubscribed_resources_interval="15secs" --perf_duration="10secs" --perf_interval="1mins"
--qos_correction_interval_min="0ns" --quiet="false" --recover="reconnect" --recovery_timeout="15mins"
--registration_backoff_factor="10ms" --resources="cpus:2;gpus:0;mem:1024;disk:1024;ports:[31000-32000]"
--revocable_cpu_low_priority="true" --runtime_dir="/tmp/Endpoint_SlaveEndpointTest_UnauthorizedRequest_0_es4YtR"
--sandbox_directory="/mnt/mesos/sandbox" --strict="true" --switch_user="true" --systemd_enable_support="true"
--systemd_runtime_directory="/run/systemd/system" --version="false" --work_dir="/tmp/Endpoint_SlaveEndpointTest_UnauthorizedRequest_0_0A3iIF"
I1001 12:51:51.457043 29146 credentials.hpp:86] Loading credential for authentication from
'/tmp/Endpoint_SlaveEndpointTest_UnauthorizedRequest_0_es4YtR/credential'
I1001 12:51:51.457252 29146 slave.cpp:346] Agent using credential for: test-principal
I1001 12:51:51.457280 29146 credentials.hpp:37] Loading credentials for authentication from
'/tmp/Endpoint_SlaveEndpointTest_UnauthorizedRequest_0_es4YtR/http_credentials'
I1001 12:51:51.457583 29146 http.cpp:883] Using default 'basic' HTTP authenticator for realm
'mesos-agent-readonly'
I1001 12:51:51.457729 29146 http.cpp:883] Using default 'basic' HTTP authenticator for realm
'mesos-agent-readwrite'
I1001 12:51:51.458794 29146 slave.cpp:533] Agent resources: cpus(*):2; mem(*):1024; disk(*):1024;
ports(*):[31000-32000]
I1001 12:51:51.458868 29146 slave.cpp:541] Agent attributes: [  ]
I1001 12:51:51.458879 29146 slave.cpp:546] Agent hostname: a275b475f56e
I1001 12:51:51.460047 29138 state.cpp:57] Recovering state from '/tmp/Endpoint_SlaveEndpointTest_UnauthorizedRequest_0_0A3iIF/meta'
I1001 12:51:51.460095 29146 process.cpp:3377] Handling HTTP event for process 'slave(609)'
with path: '/slave(609)/monitor/statistics'
I1001 12:51:51.460517 29140 status_update_manager.cpp:203] Recovering status update manager
I1001 12:51:51.460736 29143 containerizer.cpp:581] Recovering containerizer
I1001 12:51:51.460796 29137 http.cpp:835] Authorizing principal 'test-principal' to GET the
'/monitor/statistics' endpoint
I1001 12:51:51.461845 29144 provisioner.cpp:253] Provisioner recovery complete
I1001 12:51:51.462184 29142 slave.cpp:5256] Finished recovery
I1001 12:51:51.462637 29142 slave.cpp:5428] Querying resource estimator for oversubscribable
resources
I1001 12:51:51.462857 29149 slave.cpp:5442] Received oversubscribable resources {} from the
resource estimator
I1001 12:51:51.462954 29149 slave.cpp:787] Agent terminating
[       OK ] Endpoint/SlaveEndpointTest.UnauthorizedRequest/0 (18 ms)
[ RUN      ] Endpoint/SlaveEndpointTest.UnauthorizedRequest/1
I1001 12:51:51.470554 29116 containerizer.cpp:227] Using isolation: posix/cpu,posix/mem,filesystem/posix,network/cni
W1001 12:51:51.471207 29116 backend.cpp:75] Failed to create 'aufs' backend: AufsBackend requires
root privileges, but is running as user mesos
W1001 12:51:51.471405 29116 backend.cpp:75] Failed to create 'bind' backend: BindBackend requires
root privileges
I1001 12:51:51.474498 29139 slave.cpp:208] Mesos agent started on (610)@172.17.0.2:49758
I1001 12:51:51.474520 29139 slave.cpp:209] Flags at startup: --acls="" --appc_simple_discovery_uri_prefix="http://"
--appc_store_dir="/tmp/mesos/store/appc" --authenticate_http_readonly="true" --authenticate_http_readwrite="true"
--authenticatee="crammd5" --authentication_backoff_factor="1secs" --authorizer="local" --cgroups_cpu_enable_pids_and_tids_count="false"
--cgroups_enable_cfs="false" --cgroups_hierarchy="/sys/fs/cgroup" --cgroups_limit_swap="false"
--cgroups_root="mesos" --container_disk_watch_interval="15secs" --containerizers="mesos" --credential="/tmp/Endpoint_SlaveEndpointTest_UnauthorizedRequest_1_4gCBJC/credential"
--default_role="*" --disk_watch_interval="1mins" --docker="docker" --docker_kill_orphans="true"
--docker_registry="https://registry-1.docker.io" --docker_remove_delay="6hrs" --docker_socket="/var/run/docker.sock"
--docker_stop_timeout="0ns" --docker_store_dir="/tmp/mesos/store/docker" --docker_volume_checkpoint_dir="/var/run/mesos/isolators/docker/volume"
--enforce_container_disk_quota="false" --executor_registration_timeout="1mins" --executor_shutdown_grace_period="5secs"
--fetcher_cache_dir="/tmp/Endpoint_SlaveEndpointTest_UnauthorizedRequest_1_4gCBJC/fetch" --fetcher_cache_size="2GB"
--frameworks_home="" --gc_delay="1weeks" --gc_disk_headroom="0.1" --hadoop_home="" --help="true"
--hostname_lookup="true" --http_authenticators="basic" --http_command_executor="false" --http_credentials="/tmp/Endpoint_SlaveEndpointTest_UnauthorizedRequest_1_4gCBJC/http_credentials"
--image_provisioner_backend="copy" --initialize_driver_logging="true" --isolation="posix/cpu,posix/mem"
--launcher="posix" --launcher_dir="/mesos/mesos-1.1.0/_build/src" --logbufsecs="0" --logging_level="INFO"
--oversubscribed_resources_interval="15secs" --perf_duration="10secs" --perf_interval="1mins"
--qos_correction_interval_min="0ns" --quiet="false" --recover="reconnect" --recovery_timeout="15mins"
--registration_backoff_factor="10ms" --resources="cpus:2;gpus:0;mem:1024;disk:1024;ports:[31000-32000]"
--revocable_cpu_low_priority="true" --runtime_dir="/tmp/Endpoint_SlaveEndpointTest_UnauthorizedRequest_1_4gCBJC"
--sandbox_directory="/mnt/mesos/sandbox" --strict="true" --switch_user="true" --systemd_enable_support="true"
--systemd_runtime_directory="/run/systemd/system" --version="false" --work_dir="/tmp/Endpoint_SlaveEndpointTest_UnauthorizedRequest_1_QLPSUq"
I1001 12:51:51.474997 29139 credentials.hpp:86] Loading credential for authentication from
'/tmp/Endpoint_SlaveEndpointTest_UnauthorizedRequest_1_4gCBJC/credential'
I1001 12:51:51.475201 29139 slave.cpp:346] Agent using credential for: test-principal
I1001 12:51:51.475232 29139 credentials.hpp:37] Loading credentials for authentication from
'/tmp/Endpoint_SlaveEndpointTest_UnauthorizedRequest_1_4gCBJC/http_credentials'
I1001 12:51:51.475580 29139 http.cpp:883] Using default 'basic' HTTP authenticator for realm
'mesos-agent-readonly'
I1001 12:51:51.475760 29139 http.cpp:883] Using default 'basic' HTTP authenticator for realm
'mesos-agent-readwrite'
I1001 12:51:51.477192 29139 slave.cpp:533] Agent resources: cpus(*):2; mem(*):1024; disk(*):1024;
ports(*):[31000-32000]
I1001 12:51:51.477295 29139 slave.cpp:541] Agent attributes: [  ]
I1001 12:51:51.477309 29139 slave.cpp:546] Agent hostname: a275b475f56e
I1001 12:51:51.478662 29135 state.cpp:57] Recovering state from '/tmp/Endpoint_SlaveEndpointTest_UnauthorizedRequest_1_QLPSUq/meta'
I1001 12:51:51.478716 29139 process.cpp:3377] Handling HTTP event for process 'slave(610)'
with path: '/slave(610)/monitor/statistics.json'
I1001 12:51:51.479157 29142 status_update_manager.cpp:203] Recovering status update manager
I1001 12:51:51.479352 29135 containerizer.cpp:581] Recovering containerizer
I1001 12:51:51.479734 29149 http.cpp:835] Authorizing principal 'test-principal' to GET the
'/monitor/statistics.json' endpoint
I1001 12:51:51.481281 29135 provisioner.cpp:253] Provisioner recovery complete
I1001 12:51:51.481679 29145 slave.cpp:5256] Finished recovery
I1001 12:51:51.482244 29145 slave.cpp:5428] Querying resource estimator for oversubscribable
resources
I1001 12:51:51.482573 29138 slave.cpp:5442] Received oversubscribable resources {} from the
resource estimator
I1001 12:51:51.482847 29150 slave.cpp:787] Agent terminating
[       OK ] Endpoint/SlaveEndpointTest.UnauthorizedRequest/1 (21 ms)
[ RUN      ] Endpoint/SlaveEndpointTest.UnauthorizedRequest/2
I1001 12:51:51.493350 29116 containerizer.cpp:227] Using isolation: posix/cpu,posix/mem,filesystem/posix,network/cni
W1001 12:51:51.493973 29116 backend.cpp:75] Failed to create 'aufs' backend: AufsBackend requires
root privileges, but is running as user mesos
W1001 12:51:51.494132 29116 backend.cpp:75] Failed to create 'bind' backend: BindBackend requires
root privileges
I1001 12:51:51.496951 29136 slave.cpp:208] Mesos agent started on (611)@172.17.0.2:49758
I1001 12:51:51.497009 29136 slave.cpp:209] Flags at startup: --acls="" --appc_simple_discovery_uri_prefix="http://"
--appc_store_dir="/tmp/mesos/store/appc" --authenticate_http_readonly="true" --authenticate_http_readwrite="true"
--authenticatee="crammd5" --authentication_backoff_factor="1secs" --authorizer="local" --cgroups_cpu_enable_pids_and_tids_count="false"
--cgroups_enable_cfs="false" --cgroups_hierarchy="/sys/fs/cgroup" --cgroups_limit_swap="false"
--cgroups_root="mesos" --container_disk_watch_interval="15secs" --containerizers="mesos" --credential="/tmp/Endpoint_SlaveEndpointTest_UnauthorizedRequest_2_oFKado/credential"
--default_role="*" --disk_watch_interval="1mins" --docker="docker" --docker_kill_orphans="true"
--docker_registry="https://registry-1.docker.io" --docker_remove_delay="6hrs" --docker_socket="/var/run/docker.sock"
--docker_stop_timeout="0ns" --docker_store_dir="/tmp/mesos/store/docker" --docker_volume_checkpoint_dir="/var/run/mesos/isolators/docker/volume"
--enforce_container_disk_quota="false" --executor_registration_timeout="1mins" --executor_shutdown_grace_period="5secs"
--fetcher_cache_dir="/tmp/Endpoint_SlaveEndpointTest_UnauthorizedRequest_2_oFKado/fetch" --fetcher_cache_size="2GB"
--frameworks_home="" --gc_delay="1weeks" --gc_disk_headroom="0.1" --hadoop_home="" --help="true"
--hostname_lookup="true" --http_authenticators="basic" --http_command_executor="false" --http_credentials="/tmp/Endpoint_SlaveEndpointTest_UnauthorizedRequest_2_oFKado/http_credentials"
--image_provisioner_backend="copy" --initialize_driver_logging="true" --isolation="posix/cpu,posix/mem"
--launcher="posix" --launcher_dir="/mesos/mesos-1.1.0/_build/src" --logbufsecs="0" --logging_level="INFO"
--oversubscribed_resources_interval="15secs" --perf_duration="10secs" --perf_interval="1mins"
--qos_correction_interval_min="0ns" --quiet="false" --recover="reconnect" --recovery_timeout="15mins"
--registration_backoff_factor="10ms" --resources="cpus:2;gpus:0;mem:1024;disk:1024;ports:[31000-32000]"
--revocable_cpu_low_priority="true" --runtime_dir="/tmp/Endpoint_SlaveEndpointTest_UnauthorizedRequest_2_oFKado"
--sandbox_directory="/mnt/mesos/sandbox" --strict="true" --switch_user="true" --systemd_enable_support="true"
--systemd_runtime_directory="/run/systemd/system" --version="false" --work_dir="/tmp/Endpoint_SlaveEndpointTest_UnauthorizedRequest_2_M2qPkc"
I1001 12:51:51.497505 29136 credentials.hpp:86] Loading credential for authentication from
'/tmp/Endpoint_SlaveEndpointTest_UnauthorizedRequest_2_oFKado/credential'
I1001 12:51:51.497675 29136 slave.cpp:346] Agent using credential for: test-principal
I1001 12:51:51.497702 29136 credentials.hpp:37] Loading credentials for authentication from
'/tmp/Endpoint_SlaveEndpointTest_UnauthorizedRequest_2_oFKado/http_credentials'
I1001 12:51:51.497952 29136 http.cpp:883] Using default 'basic' HTTP authenticator for realm
'mesos-agent-readonly'
I1001 12:51:51.498085 29136 http.cpp:883] Using default 'basic' HTTP authenticator for realm
'mesos-agent-readwrite'
I1001 12:51:51.499419 29136 slave.cpp:533] Agent resources: cpus(*):2; mem(*):1024; disk(*):1024;
ports(*):[31000-32000]
I1001 12:51:51.499524 29136 slave.cpp:541] Agent attributes: [  ]
I1001 12:51:51.499550 29136 slave.cpp:546] Agent hostname: a275b475f56e
I1001 12:51:51.501060 29139 state.cpp:57] Recovering state from '/tmp/Endpoint_SlaveEndpointTest_UnauthorizedRequest_2_M2qPkc/meta'
I1001 12:51:51.501106 29136 process.cpp:3377] Handling HTTP event for process 'slave(611)'
with path: '/slave(611)/containers'
I1001 12:51:51.501629 29135 status_update_manager.cpp:203] Recovering status update manager
I1001 12:51:51.501837 29150 containerizer.cpp:581] Recovering containerizer
I1001 12:51:51.502215 29144 http.cpp:835] Authorizing principal 'test-principal' to GET the
'/containers' endpoint
I1001 12:51:51.503240 29137 provisioner.cpp:253] Provisioner recovery complete
I1001 12:51:51.503693 29135 slave.cpp:5256] Finished recovery
I1001 12:51:51.504184 29135 slave.cpp:5428] Querying resource estimator for oversubscribable
resources
I1001 12:51:51.504541 29147 slave.cpp:5442] Received oversubscribable resources {} from the
resource estimator
I1001 12:51:51.505614 29149 slave.cpp:787] Agent terminating
[       OK ] Endpoint/SlaveEndpointTest.UnauthorizedRequest/2 (21 ms)
[ RUN      ] Endpoint/SlaveEndpointTest.NoAuthorizer/0
I1001 12:51:51.515902 29116 containerizer.cpp:227] Using isolation: posix/cpu,posix/mem,filesystem/posix,network/cni
W1001 12:51:51.516424 29116 backend.cpp:75] Failed to create 'aufs' backend: AufsBackend requires
root privileges, but is running as user mesos
W1001 12:51:51.516578 29116 backend.cpp:75] Failed to create 'bind' backend: BindBackend requires
root privileges
I1001 12:51:51.517647 29116 cluster.cpp:435] Creating default 'local' authorizer
I1001 12:51:51.519047 29139 slave.cpp:208] Mesos agent started on (612)@172.17.0.2:49758
I1001 12:51:51.519068 29139 slave.cpp:209] Flags at startup: --acls="" --appc_simple_discovery_uri_prefix="http://"
--appc_store_dir="/tmp/mesos/store/appc" --authenticate_http_readonly="true" --authenticate_http_readwrite="true"
--authenticatee="crammd5" --authentication_backoff_factor="1secs" --authorizer="local" --cgroups_cpu_enable_pids_and_tids_count="false"
--cgroups_enable_cfs="false" --cgroups_hierarchy="/sys/fs/cgroup" --cgroups_limit_swap="false"
--cgroups_root="mesos" --container_disk_watch_interval="15secs" --containerizers="mesos" --credential="/tmp/Endpoint_SlaveEndpointTest_NoAuthorizer_0_Cb55U9/credential"
--default_role="*" --disk_watch_interval="1mins" --docker="docker" --docker_kill_orphans="true"
--docker_registry="https://registry-1.docker.io" --docker_remove_delay="6hrs" --docker_socket="/var/run/docker.sock"
--docker_stop_timeout="0ns" --docker_store_dir="/tmp/mesos/store/docker" --docker_volume_checkpoint_dir="/var/run/mesos/isolators/docker/volume"
--enforce_container_disk_quota="false" --executor_registration_timeout="1mins" --executor_shutdown_grace_period="5secs"
--fetcher_cache_dir="/tmp/Endpoint_SlaveEndpointTest_NoAuthorizer_0_Cb55U9/fetch" --fetcher_cache_size="2GB"
--frameworks_home="" --gc_delay="1weeks" --gc_disk_headroom="0.1" --hadoop_home="" --help="false"
--hostname_lookup="true" --http_authenticators="basic" --http_command_executor="false" --http_credentials="/tmp/Endpoint_SlaveEndpointTest_NoAuthorizer_0_Cb55U9/http_credentials"
--image_provisioner_backend="copy" --initialize_driver_logging="true" --isolation="posix/cpu,posix/mem"
--launcher="posix" --launcher_dir="/mesos/mesos-1.1.0/_build/src" --logbufsecs="0" --logging_level="INFO"
--oversubscribed_resources_interval="15secs" --perf_duration="10secs" --perf_interval="1mins"
--qos_correction_interval_min="0ns" --quiet="false" --recover="reconnect" --recovery_timeout="15mins"
--registration_backoff_factor="10ms" --resources="cpus:2;gpus:0;mem:1024;disk:1024;ports:[31000-32000]"
--revocable_cpu_low_priority="true" --runtime_dir="/tmp/Endpoint_SlaveEndpointTest_NoAuthorizer_0_Cb55U9"
--sandbox_directory="/mnt/mesos/sandbox" --strict="true" --switch_user="true" --systemd_enable_support="true"
--systemd_runtime_directory="/run/systemd/system" --version="false" --work_dir="/tmp/Endpoint_SlaveEndpointTest_NoAuthorizer_0_OxU9YX"
I1001 12:51:51.519546 29139 credentials.hpp:86] Loading credential for authentication from
'/tmp/Endpoint_SlaveEndpointTest_NoAuthorizer_0_Cb55U9/credential'
I1001 12:51:51.519690 29139 slave.cpp:346] Agent using credential for: test-principal
I1001 12:51:51.519716 29139 credentials.hpp:37] Loading credentials for authentication from
'/tmp/Endpoint_SlaveEndpointTest_NoAuthorizer_0_Cb55U9/http_credentials'
I1001 12:51:51.519944 29139 http.cpp:883] Using default 'basic' HTTP authenticator for realm
'mesos-agent-readonly'
I1001 12:51:51.520336 29139 http.cpp:883] Using default 'basic' HTTP authenticator for realm
'mesos-agent-readwrite'
I1001 12:51:51.521582 29139 slave.cpp:533] Agent resources: cpus(*):2; mem(*):1024; disk(*):1024;
ports(*):[31000-32000]
I1001 12:51:51.521687 29139 slave.cpp:541] Agent attributes: [  ]
I1001 12:51:51.521710 29139 slave.cpp:546] Agent hostname: a275b475f56e
I1001 12:51:51.523172 29137 state.cpp:57] Recovering state from '/tmp/Endpoint_SlaveEndpointTest_NoAuthorizer_0_OxU9YX/meta'
I1001 12:51:51.523257 29139 process.cpp:3377] Handling HTTP event for process 'slave(612)'
with path: '/slave(612)/monitor/statistics'
I1001 12:51:51.523790 29137 status_update_manager.cpp:203] Recovering status update manager
I1001 12:51:51.524073 29147 containerizer.cpp:581] Recovering containerizer
I1001 12:51:51.524220 29135 http.cpp:835] Authorizing principal 'test-principal' to GET the
'/monitor/statistics' endpoint
I1001 12:51:51.525503 29135 provisioner.cpp:253] Provisioner recovery complete
I1001 12:51:51.525969 29139 slave.cpp:5256] Finished recovery
I1001 12:51:51.526502 29139 slave.cpp:5428] Querying resource estimator for oversubscribable
resources
I1001 12:51:51.526768 29138 slave.cpp:5442] Received oversubscribable resources {} from the
resource estimator
I1001 12:51:51.528661 29148 slave.cpp:787] Agent terminating
[       OK ] Endpoint/SlaveEndpointTest.NoAuthorizer/0 (22 ms)
[ RUN      ] Endpoint/SlaveEndpointTest.NoAuthorizer/1
I1001 12:51:51.539099 29116 containerizer.cpp:227] Using isolation: posix/cpu,posix/mem,filesystem/posix,network/cni
W1001 12:51:51.539701 29116 backend.cpp:75] Failed to create 'aufs' backend: AufsBackend requires
root privileges, but is running as user mesos
W1001 12:51:51.539829 29116 backend.cpp:75] Failed to create 'bind' backend: BindBackend requires
root privileges
I1001 12:51:51.540925 29116 cluster.cpp:435] Creating default 'local' authorizer
I1001 12:51:51.542461 29149 slave.cpp:208] Mesos agent started on (613)@172.17.0.2:49758
I1001 12:51:51.542487 29149 slave.cpp:209] Flags at startup: --acls="" --appc_simple_discovery_uri_prefix="http://"
--appc_store_dir="/tmp/mesos/store/appc" --authenticate_http_readonly="true" --authenticate_http_readwrite="true"
--authenticatee="crammd5" --authentication_backoff_factor="1secs" --authorizer="local" --cgroups_cpu_enable_pids_and_tids_count="false"
--cgroups_enable_cfs="false" --cgroups_hierarchy="/sys/fs/cgroup" --cgroups_limit_swap="false"
--cgroups_root="mesos" --container_disk_watch_interval="15secs" --containerizers="mesos" --credential="/tmp/Endpoint_SlaveEndpointTest_NoAuthorizer_1_cBuTRV/credential"
--default_role="*" --disk_watch_interval="1mins" --docker="docker" --docker_kill_orphans="true"
--docker_registry="https://registry-1.docker.io" --docker_remove_delay="6hrs" --docker_socket="/var/run/docker.sock"
--docker_stop_timeout="0ns" --docker_store_dir="/tmp/mesos/store/docker" --docker_volume_checkpoint_dir="/var/run/mesos/isolators/docker/volume"
--enforce_container_disk_quota="false" --executor_registration_timeout="1mins" --executor_shutdown_grace_period="5secs"
--fetcher_cache_dir="/tmp/Endpoint_SlaveEndpointTest_NoAuthorizer_1_cBuTRV/fetch" --fetcher_cache_size="2GB"
--frameworks_home="" --gc_delay="1weeks" --gc_disk_headroom="0.1" --hadoop_home="" --help="false"
--hostname_lookup="true" --http_authenticators="basic" --http_command_executor="false" --http_credentials="/tmp/Endpoint_SlaveEndpointTest_NoAuthorizer_1_cBuTRV/http_credentials"
--image_provisioner_backend="copy" --initialize_driver_logging="true" --isolation="posix/cpu,posix/mem"
--launcher="posix" --launcher_dir="/mesos/mesos-1.1.0/_build/src" --logbufsecs="0" --logging_level="INFO"
--oversubscribed_resources_interval="15secs" --perf_duration="10secs" --perf_interval="1mins"
--qos_correction_interval_min="0ns" --quiet="false" --recover="reconnect" --recovery_timeout="15mins"
--registration_backoff_factor="10ms" --resources="cpus:2;gpus:0;mem:1024;disk:1024;ports:[31000-32000]"
--revocable_cpu_low_priority="true" --runtime_dir="/tmp/Endpoint_SlaveEndpointTest_NoAuthorizer_1_cBuTRV"
--sandbox_directory="/mnt/mesos/sandbox" --strict="true" --switch_user="true" --systemd_enable_support="true"
--systemd_runtime_directory="/run/systemd/system" --version="false" --work_dir="/tmp/Endpoint_SlaveEndpointTest_NoAuthorizer_1_2E5cSJ"
I1001 12:51:51.543118 29149 credentials.hpp:86] Loading credential for authentication from
'/tmp/Endpoint_SlaveEndpointTest_NoAuthorizer_1_cBuTRV/credential'
I1001 12:51:51.543320 29149 slave.cpp:346] Agent using credential for: test-principal
I1001 12:51:51.543347 29149 credentials.hpp:37] Loading credentials for authentication from
'/tmp/Endpoint_SlaveEndpointTest_NoAuthorizer_1_cBuTRV/http_credentials'
I1001 12:51:51.543612 29149 http.cpp:883] Using default 'basic' HTTP authenticator for realm
'mesos-agent-readonly'
I1001 12:51:51.543761 29149 http.cpp:883] Using default 'basic' HTTP authenticator for realm
'mesos-agent-readwrite'
I1001 12:51:51.544988 29149 slave.cpp:533] Agent resources: cpus(*):2; mem(*):1024; disk(*):1024;
ports(*):[31000-32000]
I1001 12:51:51.545063 29149 slave.cpp:541] Agent attributes: [  ]
I1001 12:51:51.545073 29149 slave.cpp:546] Agent hostname: a275b475f56e
I1001 12:51:51.546264 29143 state.cpp:57] Recovering state from '/tmp/Endpoint_SlaveEndpointTest_NoAuthorizer_1_2E5cSJ/meta'
I1001 12:51:51.546322 29149 process.cpp:3377] Handling HTTP event for process 'slave(613)'
with path: '/slave(613)/monitor/statistics.json'
I1001 12:51:51.546782 29142 status_update_manager.cpp:203] Recovering status update manager
I1001 12:51:51.546914 29149 containerizer.cpp:581] Recovering containerizer
I1001 12:51:51.547199 29135 http.cpp:835] Authorizing principal 'test-principal' to GET the
'/monitor/statistics.json' endpoint
I1001 12:51:51.548439 29135 provisioner.cpp:253] Provisioner recovery complete
I1001 12:51:51.549259 29147 slave.cpp:5256] Finished recovery
I1001 12:51:51.549789 29147 slave.cpp:5428] Querying resource estimator for oversubscribable
resources
I1001 12:51:51.550185 29142 slave.cpp:5442] Received oversubscribable resources {} from the
resource estimator
I1001 12:51:51.551311 29142 slave.cpp:787] Agent terminating
[       OK ] Endpoint/SlaveEndpointTest.NoAuthorizer/1 (23 ms)
[ RUN      ] Endpoint/SlaveEndpointTest.NoAuthorizer/2
I1001 12:51:51.563086 29116 containerizer.cpp:227] Using isolation: posix/cpu,posix/mem,filesystem/posix,network/cni
W1001 12:51:51.563752 29116 backend.cpp:75] Failed to create 'aufs' backend: AufsBackend requires
root privileges, but is running as user mesos
W1001 12:51:51.563917 29116 backend.cpp:75] Failed to create 'bind' backend: BindBackend requires
root privileges
I1001 12:51:51.564995 29116 cluster.cpp:435] Creating default 'local' authorizer
I1001 12:51:51.566468 29148 slave.cpp:208] Mesos agent started on (614)@172.17.0.2:49758
I1001 12:51:51.566488 29148 slave.cpp:209] Flags at startup: --acls="" --appc_simple_discovery_uri_prefix="http://"
--appc_store_dir="/tmp/mesos/store/appc" --authenticate_http_readonly="true" --authenticate_http_readwrite="true"
--authenticatee="crammd5" --authentication_backoff_factor="1secs" --authorizer="local" --cgroups_cpu_enable_pids_and_tids_count="false"
--cgroups_enable_cfs="false" --cgroups_hierarchy="/sys/fs/cgroup" --cgroups_limit_swap="false"
--cgroups_root="mesos" --container_disk_watch_interval="15secs" --containerizers="mesos" --credential="/tmp/Endpoint_SlaveEndpointTest_NoAuthorizer_2_eBb83H/credential"
--default_role="*" --disk_watch_interval="1mins" --docker="docker" --docker_kill_orphans="true"
--docker_registry="https://registry-1.docker.io" --docker_remove_delay="6hrs" --docker_socket="/var/run/docker.sock"
--docker_stop_timeout="0ns" --docker_store_dir="/tmp/mesos/store/docker" --docker_volume_checkpoint_dir="/var/run/mesos/isolators/docker/volume"
--enforce_container_disk_quota="false" --executor_registration_timeout="1mins" --executor_shutdown_grace_period="5secs"
--fetcher_cache_dir="/tmp/Endpoint_SlaveEndpointTest_NoAuthorizer_2_eBb83H/fetch" --fetcher_cache_size="2GB"
--frameworks_home="" --gc_delay="1weeks" --gc_disk_headroom="0.1" --hadoop_home="" --help="false"
--hostname_lookup="true" --http_authenticators="basic" --http_command_executor="false" --http_credentials="/tmp/Endpoint_SlaveEndpointTest_NoAuthorizer_2_eBb83H/http_credentials"
--image_provisioner_backend="copy" --initialize_driver_logging="true" --isolation="posix/cpu,posix/mem"
--launcher="posix" --launcher_dir="/mesos/mesos-1.1.0/_build/src" --logbufsecs="0" --logging_level="INFO"
--oversubscribed_resources_interval="15secs" --perf_duration="10secs" --perf_interval="1mins"
--qos_correction_interval_min="0ns" --quiet="false" --recover="reconnect" --recovery_timeout="15mins"
--registration_backoff_factor="10ms" --resources="cpus:2;gpus:0;mem:1024;disk:1024;ports:[31000-32000]"
--revocable_cpu_low_priority="true" --runtime_dir="/tmp/Endpoint_SlaveEndpointTest_NoAuthorizer_2_eBb83H"
--sandbox_directory="/mnt/mesos/sandbox" --strict="true" --switch_user="true" --systemd_enable_support="true"
--systemd_runtime_directory="/run/systemd/system" --version="false" --work_dir="/tmp/Endpoint_SlaveEndpointTest_NoAuthorizer_2_2sOy0v"
I1001 12:51:51.566907 29148 credentials.hpp:86] Loading credential for authentication from
'/tmp/Endpoint_SlaveEndpointTest_NoAuthorizer_2_eBb83H/credential'
I1001 12:51:51.567067 29148 slave.cpp:346] Agent using credential for: test-principal
I1001 12:51:51.567088 29148 credentials.hpp:37] Loading credentials for authentication from
'/tmp/Endpoint_SlaveEndpointTest_NoAuthorizer_2_eBb83H/http_credentials'
I1001 12:51:51.567409 29148 http.cpp:883] Using default 'basic' HTTP authenticator for realm
'mesos-agent-readonly'
I1001 12:51:51.567615 29148 http.cpp:883] Using default 'basic' HTTP authenticator for realm
'mesos-agent-readwrite'
I1001 12:51:51.569201 29148 slave.cpp:533] Agent resources: cpus(*):2; mem(*):1024; disk(*):1024;
ports(*):[31000-32000]
I1001 12:51:51.569303 29148 slave.cpp:541] Agent attributes: [  ]
I1001 12:51:51.569315 29148 slave.cpp:546] Agent hostname: a275b475f56e
I1001 12:51:51.571074 29145 state.cpp:57] Recovering state from '/tmp/Endpoint_SlaveEndpointTest_NoAuthorizer_2_2sOy0v/meta'
I1001 12:51:51.571130 29148 process.cpp:3377] Handling HTTP event for process 'slave(614)'
with path: '/slave(614)/containers'
I1001 12:51:51.571749 29137 status_update_manager.cpp:203] Recovering status update manager
I1001 12:51:51.572111 29142 containerizer.cpp:581] Recovering containerizer
I1001 12:51:51.572274 29148 http.cpp:835] Authorizing principal 'test-principal' to GET the
'/containers' endpoint
I1001 12:51:51.573807 29139 provisioner.cpp:253] Provisioner recovery complete
I1001 12:51:51.574126 29136 slave.cpp:5256] Finished recovery
I1001 12:51:51.574789 29136 slave.cpp:5428] Querying resource estimator for oversubscribable
resources
I1001 12:51:51.575093 29135 slave.cpp:5442] Received oversubscribable resources {} from the
resource estimator
I1001 12:51:51.575983 29135 slave.cpp:787] Agent terminating
[       OK ] Endpoint/SlaveEndpointTest.NoAuthorizer/2 (22 ms)
[----------] 9 tests from Endpoint/SlaveEndpointTest (204 ms total)

[----------] Global test environment tear-down
[==========] 1342 tests from 153 test cases ran. (501395 ms total)
[  PASSED  ] 1339 tests.
[  FAILED  ] 3 tests, listed below:
[  FAILED  ] MasterTest.TaskStatusLabels
[  FAILED  ] ReconciliationTest.PendingTask
[  FAILED  ] DiskResource/PersistentVolumeTest.SlaveRecovery/0, where GetParam() = 0

 3 FAILED TESTS
  YOU HAVE 6 DISABLED TESTS

make[4]: *** [check-local] Error 1
make[4]: Leaving directory `/mesos/mesos-1.1.0/_build/src'
make[3]: *** [check-am] Error 2
make[3]: Leaving directory `/mesos/mesos-1.1.0/_build/src'
make[2]: *** [check] Error 2
make[2]: Leaving directory `/mesos/mesos-1.1.0/_build/src'
make[1]: *** [check-recursive] Error 1
make[1]: Leaving directory `/mesos/mesos-1.1.0/_build'
make: *** [distcheck] Error 1
+ docker rmi mesos-1475324019-9974
Untagged: mesos-1475324019-9974:latest
Deleted: sha256:0e91788ea85bb095b4555ad09e77bf74054f24eb9592cfd5d41eddd2270bcc3f
Deleted: sha256:2fd7e3e703c219923c831a54caf0dde555c83659d695c572a69453e79f09b60b
Deleted: sha256:6ae35f69a3e3776647ae8b895ed1864fcf4c250f281fffa9f7d3b65d50ea150c
Deleted: sha256:2d9d33e3f9ad85749ab83558a87485bd8071008d664dd96e7fbc568cb8377f2c
Deleted: sha256:4f39f2878d128565d34766a0bbfb4568852403c2a6a61e46a984ecc8d215edb4
Deleted: sha256:a29c7044e123f919d2707ecc6a55de8687e3587264d2aaa6c746221bffd98154
Deleted: sha256:f3461ffa2d28fc9a52586cf6c27198004cb792a981add3a21d6c1801d3372dd5
Deleted: sha256:7d2a48ffdb43cfff5b7d248df3417fdae67a7fc8de4b3bb147eb7f5e30949062
Deleted: sha256:03101b014ab348a63b6cc9182759369ded32124fa77b98e1b81dd09ce74a24ba
Deleted: sha256:5c84ed4185051be56325c601be5abd6fa81c416083e1460267dca87e32512acb
Deleted: sha256:26721c328b7c4b3bfb36677511c3113dd8323f628a285609e9ca1d66061f4b8c
Deleted: sha256:70c5a6a1a160ec7df2c87b57f3893707b84595d7ae71d8f328d66a1e863b5e5a
Deleted: sha256:d4c92a8c97c748b54a42ded4b40ad783ed23a226a8add9a603e8fd761f232c41
Deleted: sha256:3c43ad10603716e1cba12f5ce15aa894b9130133f571966b78234840ecb48bfa
Deleted: sha256:d08b07cdbf794d57e889489be7f12b02d30f12695b8860a734dd1bbd9ea7ee56
Deleted: sha256:3f9e971b07037a2289b9dcefebca137e7ad4ace4b7c5a04788a47b725eda623d
Deleted: sha256:a81166e40e2d073fc112f2ad8400ee9fc8126ef4b9335acf72209a215f100931
Deleted: sha256:5c8304699bb8c9a588df0f09c5d32c7a6c9fb114835a883985f6ccb88717cc7a
Deleted: sha256:dc307ea52cdd7b87b0865f187d9946f737c010cfb4b8e7ff77be23864d51829d
Deleted: sha256:9c082c8ca007143aeb30acd0bbc183812054b95d6b9e946a3af8cb91b568ca30
Deleted: sha256:c77bb7660f883deba94ce9b3cea4f16457ea121715e3d5b24098f00f8292e61a
Deleted: sha256:c70cf84e7ddef510cf9d5fc16bc4ca46954d72f0cbf1db0917cbe956462db67b
Deleted: sha256:57f48087107137b3c383fd1bafe8815fd73bb888062e31f82aec07a202de7c0f
Deleted: sha256:b94b8468e4ad533eeace1458383f88afb348deec093e4e5c43e1a8d4f22cd2ca
Build step 'Execute shell' marked build as failure

Mime
View raw message