mesos-builds mailing list archives

Site index · List index
Message view « Date » · « Thread »
Top « Date » · « Thread »
From Apache Jenkins Server <jenk...@builds.apache.org>
Subject Build failed in Jenkins: Mesos » autotools,clang,--verbose,GLOG_v=1 MESOS_VERBOSE=1,ubuntu:14.04,(docker||Hadoop)&&(!ubuntu-us1)&&(!ubuntu-6) #2770
Date Wed, 12 Oct 2016 20:35:01 GMT
See <https://builds.apache.org/job/Mesos/BUILDTOOL=autotools,COMPILER=clang,CONFIGURATION=--verbose,ENVIRONMENT=GLOG_v=1%20MESOS_VERBOSE=1,OS=ubuntu%3A14.04,label_exp=(docker%7C%7CHadoop)&&(!ubuntu-us1)&&(!ubuntu-6)/2770/changes>

Changes:

[yujie.jay] Added fields `chain` and `excludeDevices` to `PortMapper`.

[yujie.jay] Added `PluginError` to simplify error reporting for CNI plugins.

[yujie.jay] Added the 'name' and 'args' field to the 'delegate' plugin's CNI config.

[yujie.jay] Added constants for CNI commands.

[yujie.jay] Updated signature of `delegate` and `execute` method.

------------------------------------------
[...truncated 218632 lines...]
I1012 20:35:15.174334 27676 containerizer.cpp:202] Using isolation: posix/cpu,posix/mem,filesystem/posix,network/cni
W1012 20:35:15.175029 27676 backend.cpp:75] Failed to create 'aufs' backend: AufsBackend requires
root privileges, but is running as user mesos
W1012 20:35:15.175202 27676 backend.cpp:75] Failed to create 'bind' backend: BindBackend requires
root privileges
I1012 20:35:15.178695 27709 slave.cpp:208] Mesos agent started on (620)@172.17.0.3:52103
I1012 20:35:15.178746 27709 slave.cpp:209] Flags at startup: --acls="" --appc_simple_discovery_uri_prefix="http://"
--appc_store_dir="/tmp/mesos/store/appc" --authenticate_http_readonly="true" --authenticate_http_readwrite="true"
--authenticatee="crammd5" --authentication_backoff_factor="1secs" --authorizer="local" --cgroups_cpu_enable_pids_and_tids_count="false"
--cgroups_enable_cfs="false" --cgroups_hierarchy="/sys/fs/cgroup" --cgroups_limit_swap="false"
--cgroups_root="mesos" --container_disk_watch_interval="15secs" --containerizers="mesos" --credential="/tmp/Endpoint_SlaveEndpointTest_AuthorizedRequest_1_bwlIx3/credential"
--default_role="*" --disk_watch_interval="1mins" --docker="docker" --docker_kill_orphans="true"
--docker_registry="https://registry-1.docker.io" --docker_remove_delay="6hrs" --docker_socket="/var/run/docker.sock"
--docker_stop_timeout="0ns" --docker_store_dir="/tmp/mesos/store/docker" --docker_volume_checkpoint_dir="/var/run/mesos/isolators/docker/volume"
--enforce_container_disk_quota="false" --executor_registration_timeout="1mins" --executor_shutdown_grace_period="5secs"
--fetcher_cache_dir="/tmp/Endpoint_SlaveEndpointTest_AuthorizedRequest_1_bwlIx3/fetch" --fetcher_cache_size="2GB"
--frameworks_home="" --gc_delay="1weeks" --gc_disk_headroom="0.1" --hadoop_home="" --help="false"
--hostname_lookup="true" --http_authenticators="basic" --http_command_executor="false" --http_credentials="/tmp/Endpoint_SlaveEndpointTest_AuthorizedRequest_1_bwlIx3/http_credentials"
--image_provisioner_backend="copy" --initialize_driver_logging="true" --isolation="posix/cpu,posix/mem"
--launcher="posix" --launcher_dir="/mesos/mesos-1.1.0/_build/src" --logbufsecs="0" --logging_level="INFO"
--max_completed_executors_per_framework="150" --oversubscribed_resources_interval="15secs"
--perf_duration="10secs" --perf_interval="1mins" --qos_correction_interval_min="0ns" --quiet="false"
--recover="reconnect" --recovery_timeout="15mins" --registration_backoff_factor="10ms" --resources="cpus:2;gpus:0;mem:1024;disk:1024;ports:[31000-32000]"
--revocable_cpu_low_priority="true" --runtime_dir="/tmp/Endpoint_SlaveEndpointTest_AuthorizedRequest_1_bwlIx3"
--sandbox_directory="/mnt/mesos/sandbox" --strict="true" --switch_user="true" --systemd_enable_support="true"
--systemd_runtime_directory="/run/systemd/system" --version="false" --work_dir="/tmp/Endpoint_SlaveEndpointTest_AuthorizedRequest_1_bjc6Ef"
I1012 20:35:15.179394 27709 credentials.hpp:86] Loading credential for authentication from
'/tmp/Endpoint_SlaveEndpointTest_AuthorizedRequest_1_bwlIx3/credential'
I1012 20:35:15.179600 27709 slave.cpp:346] Agent using credential for: test-principal
I1012 20:35:15.179638 27709 credentials.hpp:37] Loading credentials for authentication from
'/tmp/Endpoint_SlaveEndpointTest_AuthorizedRequest_1_bwlIx3/http_credentials'
I1012 20:35:15.180002 27709 http.cpp:883] Using default 'basic' HTTP authenticator for realm
'mesos-agent-readonly'
I1012 20:35:15.180172 27709 http.cpp:883] Using default 'basic' HTTP authenticator for realm
'mesos-agent-readwrite'
I1012 20:35:15.181499 27709 slave.cpp:533] Agent resources: cpus(*):2; mem(*):1024; disk(*):1024;
ports(*):[31000-32000]
I1012 20:35:15.181578 27709 slave.cpp:541] Agent attributes: [  ]
I1012 20:35:15.181596 27709 slave.cpp:546] Agent hostname: 5fe145f2201b
I1012 20:35:15.182895 27698 state.cpp:57] Recovering state from '/tmp/Endpoint_SlaveEndpointTest_AuthorizedRequest_1_bjc6Ef/meta'
I1012 20:35:15.182978 27709 process.cpp:3377] Handling HTTP event for process 'slave(620)'
with path: '/slave(620)/monitor/statistics.json'
I1012 20:35:15.183354 27707 status_update_manager.cpp:203] Recovering status update manager
I1012 20:35:15.183488 27699 containerizer.cpp:557] Recovering containerizer
I1012 20:35:15.183749 27694 http.cpp:835] Authorizing principal 'test-principal' to GET the
'/monitor/statistics.json' endpoint
I1012 20:35:15.184875 27695 provisioner.cpp:253] Provisioner recovery complete
I1012 20:35:15.185132 27701 slave.cpp:5281] Finished recovery
I1012 20:35:15.213587 27701 slave.cpp:5455] Querying resource estimator for oversubscribable
resources
I1012 20:35:15.213692 27701 slave.cpp:787] Agent terminating
[       OK ] Endpoint/SlaveEndpointTest.AuthorizedRequest/1 (69 ms)
[ RUN      ] Endpoint/SlaveEndpointTest.AuthorizedRequest/2
I1012 20:35:15.244832 27676 containerizer.cpp:202] Using isolation: posix/cpu,posix/mem,filesystem/posix,network/cni
W1012 20:35:15.245419 27676 backend.cpp:75] Failed to create 'aufs' backend: AufsBackend requires
root privileges, but is running as user mesos
W1012 20:35:15.245579 27676 backend.cpp:75] Failed to create 'bind' backend: BindBackend requires
root privileges
I1012 20:35:15.248684 27699 slave.cpp:208] Mesos agent started on (621)@172.17.0.3:52103
I1012 20:35:15.248723 27699 slave.cpp:209] Flags at startup: --acls="" --appc_simple_discovery_uri_prefix="http://"
--appc_store_dir="/tmp/mesos/store/appc" --authenticate_http_readonly="true" --authenticate_http_readwrite="true"
--authenticatee="crammd5" --authentication_backoff_factor="1secs" --authorizer="local" --cgroups_cpu_enable_pids_and_tids_count="false"
--cgroups_enable_cfs="false" --cgroups_hierarchy="/sys/fs/cgroup" --cgroups_limit_swap="false"
--cgroups_root="mesos" --container_disk_watch_interval="15secs" --containerizers="mesos" --credential="/tmp/Endpoint_SlaveEndpointTest_AuthorizedRequest_2_vaH3Ih/credential"
--default_role="*" --disk_watch_interval="1mins" --docker="docker" --docker_kill_orphans="true"
--docker_registry="https://registry-1.docker.io" --docker_remove_delay="6hrs" --docker_socket="/var/run/docker.sock"
--docker_stop_timeout="0ns" --docker_store_dir="/tmp/mesos/store/docker" --docker_volume_checkpoint_dir="/var/run/mesos/isolators/docker/volume"
--enforce_container_disk_quota="false" --executor_registration_timeout="1mins" --executor_shutdown_grace_period="5secs"
--fetcher_cache_dir="/tmp/Endpoint_SlaveEndpointTest_AuthorizedRequest_2_vaH3Ih/fetch" --fetcher_cache_size="2GB"
--frameworks_home="" --gc_delay="1weeks" --gc_disk_headroom="0.1" --hadoop_home="" --help="false"
--hostname_lookup="true" --http_authenticators="basic" --http_command_executor="false" --http_credentials="/tmp/Endpoint_SlaveEndpointTest_AuthorizedRequest_2_vaH3Ih/http_credentials"
--image_provisioner_backend="copy" --initialize_driver_logging="true" --isolation="posix/cpu,posix/mem"
--launcher="posix" --launcher_dir="/mesos/mesos-1.1.0/_build/src" --logbufsecs="0" --logging_level="INFO"
--max_completed_executors_per_framework="150" --oversubscribed_resources_interval="15secs"
--perf_duration="10secs" --perf_interval="1mins" --qos_correction_interval_min="0ns" --quiet="false"
--recover="reconnect" --recovery_timeout="15mins" --registration_backoff_factor="10ms" --resources="cpus:2;gpus:0;mem:1024;disk:1024;ports:[31000-32000]"
--revocable_cpu_low_priority="true" --runtime_dir="/tmp/Endpoint_SlaveEndpointTest_AuthorizedRequest_2_vaH3Ih"
--sandbox_directory="/mnt/mesos/sandbox" --strict="true" --switch_user="true" --systemd_enable_support="true"
--systemd_runtime_directory="/run/systemd/system" --version="false" --work_dir="/tmp/Endpoint_SlaveEndpointTest_AuthorizedRequest_2_hxpWEt"
I1012 20:35:15.249392 27699 credentials.hpp:86] Loading credential for authentication from
'/tmp/Endpoint_SlaveEndpointTest_AuthorizedRequest_2_vaH3Ih/credential'
I1012 20:35:15.249644 27699 slave.cpp:346] Agent using credential for: test-principal
I1012 20:35:15.249676 27699 credentials.hpp:37] Loading credentials for authentication from
'/tmp/Endpoint_SlaveEndpointTest_AuthorizedRequest_2_vaH3Ih/http_credentials'
I1012 20:35:15.250006 27699 http.cpp:883] Using default 'basic' HTTP authenticator for realm
'mesos-agent-readonly'
I1012 20:35:15.250234 27699 http.cpp:883] Using default 'basic' HTTP authenticator for realm
'mesos-agent-readwrite'
I1012 20:35:15.251363 27699 slave.cpp:533] Agent resources: cpus(*):2; mem(*):1024; disk(*):1024;
ports(*):[31000-32000]
I1012 20:35:15.251435 27699 slave.cpp:541] Agent attributes: [  ]
I1012 20:35:15.251446 27699 slave.cpp:546] Agent hostname: 5fe145f2201b
I1012 20:35:15.252966 27702 state.cpp:57] Recovering state from '/tmp/Endpoint_SlaveEndpointTest_AuthorizedRequest_2_hxpWEt/meta'
I1012 20:35:15.253046 27699 process.cpp:3377] Handling HTTP event for process 'slave(621)'
with path: '/slave(621)/containers'
I1012 20:35:15.253540 27697 status_update_manager.cpp:203] Recovering status update manager
I1012 20:35:15.253737 27709 containerizer.cpp:557] Recovering containerizer
I1012 20:35:15.253875 27698 http.cpp:835] Authorizing principal 'test-principal' to GET the
'/containers' endpoint
I1012 20:35:15.255028 27703 provisioner.cpp:253] Provisioner recovery complete
I1012 20:35:15.255543 27705 slave.cpp:5281] Finished recovery
I1012 20:35:15.255944 27705 slave.cpp:5455] Querying resource estimator for oversubscribable
resources
I1012 20:35:15.256177 27708 slave.cpp:5469] Received oversubscribable resources {} from the
resource estimator
I1012 20:35:15.256623 27702 slave.cpp:787] Agent terminating
[       OK ] Endpoint/SlaveEndpointTest.AuthorizedRequest/2 (20 ms)
[ RUN      ] Endpoint/SlaveEndpointTest.UnauthorizedRequest/0
I1012 20:35:15.295013 27676 containerizer.cpp:202] Using isolation: posix/cpu,posix/mem,filesystem/posix,network/cni
W1012 20:35:15.295560 27676 backend.cpp:75] Failed to create 'aufs' backend: AufsBackend requires
root privileges, but is running as user mesos
W1012 20:35:15.295742 27676 backend.cpp:75] Failed to create 'bind' backend: BindBackend requires
root privileges
I1012 20:35:15.298632 27708 slave.cpp:208] Mesos agent started on (622)@172.17.0.3:52103
I1012 20:35:15.298673 27708 slave.cpp:209] Flags at startup: --acls="" --appc_simple_discovery_uri_prefix="http://"
--appc_store_dir="/tmp/mesos/store/appc" --authenticate_http_readonly="true" --authenticate_http_readwrite="true"
--authenticatee="crammd5" --authentication_backoff_factor="1secs" --authorizer="local" --cgroups_cpu_enable_pids_and_tids_count="false"
--cgroups_enable_cfs="false" --cgroups_hierarchy="/sys/fs/cgroup" --cgroups_limit_swap="false"
--cgroups_root="mesos" --container_disk_watch_interval="15secs" --containerizers="mesos" --credential="/tmp/Endpoint_SlaveEndpointTest_UnauthorizedRequest_0_XgdOpw/credential"
--default_role="*" --disk_watch_interval="1mins" --docker="docker" --docker_kill_orphans="true"
--docker_registry="https://registry-1.docker.io" --docker_remove_delay="6hrs" --docker_socket="/var/run/docker.sock"
--docker_stop_timeout="0ns" --docker_store_dir="/tmp/mesos/store/docker" --docker_volume_checkpoint_dir="/var/run/mesos/isolators/docker/volume"
--enforce_container_disk_quota="false" --executor_registration_timeout="1mins" --executor_shutdown_grace_period="5secs"
--fetcher_cache_dir="/tmp/Endpoint_SlaveEndpointTest_UnauthorizedRequest_0_XgdOpw/fetch" --fetcher_cache_size="2GB"
--frameworks_home="" --gc_delay="1weeks" --gc_disk_headroom="0.1" --hadoop_home="" --help="false"
--hostname_lookup="true" --http_authenticators="basic" --http_command_executor="false" --http_credentials="/tmp/Endpoint_SlaveEndpointTest_UnauthorizedRequest_0_XgdOpw/http_credentials"
--image_provisioner_backend="copy" --initialize_driver_logging="true" --isolation="posix/cpu,posix/mem"
--launcher="posix" --launcher_dir="/mesos/mesos-1.1.0/_build/src" --logbufsecs="0" --logging_level="INFO"
--max_completed_executors_per_framework="150" --oversubscribed_resources_interval="15secs"
--perf_duration="10secs" --perf_interval="1mins" --qos_correction_interval_min="0ns" --quiet="false"
--recover="reconnect" --recovery_timeout="15mins" --registration_backoff_factor="10ms" --resources="cpus:2;gpus:0;mem:1024;disk:1024;ports:[31000-32000]"
--revocable_cpu_low_priority="true" --runtime_dir="/tmp/Endpoint_SlaveEndpointTest_UnauthorizedRequest_0_XgdOpw"
--sandbox_directory="/mnt/mesos/sandbox" --strict="true" --switch_user="true" --systemd_enable_support="true"
--systemd_runtime_directory="/run/systemd/system" --version="false" --work_dir="/tmp/Endpoint_SlaveEndpointTest_UnauthorizedRequest_0_B7txdI"
I1012 20:35:15.299096 27708 credentials.hpp:86] Loading credential for authentication from
'/tmp/Endpoint_SlaveEndpointTest_UnauthorizedRequest_0_XgdOpw/credential'
I1012 20:35:15.333081 27708 slave.cpp:346] Agent using credential for: test-principal
I1012 20:35:15.333115 27708 credentials.hpp:37] Loading credentials for authentication from
'/tmp/Endpoint_SlaveEndpointTest_UnauthorizedRequest_0_XgdOpw/http_credentials'
I1012 20:35:15.333349 27708 http.cpp:883] Using default 'basic' HTTP authenticator for realm
'mesos-agent-readonly'
I1012 20:35:15.333551 27708 http.cpp:883] Using default 'basic' HTTP authenticator for realm
'mesos-agent-readwrite'
I1012 20:35:15.334619 27708 slave.cpp:533] Agent resources: cpus(*):2; mem(*):1024; disk(*):1024;
ports(*):[31000-32000]
I1012 20:35:15.334700 27708 slave.cpp:541] Agent attributes: [  ]
I1012 20:35:15.334712 27708 slave.cpp:546] Agent hostname: 5fe145f2201b
I1012 20:35:15.336300 27697 state.cpp:57] Recovering state from '/tmp/Endpoint_SlaveEndpointTest_UnauthorizedRequest_0_B7txdI/meta'
I1012 20:35:15.336405 27708 process.cpp:3377] Handling HTTP event for process 'slave(622)'
with path: '/slave(622)/monitor/statistics'
I1012 20:35:15.336956 27694 status_update_manager.cpp:203] Recovering status update manager
I1012 20:35:15.337194 27697 containerizer.cpp:557] Recovering containerizer
I1012 20:35:15.337311 27708 http.cpp:835] Authorizing principal 'test-principal' to GET the
'/monitor/statistics' endpoint
I1012 20:35:15.338305 27704 provisioner.cpp:253] Provisioner recovery complete
I1012 20:35:15.338639 27700 slave.cpp:5281] Finished recovery
I1012 20:35:15.339190 27700 slave.cpp:5455] Querying resource estimator for oversubscribable
resources
I1012 20:35:15.339566 27703 slave.cpp:5469] Received oversubscribable resources {} from the
resource estimator
I1012 20:35:15.339643 27703 slave.cpp:787] Agent terminating
[       OK ] Endpoint/SlaveEndpointTest.UnauthorizedRequest/0 (80 ms)
[ RUN      ] Endpoint/SlaveEndpointTest.UnauthorizedRequest/1
I1012 20:35:15.376951 27676 containerizer.cpp:202] Using isolation: posix/cpu,posix/mem,filesystem/posix,network/cni
W1012 20:35:15.377677 27676 backend.cpp:75] Failed to create 'aufs' backend: AufsBackend requires
root privileges, but is running as user mesos
W1012 20:35:15.377851 27676 backend.cpp:75] Failed to create 'bind' backend: BindBackend requires
root privileges
I1012 20:35:15.381214 27706 slave.cpp:208] Mesos agent started on (623)@172.17.0.3:52103
I1012 20:35:15.381284 27706 slave.cpp:209] Flags at startup: --acls="" --appc_simple_discovery_uri_prefix="http://"
--appc_store_dir="/tmp/mesos/store/appc" --authenticate_http_readonly="true" --authenticate_http_readwrite="true"
--authenticatee="crammd5" --authentication_backoff_factor="1secs" --authorizer="local" --cgroups_cpu_enable_pids_and_tids_count="false"
--cgroups_enable_cfs="false" --cgroups_hierarchy="/sys/fs/cgroup" --cgroups_limit_swap="false"
--cgroups_root="mesos" --container_disk_watch_interval="15secs" --containerizers="mesos" --credential="/tmp/Endpoint_SlaveEndpointTest_UnauthorizedRequest_1_PCsBXL/credential"
--default_role="*" --disk_watch_interval="1mins" --docker="docker" --docker_kill_orphans="true"
--docker_registry="https://registry-1.docker.io" --docker_remove_delay="6hrs" --docker_socket="/var/run/docker.sock"
--docker_stop_timeout="0ns" --docker_store_dir="/tmp/mesos/store/docker" --docker_volume_checkpoint_dir="/var/run/mesos/isolators/docker/volume"
--enforce_container_disk_quota="false" --executor_registration_timeout="1mins" --executor_shutdown_grace_period="5secs"
--fetcher_cache_dir="/tmp/Endpoint_SlaveEndpointTest_UnauthorizedRequest_1_PCsBXL/fetch" --fetcher_cache_size="2GB"
--frameworks_home="" --gc_delay="1weeks" --gc_disk_headroom="0.1" --hadoop_home="" --help="false"
--hostname_lookup="true" --http_authenticators="basic" --http_command_executor="false" --http_credentials="/tmp/Endpoint_SlaveEndpointTest_UnauthorizedRequest_1_PCsBXL/http_credentials"
--image_provisioner_backend="copy" --initialize_driver_logging="true" --isolation="posix/cpu,posix/mem"
--launcher="posix" --launcher_dir="/mesos/mesos-1.1.0/_build/src" --logbufsecs="0" --logging_level="INFO"
--max_completed_executors_per_framework="150" --oversubscribed_resources_interval="15secs"
--perf_duration="10secs" --perf_interval="1mins" --qos_correction_interval_min="0ns" --quiet="false"
--recover="reconnect" --recovery_timeout="15mins" --registration_backoff_factor="10ms" --resources="cpus:2;gpus:0;mem:1024;disk:1024;ports:[31000-32000]"
--revocable_cpu_low_priority="true" --runtime_dir="/tmp/Endpoint_SlaveEndpointTest_UnauthorizedRequest_1_PCsBXL"
--sandbox_directory="/mnt/mesos/sandbox" --strict="true" --switch_user="true" --systemd_enable_support="true"
--systemd_runtime_directory="/run/systemd/system" --version="false" --work_dir="/tmp/Endpoint_SlaveEndpointTest_UnauthorizedRequest_1_rHc8xX"
I1012 20:35:15.382064 27706 credentials.hpp:86] Loading credential for authentication from
'/tmp/Endpoint_SlaveEndpointTest_UnauthorizedRequest_1_PCsBXL/credential'
I1012 20:35:15.390919 27706 slave.cpp:346] Agent using credential for: test-principal
I1012 20:35:15.390943 27706 credentials.hpp:37] Loading credentials for authentication from
'/tmp/Endpoint_SlaveEndpointTest_UnauthorizedRequest_1_PCsBXL/http_credentials'
I1012 20:35:15.391137 27706 http.cpp:883] Using default 'basic' HTTP authenticator for realm
'mesos-agent-readonly'
I1012 20:35:15.391250 27706 http.cpp:883] Using default 'basic' HTTP authenticator for realm
'mesos-agent-readwrite'
I1012 20:35:15.392333 27706 slave.cpp:533] Agent resources: cpus(*):2; mem(*):1024; disk(*):1024;
ports(*):[31000-32000]
I1012 20:35:15.392401 27706 slave.cpp:541] Agent attributes: [  ]
I1012 20:35:15.392412 27706 slave.cpp:546] Agent hostname: 5fe145f2201b
I1012 20:35:15.393764 27707 state.cpp:57] Recovering state from '/tmp/Endpoint_SlaveEndpointTest_UnauthorizedRequest_1_rHc8xX/meta'
I1012 20:35:15.393811 27706 process.cpp:3377] Handling HTTP event for process 'slave(623)'
with path: '/slave(623)/monitor/statistics.json'
I1012 20:35:15.394181 27704 status_update_manager.cpp:203] Recovering status update manager
I1012 20:35:15.394366 27701 containerizer.cpp:557] Recovering containerizer
I1012 20:35:15.394630 27702 http.cpp:835] Authorizing principal 'test-principal' to GET the
'/monitor/statistics.json' endpoint
I1012 20:35:15.395392 27694 provisioner.cpp:253] Provisioner recovery complete
I1012 20:35:15.395685 27705 slave.cpp:5281] Finished recovery
I1012 20:35:15.396220 27705 slave.cpp:5455] Querying resource estimator for oversubscribable
resources
I1012 20:35:15.396615 27703 slave.cpp:5469] Received oversubscribable resources {} from the
resource estimator
I1012 20:35:15.397397 27695 slave.cpp:787] Agent terminating
[       OK ] Endpoint/SlaveEndpointTest.UnauthorizedRequest/1 (30 ms)
[ RUN      ] Endpoint/SlaveEndpointTest.UnauthorizedRequest/2
I1012 20:35:15.417719 27676 containerizer.cpp:202] Using isolation: posix/cpu,posix/mem,filesystem/posix,network/cni
W1012 20:35:15.418285 27676 backend.cpp:75] Failed to create 'aufs' backend: AufsBackend requires
root privileges, but is running as user mesos
W1012 20:35:15.418442 27676 backend.cpp:75] Failed to create 'bind' backend: BindBackend requires
root privileges
I1012 20:35:15.422230 27703 slave.cpp:208] Mesos agent started on (624)@172.17.0.3:52103
I1012 20:35:15.422281 27703 slave.cpp:209] Flags at startup: --acls="" --appc_simple_discovery_uri_prefix="http://"
--appc_store_dir="/tmp/mesos/store/appc" --authenticate_http_readonly="true" --authenticate_http_readwrite="true"
--authenticatee="crammd5" --authentication_backoff_factor="1secs" --authorizer="local" --cgroups_cpu_enable_pids_and_tids_count="false"
--cgroups_enable_cfs="false" --cgroups_hierarchy="/sys/fs/cgroup" --cgroups_limit_swap="false"
--cgroups_root="mesos" --container_disk_watch_interval="15secs" --containerizers="mesos" --credential="/tmp/Endpoint_SlaveEndpointTest_UnauthorizedRequest_2_b75sY1/credential"
--default_role="*" --disk_watch_interval="1mins" --docker="docker" --docker_kill_orphans="true"
--docker_registry="https://registry-1.docker.io" --docker_remove_delay="6hrs" --docker_socket="/var/run/docker.sock"
--docker_stop_timeout="0ns" --docker_store_dir="/tmp/mesos/store/docker" --docker_volume_checkpoint_dir="/var/run/mesos/isolators/docker/volume"
--enforce_container_disk_quota="false" --executor_registration_timeout="1mins" --executor_shutdown_grace_period="5secs"
--fetcher_cache_dir="/tmp/Endpoint_SlaveEndpointTest_UnauthorizedRequest_2_b75sY1/fetch" --fetcher_cache_size="2GB"
--frameworks_home="" --gc_delay="1weeks" --gc_disk_headroom="0.1" --hadoop_home="" --help="false"
--hostname_lookup="true" --http_authenticators="basic" --http_command_executor="false" --http_credentials="/tmp/Endpoint_SlaveEndpointTest_UnauthorizedRequest_2_b75sY1/http_credentials"
--image_provisioner_backend="copy" --initialize_driver_logging="true" --isolation="posix/cpu,posix/mem"
--launcher="posix" --launcher_dir="/mesos/mesos-1.1.0/_build/src" --logbufsecs="0" --logging_level="INFO"
--max_completed_executors_per_framework="150" --oversubscribed_resources_interval="15secs"
--perf_duration="10secs" --perf_interval="1mins" --qos_correction_interval_min="0ns" --quiet="false"
--recover="reconnect" --recovery_timeout="15mins" --registration_backoff_factor="10ms" --resources="cpus:2;gpus:0;mem:1024;disk:1024;ports:[31000-32000]"
--revocable_cpu_low_priority="true" --runtime_dir="/tmp/Endpoint_SlaveEndpointTest_UnauthorizedRequest_2_b75sY1"
--sandbox_directory="/mnt/mesos/sandbox" --strict="true" --switch_user="true" --systemd_enable_support="true"
--systemd_runtime_directory="/run/systemd/system" --version="false" --work_dir="/tmp/Endpoint_SlaveEndpointTest_UnauthorizedRequest_2_vrsosd"
I1012 20:35:15.422910 27703 credentials.hpp:86] Loading credential for authentication from
'/tmp/Endpoint_SlaveEndpointTest_UnauthorizedRequest_2_b75sY1/credential'
I1012 20:35:15.423110 27703 slave.cpp:346] Agent using credential for: test-principal
I1012 20:35:15.423147 27703 credentials.hpp:37] Loading credentials for authentication from
'/tmp/Endpoint_SlaveEndpointTest_UnauthorizedRequest_2_b75sY1/http_credentials'
I1012 20:35:15.423461 27703 http.cpp:883] Using default 'basic' HTTP authenticator for realm
'mesos-agent-readonly'
I1012 20:35:15.423641 27703 http.cpp:883] Using default 'basic' HTTP authenticator for realm
'mesos-agent-readwrite'
I1012 20:35:15.425165 27703 slave.cpp:533] Agent resources: cpus(*):2; mem(*):1024; disk(*):1024;
ports(*):[31000-32000]
I1012 20:35:15.425266 27703 slave.cpp:541] Agent attributes: [  ]
I1012 20:35:15.425281 27703 slave.cpp:546] Agent hostname: 5fe145f2201b
I1012 20:35:15.426934 27709 state.cpp:57] Recovering state from '/tmp/Endpoint_SlaveEndpointTest_UnauthorizedRequest_2_vrsosd/meta'
I1012 20:35:15.427019 27703 process.cpp:3377] Handling HTTP event for process 'slave(624)'
with path: '/slave(624)/containers'
I1012 20:35:15.427611 27695 status_update_manager.cpp:203] Recovering status update manager
I1012 20:35:15.427848 27706 containerizer.cpp:557] Recovering containerizer
I1012 20:35:15.428145 27697 http.cpp:835] Authorizing principal 'test-principal' to GET the
'/containers' endpoint
I1012 20:35:15.429111 27706 provisioner.cpp:253] Provisioner recovery complete
I1012 20:35:15.429392 27705 slave.cpp:5281] Finished recovery
I1012 20:35:15.433389 27705 slave.cpp:5455] Querying resource estimator for oversubscribable
resources
I1012 20:35:15.433516 27705 slave.cpp:787] Agent terminating
[       OK ] Endpoint/SlaveEndpointTest.UnauthorizedRequest/2 (25 ms)
[ RUN      ] Endpoint/SlaveEndpointTest.NoAuthorizer/0
I1012 20:35:15.471243 27676 containerizer.cpp:202] Using isolation: posix/cpu,posix/mem,filesystem/posix,network/cni
W1012 20:35:15.471787 27676 backend.cpp:75] Failed to create 'aufs' backend: AufsBackend requires
root privileges, but is running as user mesos
W1012 20:35:15.471935 27676 backend.cpp:75] Failed to create 'bind' backend: BindBackend requires
root privileges
I1012 20:35:15.473150 27676 cluster.cpp:435] Creating default 'local' authorizer
I1012 20:35:15.474627 27699 slave.cpp:208] Mesos agent started on (625)@172.17.0.3:52103
I1012 20:35:15.474664 27699 slave.cpp:209] Flags at startup: --acls="" --appc_simple_discovery_uri_prefix="http://"
--appc_store_dir="/tmp/mesos/store/appc" --authenticate_http_readonly="true" --authenticate_http_readwrite="true"
--authenticatee="crammd5" --authentication_backoff_factor="1secs" --authorizer="local" --cgroups_cpu_enable_pids_and_tids_count="false"
--cgroups_enable_cfs="false" --cgroups_hierarchy="/sys/fs/cgroup" --cgroups_limit_swap="false"
--cgroups_root="mesos" --container_disk_watch_interval="15secs" --containerizers="mesos" --credential="/tmp/Endpoint_SlaveEndpointTest_NoAuthorizer_0_3c4Rvi/credential"
--default_role="*" --disk_watch_interval="1mins" --docker="docker" --docker_kill_orphans="true"
--docker_registry="https://registry-1.docker.io" --docker_remove_delay="6hrs" --docker_socket="/var/run/docker.sock"
--docker_stop_timeout="0ns" --docker_store_dir="/tmp/mesos/store/docker" --docker_volume_checkpoint_dir="/var/run/mesos/isolators/docker/volume"
--enforce_container_disk_quota="false" --executor_registration_timeout="1mins" --executor_shutdown_grace_period="5secs"
--fetcher_cache_dir="/tmp/Endpoint_SlaveEndpointTest_NoAuthorizer_0_3c4Rvi/fetch" --fetcher_cache_size="2GB"
--frameworks_home="" --gc_delay="1weeks" --gc_disk_headroom="0.1" --hadoop_home="" --help="false"
--hostname_lookup="true" --http_authenticators="basic" --http_command_executor="false" --http_credentials="/tmp/Endpoint_SlaveEndpointTest_NoAuthorizer_0_3c4Rvi/http_credentials"
--image_provisioner_backend="copy" --initialize_driver_logging="true" --isolation="posix/cpu,posix/mem"
--launcher="posix" --launcher_dir="/mesos/mesos-1.1.0/_build/src" --logbufsecs="0" --logging_level="INFO"
--max_completed_executors_per_framework="150" --oversubscribed_resources_interval="15secs"
--perf_duration="10secs" --perf_interval="1mins" --qos_correction_interval_min="0ns" --quiet="false"
--recover="reconnect" --recovery_timeout="15mins" --registration_backoff_factor="10ms" --resources="cpus:2;gpus:0;mem:1024;disk:1024;ports:[31000-32000]"
--revocable_cpu_low_priority="true" --runtime_dir="/tmp/Endpoint_SlaveEndpointTest_NoAuthorizer_0_3c4Rvi"
--sandbox_directory="/mnt/mesos/sandbox" --strict="true" --switch_user="true" --systemd_enable_support="true"
--systemd_runtime_directory="/run/systemd/system" --version="false" --work_dir="/tmp/Endpoint_SlaveEndpointTest_NoAuthorizer_0_vDIZQt"
I1012 20:35:15.475075 27699 credentials.hpp:86] Loading credential for authentication from
'/tmp/Endpoint_SlaveEndpointTest_NoAuthorizer_0_3c4Rvi/credential'
I1012 20:35:15.475226 27699 slave.cpp:346] Agent using credential for: test-principal
I1012 20:35:15.475252 27699 credentials.hpp:37] Loading credentials for authentication from
'/tmp/Endpoint_SlaveEndpointTest_NoAuthorizer_0_3c4Rvi/http_credentials'
I1012 20:35:15.485050 27699 http.cpp:883] Using default 'basic' HTTP authenticator for realm
'mesos-agent-readonly'
I1012 20:35:15.485175 27699 http.cpp:883] Using default 'basic' HTTP authenticator for realm
'mesos-agent-readwrite'
I1012 20:35:15.486383 27699 slave.cpp:533] Agent resources: cpus(*):2; mem(*):1024; disk(*):1024;
ports(*):[31000-32000]
I1012 20:35:15.486456 27699 slave.cpp:541] Agent attributes: [  ]
I1012 20:35:15.486467 27699 slave.cpp:546] Agent hostname: 5fe145f2201b
I1012 20:35:15.487682 27707 state.cpp:57] Recovering state from '/tmp/Endpoint_SlaveEndpointTest_NoAuthorizer_0_vDIZQt/meta'
I1012 20:35:15.487771 27699 process.cpp:3377] Handling HTTP event for process 'slave(625)'
with path: '/slave(625)/monitor/statistics'
I1012 20:35:15.488667 27708 status_update_manager.cpp:203] Recovering status update manager
I1012 20:35:15.489013 27699 containerizer.cpp:557] Recovering containerizer
I1012 20:35:15.489130 27695 http.cpp:835] Authorizing principal 'test-principal' to GET the
'/monitor/statistics' endpoint
I1012 20:35:15.490440 27707 provisioner.cpp:253] Provisioner recovery complete
I1012 20:35:15.491017 27697 slave.cpp:5281] Finished recovery
I1012 20:35:15.491560 27697 slave.cpp:5455] Querying resource estimator for oversubscribable
resources
I1012 20:35:15.491780 27695 slave.cpp:5469] Received oversubscribable resources {} from the
resource estimator
I1012 20:35:15.493856 27696 slave.cpp:787] Agent terminating
[       OK ] Endpoint/SlaveEndpointTest.NoAuthorizer/0 (30 ms)
[ RUN      ] Endpoint/SlaveEndpointTest.NoAuthorizer/1
I1012 20:35:15.535753 27676 containerizer.cpp:202] Using isolation: posix/cpu,posix/mem,filesystem/posix,network/cni
W1012 20:35:15.536308 27676 backend.cpp:75] Failed to create 'aufs' backend: AufsBackend requires
root privileges, but is running as user mesos
W1012 20:35:15.536442 27676 backend.cpp:75] Failed to create 'bind' backend: BindBackend requires
root privileges
I1012 20:35:15.538137 27676 cluster.cpp:435] Creating default 'local' authorizer
I1012 20:35:15.540189 27698 slave.cpp:208] Mesos agent started on (626)@172.17.0.3:52103
I1012 20:35:15.540266 27698 slave.cpp:209] Flags at startup: --acls="" --appc_simple_discovery_uri_prefix="http://"
--appc_store_dir="/tmp/mesos/store/appc" --authenticate_http_readonly="true" --authenticate_http_readwrite="true"
--authenticatee="crammd5" --authentication_backoff_factor="1secs" --authorizer="local" --cgroups_cpu_enable_pids_and_tids_count="false"
--cgroups_enable_cfs="false" --cgroups_hierarchy="/sys/fs/cgroup" --cgroups_limit_swap="false"
--cgroups_root="mesos" --container_disk_watch_interval="15secs" --containerizers="mesos" --credential="/tmp/Endpoint_SlaveEndpointTest_NoAuthorizer_1_ZRjaIz/credential"
--default_role="*" --disk_watch_interval="1mins" --docker="docker" --docker_kill_orphans="true"
--docker_registry="https://registry-1.docker.io" --docker_remove_delay="6hrs" --docker_socket="/var/run/docker.sock"
--docker_stop_timeout="0ns" --docker_store_dir="/tmp/mesos/store/docker" --docker_volume_checkpoint_dir="/var/run/mesos/isolators/docker/volume"
--enforce_container_disk_quota="false" --executor_registration_timeout="1mins" --executor_shutdown_grace_period="5secs"
--fetcher_cache_dir="/tmp/Endpoint_SlaveEndpointTest_NoAuthorizer_1_ZRjaIz/fetch" --fetcher_cache_size="2GB"
--frameworks_home="" --gc_delay="1weeks" --gc_disk_headroom="0.1" --hadoop_home="" --help="false"
--hostname_lookup="true" --http_authenticators="basic" --http_command_executor="false" --http_credentials="/tmp/Endpoint_SlaveEndpointTest_NoAuthorizer_1_ZRjaIz/http_credentials"
--image_provisioner_backend="copy" --initialize_driver_logging="true" --isolation="posix/cpu,posix/mem"
--launcher="posix" --launcher_dir="/mesos/mesos-1.1.0/_build/src" --logbufsecs="0" --logging_level="INFO"
--max_completed_executors_per_framework="150" --oversubscribed_resources_interval="15secs"
--perf_duration="10secs" --perf_interval="1mins" --qos_correction_interval_min="0ns" --quiet="false"
--recover="reconnect" --recovery_timeout="15mins" --registration_backoff_factor="10ms" --resources="cpus:2;gpus:0;mem:1024;disk:1024;ports:[31000-32000]"
--revocable_cpu_low_priority="true" --runtime_dir="/tmp/Endpoint_SlaveEndpointTest_NoAuthorizer_1_ZRjaIz"
--sandbox_directory="/mnt/mesos/sandbox" --strict="true" --switch_user="true" --systemd_enable_support="true"
--systemd_runtime_directory="/run/systemd/system" --version="false" --work_dir="/tmp/Endpoint_SlaveEndpointTest_NoAuthorizer_1_vD7NSK"
I1012 20:35:15.541009 27698 credentials.hpp:86] Loading credential for authentication from
'/tmp/Endpoint_SlaveEndpointTest_NoAuthorizer_1_ZRjaIz/credential'
I1012 20:35:15.541236 27698 slave.cpp:346] Agent using credential for: test-principal
I1012 20:35:15.541262 27698 credentials.hpp:37] Loading credentials for authentication from
'/tmp/Endpoint_SlaveEndpointTest_NoAuthorizer_1_ZRjaIz/http_credentials'
I1012 20:35:15.541574 27698 http.cpp:883] Using default 'basic' HTTP authenticator for realm
'mesos-agent-readonly'
I1012 20:35:15.541750 27698 http.cpp:883] Using default 'basic' HTTP authenticator for realm
'mesos-agent-readwrite'
I1012 20:35:15.543144 27698 slave.cpp:533] Agent resources: cpus(*):2; mem(*):1024; disk(*):1024;
ports(*):[31000-32000]
I1012 20:35:15.543243 27698 slave.cpp:541] Agent attributes: [  ]
I1012 20:35:15.543261 27698 slave.cpp:546] Agent hostname: 5fe145f2201b
I1012 20:35:15.544981 27709 state.cpp:57] Recovering state from '/tmp/Endpoint_SlaveEndpointTest_NoAuthorizer_1_vD7NSK/meta'
I1012 20:35:15.545105 27698 process.cpp:3377] Handling HTTP event for process 'slave(626)'
with path: '/slave(626)/monitor/statistics.json'
I1012 20:35:15.545668 27695 status_update_manager.cpp:203] Recovering status update manager
I1012 20:35:15.546047 27697 containerizer.cpp:557] Recovering containerizer
I1012 20:35:15.546176 27694 http.cpp:835] Authorizing principal 'test-principal' to GET the
'/monitor/statistics.json' endpoint
I1012 20:35:15.547544 27709 provisioner.cpp:253] Provisioner recovery complete
I1012 20:35:15.547947 27708 slave.cpp:5281] Finished recovery
I1012 20:35:15.548558 27708 slave.cpp:5455] Querying resource estimator for oversubscribable
resources
I1012 20:35:15.548763 27703 slave.cpp:5469] Received oversubscribable resources {} from the
resource estimator
I1012 20:35:15.550112 27709 slave.cpp:787] Agent terminating
[       OK ] Endpoint/SlaveEndpointTest.NoAuthorizer/1 (44 ms)
[ RUN      ] Endpoint/SlaveEndpointTest.NoAuthorizer/2
I1012 20:35:15.579598 27676 containerizer.cpp:202] Using isolation: posix/cpu,posix/mem,filesystem/posix,network/cni
W1012 20:35:15.580117 27676 backend.cpp:75] Failed to create 'aufs' backend: AufsBackend requires
root privileges, but is running as user mesos
W1012 20:35:15.580251 27676 backend.cpp:75] Failed to create 'bind' backend: BindBackend requires
root privileges
I1012 20:35:15.582723 27676 cluster.cpp:435] Creating default 'local' authorizer
I1012 20:35:15.584738 27700 slave.cpp:208] Mesos agent started on (627)@172.17.0.3:52103
I1012 20:35:15.584818 27700 slave.cpp:209] Flags at startup: --acls="" --appc_simple_discovery_uri_prefix="http://"
--appc_store_dir="/tmp/mesos/store/appc" --authenticate_http_readonly="true" --authenticate_http_readwrite="true"
--authenticatee="crammd5" --authentication_backoff_factor="1secs" --authorizer="local" --cgroups_cpu_enable_pids_and_tids_count="false"
--cgroups_enable_cfs="false" --cgroups_hierarchy="/sys/fs/cgroup" --cgroups_limit_swap="false"
--cgroups_root="mesos" --container_disk_watch_interval="15secs" --containerizers="mesos" --credential="/tmp/Endpoint_SlaveEndpointTest_NoAuthorizer_2_FrN7oR/credential"
--default_role="*" --disk_watch_interval="1mins" --docker="docker" --docker_kill_orphans="true"
--docker_registry="https://registry-1.docker.io" --docker_remove_delay="6hrs" --docker_socket="/var/run/docker.sock"
--docker_stop_timeout="0ns" --docker_store_dir="/tmp/mesos/store/docker" --docker_volume_checkpoint_dir="/var/run/mesos/isolators/docker/volume"
--enforce_container_disk_quota="false" --executor_registration_timeout="1mins" --executor_shutdown_grace_period="5secs"
--fetcher_cache_dir="/tmp/Endpoint_SlaveEndpointTest_NoAuthorizer_2_FrN7oR/fetch" --fetcher_cache_size="2GB"
--frameworks_home="" --gc_delay="1weeks" --gc_disk_headroom="0.1" --hadoop_home="" --help="false"
--hostname_lookup="true" --http_authenticators="basic" --http_command_executor="false" --http_credentials="/tmp/Endpoint_SlaveEndpointTest_NoAuthorizer_2_FrN7oR/http_credentials"
--image_provisioner_backend="copy" --initialize_driver_logging="true" --isolation="posix/cpu,posix/mem"
--launcher="posix" --launcher_dir="/mesos/mesos-1.1.0/_build/src" --logbufsecs="0" --logging_level="INFO"
--max_completed_executors_per_framework="150" --oversubscribed_resources_interval="15secs"
--perf_duration="10secs" --perf_interval="1mins" --qos_correction_interval_min="0ns" --quiet="false"
--recover="reconnect" --recovery_timeout="15mins" --registration_backoff_factor="10ms" --resources="cpus:2;gpus:0;mem:1024;disk:1024;ports:[31000-32000]"
--revocable_cpu_low_priority="true" --runtime_dir="/tmp/Endpoint_SlaveEndpointTest_NoAuthorizer_2_FrN7oR"
--sandbox_directory="/mnt/mesos/sandbox" --strict="true" --switch_user="true" --systemd_enable_support="true"
--systemd_runtime_directory="/run/systemd/system" --version="false" --work_dir="/tmp/Endpoint_SlaveEndpointTest_NoAuthorizer_2_T6wDs2"
I1012 20:35:15.585489 27700 credentials.hpp:86] Loading credential for authentication from
'/tmp/Endpoint_SlaveEndpointTest_NoAuthorizer_2_FrN7oR/credential'
I1012 20:35:15.585680 27700 slave.cpp:346] Agent using credential for: test-principal
I1012 20:35:15.585716 27700 credentials.hpp:37] Loading credentials for authentication from
'/tmp/Endpoint_SlaveEndpointTest_NoAuthorizer_2_FrN7oR/http_credentials'
I1012 20:35:15.586071 27700 http.cpp:883] Using default 'basic' HTTP authenticator for realm
'mesos-agent-readonly'
I1012 20:35:15.586309 27700 http.cpp:883] Using default 'basic' HTTP authenticator for realm
'mesos-agent-readwrite'
I1012 20:35:15.587725 27700 slave.cpp:533] Agent resources: cpus(*):2; mem(*):1024; disk(*):1024;
ports(*):[31000-32000]
I1012 20:35:15.587822 27700 slave.cpp:541] Agent attributes: [  ]
I1012 20:35:15.587838 27700 slave.cpp:546] Agent hostname: 5fe145f2201b
I1012 20:35:15.589206 27701 state.cpp:57] Recovering state from '/tmp/Endpoint_SlaveEndpointTest_NoAuthorizer_2_T6wDs2/meta'
I1012 20:35:15.589253 27700 process.cpp:3377] Handling HTTP event for process 'slave(627)'
with path: '/slave(627)/containers'
I1012 20:35:15.589821 27694 status_update_manager.cpp:203] Recovering status update manager
I1012 20:35:15.589973 27694 containerizer.cpp:557] Recovering containerizer
I1012 20:35:15.590315 27705 http.cpp:835] Authorizing principal 'test-principal' to GET the
'/containers' endpoint
I1012 20:35:15.591419 27704 provisioner.cpp:253] Provisioner recovery complete
I1012 20:35:15.591694 27700 slave.cpp:5281] Finished recovery
I1012 20:35:15.592176 27700 slave.cpp:5455] Querying resource estimator for oversubscribable
resources
I1012 20:35:15.592387 27700 slave.cpp:5469] Received oversubscribable resources {} from the
resource estimator
I1012 20:35:15.593374 27707 slave.cpp:787] Agent terminating
[       OK ] Endpoint/SlaveEndpointTest.NoAuthorizer/2 (42 ms)
[----------] 9 tests from Endpoint/SlaveEndpointTest (505 ms total)

[----------] Global test environment tear-down
[==========] 1354 tests from 154 test cases ran. (1451357 ms total)
[  PASSED  ] 1351 tests.
[  FAILED  ] 3 tests, listed below:
[  FAILED  ] SlaveTest.KillTaskUnregisteredHTTPExecutor
[  FAILED  ] DiskResource/PersistentVolumeTest.SharedPersistentVolumeRescindOnDestroy/0, where
GetParam() = 0
[  FAILED  ] DiskResource/PersistentVolumeTest.SharedPersistentVolumeRescindOnDestroy/1, where
GetParam() = 1

 3 FAILED TESTS
  YOU HAVE 5 DISABLED TESTS

make[4]: *** [check-local] Error 1
make[4]: Leaving directory `/mesos/mesos-1.1.0/_build/src'
make[3]: *** [check-am] Error 2
make[3]: Leaving directory `/mesos/mesos-1.1.0/_build/src'
make[2]: *** [check] Error 2
make[2]: Leaving directory `/mesos/mesos-1.1.0/_build/src'
make[1]: *** [check-recursive] Error 1
make[1]: Leaving directory `/mesos/mesos-1.1.0/_build'
make: *** [distcheck] Error 1
+ docker rmi mesos-1476300216-31040
Untagged: mesos-1476300216-31040:latest
Deleted: sha256:132de6ba8f5d10150b8a4a15e178df6b42cb9f697f7c5222ca7ddc4fefa06e48
Deleted: sha256:0b7818a18830727494fa6eb63e4c2f15eb0d2d98cc0cca1ddcb90e1d82328597
Deleted: sha256:c0269e682a0b47072070a7be75bb72d7faf3522846041322dc8e7ab12e5fe528
Deleted: sha256:7e51f952a73f26abb8662fc225e63f7247bb9b4d0892aef49347fed89f0ed0d6
Deleted: sha256:6f5578a86a43358125d8a4cb027643b2d903f83346e3641b89dbe72e8194bcaf
Deleted: sha256:66d59a3bd066a5fcd3ee7d9b9ecbf47a2910a38742d8c32415296b6675012654
Deleted: sha256:0169f9b5e71e7467308dfb4ba4dac1a8d74c15bfb970893cc9a1c40725f481ba
Deleted: sha256:8a58fe0826d8cbeb92de406efa32fb8e886883f1e6661888c7395f4ffe99a96a
Deleted: sha256:61108b38eacb0692de06913f3b33dbab3288d3ab5598ac568f571fa84e1d1b84
Deleted: sha256:8555afca770e885c274dbafd318cdc78792718da5ea1c2137fe7ab2039086041
Deleted: sha256:9199c689b14d1c2c7ea23abb97f1a571ecaf683fd683f9480680befb115259e4
Deleted: sha256:cad361b2ccc286e19084918707c09a5d3f0e8860b876112725eeaa2b1023bd5d
Deleted: sha256:cad015ccb33be2becd3dbcb02bb39c7f958c2d8c09c02841ba55d56fdc129f28
Deleted: sha256:a772bc74706dc2539414f7c7bdea8c1829a1ea132e7d53dcca894f87a9c36037
Deleted: sha256:81249d8345df3a42034c971bac688b859d104a40f028c8cb4c7e8909b73fc3db
Deleted: sha256:747407dfa5ea42a603f3274800772c00c723ccb5a0d9bccdd6b4b468e17945f8
Deleted: sha256:e83624d5ae38d49cc2888900a449117cf6c4ee118f810dc30eaa70745ae41b72
Deleted: sha256:58ead5ea82a3a7286b0e4477bd40ab02e6446ca2bf59903ee2516ad7e9d62cad
Deleted: sha256:d881efa8d956c8d6fb26183f29c8e1fef544cc32c34b2d67f4df0db9bf018fcd
Deleted: sha256:16e370bc339a8e6845564100b414d9944634d795ad43c2729f508516ec31b04b
Deleted: sha256:c49b8c29fda9d8649e0781d4743b5912caa17baa9469f856fbc60af987f38813
Deleted: sha256:e12f4b8d05341b4c88d0a6e841bc539e0ae692d5f3381b120ac5324fcefcc334
Deleted: sha256:6c3bb0509a10fde9edefa4df012e4e0e4a59168888718e67886b683f8503cf07
Deleted: sha256:22ae27c249bed509302c767e49777c227f232a109dabb305c29907620f642f4a
Build step 'Execute shell' marked build as failure

Mime
View raw message