mesos-builds mailing list archives

Site index · List index
Message view « Date » · « Thread »
Top « Date » · « Thread »
From Apache Jenkins Server <jenk...@builds.apache.org>
Subject Build failed in Jenkins: Mesos » autotools,gcc,--verbose,GLOG_v=1 MESOS_VERBOSE=1,centos:7,(docker||Hadoop)&&(!ubuntu-us1)&&(!ubuntu-6) #2822
Date Sat, 22 Oct 2016 08:54:10 GMT
See <https://builds.apache.org/job/Mesos/BUILDTOOL=autotools,COMPILER=gcc,CONFIGURATION=--verbose,ENVIRONMENT=GLOG_v=1%20MESOS_VERBOSE=1,OS=centos%3A7,label_exp=(docker%7C%7CHadoop)&&(!ubuntu-us1)&&(!ubuntu-6)/2822/>

------------------------------------------
[...truncated 217407 lines...]
W1022 08:53:51.805768 30372 backend.cpp:76] Failed to create 'aufs' backend: AufsBackend requires
root privileges, but is running as user mesos
W1022 08:53:51.805904 30372 backend.cpp:76] Failed to create 'bind' backend: BindBackend requires
root privileges
I1022 08:53:51.808867 30406 slave.cpp:208] Mesos agent started on (630)@172.17.0.2:35446
I1022 08:53:51.808899 30406 slave.cpp:209] Flags at startup: --acls="" --appc_simple_discovery_uri_prefix="http://"
--appc_store_dir="/tmp/mesos/store/appc" --authenticate_http_readonly="true" --authenticate_http_readwrite="true"
--authenticatee="crammd5" --authentication_backoff_factor="1secs" --authorizer="local" --cgroups_cpu_enable_pids_and_tids_count="false"
--cgroups_enable_cfs="false" --cgroups_hierarchy="/sys/fs/cgroup" --cgroups_limit_swap="false"
--cgroups_root="mesos" --container_disk_watch_interval="15secs" --containerizers="mesos" --credential="/tmp/Endpoint_SlaveEndpointTest_AuthorizedRequest_1_gfx53n/credential"
--default_role="*" --disk_watch_interval="1mins" --docker="docker" --docker_kill_orphans="true"
--docker_registry="https://registry-1.docker.io" --docker_remove_delay="6hrs" --docker_socket="/var/run/docker.sock"
--docker_stop_timeout="0ns" --docker_store_dir="/tmp/mesos/store/docker" --docker_volume_checkpoint_dir="/var/run/mesos/isolators/docker/volume"
--enforce_container_disk_quota="false" --executor_registration_timeout="1mins" --executor_shutdown_grace_period="5secs"
--fetcher_cache_dir="/tmp/Endpoint_SlaveEndpointTest_AuthorizedRequest_1_gfx53n/fetch" --fetcher_cache_size="2GB"
--frameworks_home="" --gc_delay="1weeks" --gc_disk_headroom="0.1" --hadoop_home="" --help="false"
--hostname_lookup="true" --http_authenticators="basic" --http_command_executor="false" --http_credentials="/tmp/Endpoint_SlaveEndpointTest_AuthorizedRequest_1_gfx53n/http_credentials"
--image_provisioner_backend="copy" --initialize_driver_logging="true" --isolation="posix/cpu,posix/mem"
--launcher="posix" --launcher_dir="/mesos/mesos-1.2.0/_build/src" --logbufsecs="0" --logging_level="INFO"
--max_completed_executors_per_framework="150" --oversubscribed_resources_interval="15secs"
--perf_duration="10secs" --perf_interval="1mins" --qos_correction_interval_min="0ns" --quiet="false"
--recover="reconnect" --recovery_timeout="15mins" --registration_backoff_factor="10ms" --resources="cpus:2;gpus:0;mem:1024;disk:1024;ports:[31000-32000]"
--revocable_cpu_low_priority="true" --runtime_dir="/tmp/Endpoint_SlaveEndpointTest_AuthorizedRequest_1_gfx53n"
--sandbox_directory="/mnt/mesos/sandbox" --strict="true" --switch_user="true" --systemd_enable_support="true"
--systemd_runtime_directory="/run/systemd/system" --version="false" --work_dir="/tmp/Endpoint_SlaveEndpointTest_AuthorizedRequest_1_En8qwn"
I1022 08:53:51.809923 30406 credentials.hpp:86] Loading credential for authentication from
'/tmp/Endpoint_SlaveEndpointTest_AuthorizedRequest_1_gfx53n/credential'
I1022 08:53:51.810187 30406 slave.cpp:346] Agent using credential for: test-principal
I1022 08:53:51.810221 30406 credentials.hpp:37] Loading credentials for authentication from
'/tmp/Endpoint_SlaveEndpointTest_AuthorizedRequest_1_gfx53n/http_credentials'
I1022 08:53:51.810627 30406 http.cpp:887] Using default 'basic' HTTP authenticator for realm
'mesos-agent-readonly'
I1022 08:53:51.811038 30406 http.cpp:887] Using default 'basic' HTTP authenticator for realm
'mesos-agent-readwrite'
I1022 08:53:51.812445 30406 slave.cpp:533] Agent resources: cpus(*):2; mem(*):1024; disk(*):1024;
ports(*):[31000-32000]
I1022 08:53:51.812544 30406 slave.cpp:541] Agent attributes: [  ]
I1022 08:53:51.812561 30406 slave.cpp:546] Agent hostname: cfe3b305f9f0
I1022 08:53:51.814112 30396 state.cpp:57] Recovering state from '/tmp/Endpoint_SlaveEndpointTest_AuthorizedRequest_1_En8qwn/meta'
I1022 08:53:51.814517 30403 status_update_manager.cpp:203] Recovering status update manager
I1022 08:53:51.814934 30395 containerizer.cpp:557] Recovering containerizer
I1022 08:53:51.816388 30403 provisioner.cpp:253] Provisioner recovery complete
I1022 08:53:51.816876 30398 slave.cpp:5399] Finished recovery
I1022 08:53:51.817409 30398 slave.cpp:5573] Querying resource estimator for oversubscribable
resources
I1022 08:53:51.817780 30392 slave.cpp:5587] Received oversubscribable resources {} from the
resource estimator
I1022 08:53:51.819726 30401 process.cpp:3377] Handling HTTP event for process 'slave(630)'
with path: '/slave(630)/monitor/statistics.json'
I1022 08:53:51.821022 30399 http.cpp:839] Authorizing principal 'test-principal' to GET the
'/monitor/statistics.json' endpoint
I1022 08:53:51.825475 30395 slave.cpp:787] Agent terminating
[       OK ] Endpoint/SlaveEndpointTest.AuthorizedRequest/1 (29 ms)
[ RUN      ] Endpoint/SlaveEndpointTest.AuthorizedRequest/2
I1022 08:53:51.837759 30372 containerizer.cpp:201] Using isolation: posix/cpu,posix/mem,filesystem/posix,network/cni
W1022 08:53:51.838470 30372 backend.cpp:76] Failed to create 'aufs' backend: AufsBackend requires
root privileges, but is running as user mesos
W1022 08:53:51.838649 30372 backend.cpp:76] Failed to create 'bind' backend: BindBackend requires
root privileges
I1022 08:53:51.841976 30400 slave.cpp:208] Mesos agent started on (631)@172.17.0.2:35446
I1022 08:53:51.841997 30400 slave.cpp:209] Flags at startup: --acls="" --appc_simple_discovery_uri_prefix="http://"
--appc_store_dir="/tmp/mesos/store/appc" --authenticate_http_readonly="true" --authenticate_http_readwrite="true"
--authenticatee="crammd5" --authentication_backoff_factor="1secs" --authorizer="local" --cgroups_cpu_enable_pids_and_tids_count="false"
--cgroups_enable_cfs="false" --cgroups_hierarchy="/sys/fs/cgroup" --cgroups_limit_swap="false"
--cgroups_root="mesos" --container_disk_watch_interval="15secs" --containerizers="mesos" --credential="/tmp/Endpoint_SlaveEndpointTest_AuthorizedRequest_2_Kml3vq/credential"
--default_role="*" --disk_watch_interval="1mins" --docker="docker" --docker_kill_orphans="true"
--docker_registry="https://registry-1.docker.io" --docker_remove_delay="6hrs" --docker_socket="/var/run/docker.sock"
--docker_stop_timeout="0ns" --docker_store_dir="/tmp/mesos/store/docker" --docker_volume_checkpoint_dir="/var/run/mesos/isolators/docker/volume"
--enforce_container_disk_quota="false" --executor_registration_timeout="1mins" --executor_shutdown_grace_period="5secs"
--fetcher_cache_dir="/tmp/Endpoint_SlaveEndpointTest_AuthorizedRequest_2_Kml3vq/fetch" --fetcher_cache_size="2GB"
--frameworks_home="" --gc_delay="1weeks" --gc_disk_headroom="0.1" --hadoop_home="" --help="false"
--hostname_lookup="true" --http_authenticators="basic" --http_command_executor="false" --http_credentials="/tmp/Endpoint_SlaveEndpointTest_AuthorizedRequest_2_Kml3vq/http_credentials"
--image_provisioner_backend="copy" --initialize_driver_logging="true" --isolation="posix/cpu,posix/mem"
--launcher="posix" --launcher_dir="/mesos/mesos-1.2.0/_build/src" --logbufsecs="0" --logging_level="INFO"
--max_completed_executors_per_framework="150" --oversubscribed_resources_interval="15secs"
--perf_duration="10secs" --perf_interval="1mins" --qos_correction_interval_min="0ns" --quiet="false"
--recover="reconnect" --recovery_timeout="15mins" --registration_backoff_factor="10ms" --resources="cpus:2;gpus:0;mem:1024;disk:1024;ports:[31000-32000]"
--revocable_cpu_low_priority="true" --runtime_dir="/tmp/Endpoint_SlaveEndpointTest_AuthorizedRequest_2_Kml3vq"
--sandbox_directory="/mnt/mesos/sandbox" --strict="true" --switch_user="true" --systemd_enable_support="true"
--systemd_runtime_directory="/run/systemd/system" --version="false" --work_dir="/tmp/Endpoint_SlaveEndpointTest_AuthorizedRequest_2_m25eTp"
I1022 08:53:51.842558 30400 credentials.hpp:86] Loading credential for authentication from
'/tmp/Endpoint_SlaveEndpointTest_AuthorizedRequest_2_Kml3vq/credential'
I1022 08:53:51.842715 30400 slave.cpp:346] Agent using credential for: test-principal
I1022 08:53:51.842735 30400 credentials.hpp:37] Loading credentials for authentication from
'/tmp/Endpoint_SlaveEndpointTest_AuthorizedRequest_2_Kml3vq/http_credentials'
I1022 08:53:51.842939 30400 http.cpp:887] Using default 'basic' HTTP authenticator for realm
'mesos-agent-readonly'
I1022 08:53:51.843081 30400 http.cpp:887] Using default 'basic' HTTP authenticator for realm
'mesos-agent-readwrite'
I1022 08:53:51.844239 30400 slave.cpp:533] Agent resources: cpus(*):2; mem(*):1024; disk(*):1024;
ports(*):[31000-32000]
I1022 08:53:51.844333 30400 slave.cpp:541] Agent attributes: [  ]
I1022 08:53:51.844346 30400 slave.cpp:546] Agent hostname: cfe3b305f9f0
I1022 08:53:51.845932 30396 state.cpp:57] Recovering state from '/tmp/Endpoint_SlaveEndpointTest_AuthorizedRequest_2_m25eTp/meta'
I1022 08:53:51.846227 30391 status_update_manager.cpp:203] Recovering status update manager
I1022 08:53:51.846489 30404 containerizer.cpp:557] Recovering containerizer
I1022 08:53:51.847827 30404 provisioner.cpp:253] Provisioner recovery complete
I1022 08:53:51.848453 30402 slave.cpp:5399] Finished recovery
I1022 08:53:51.849042 30402 slave.cpp:5573] Querying resource estimator for oversubscribable
resources
I1022 08:53:51.849436 30404 slave.cpp:5587] Received oversubscribable resources {} from the
resource estimator
I1022 08:53:51.851655 30405 process.cpp:3377] Handling HTTP event for process 'slave(631)'
with path: '/slave(631)/containers'
I1022 08:53:51.852545 30394 http.cpp:839] Authorizing principal 'test-principal' to GET the
'/containers' endpoint
I1022 08:53:51.857250 30405 slave.cpp:787] Agent terminating
[       OK ] Endpoint/SlaveEndpointTest.AuthorizedRequest/2 (30 ms)
[ RUN      ] Endpoint/SlaveEndpointTest.UnauthorizedRequest/0
I1022 08:53:51.869050 30372 containerizer.cpp:201] Using isolation: posix/cpu,posix/mem,filesystem/posix,network/cni
W1022 08:53:51.869807 30372 backend.cpp:76] Failed to create 'aufs' backend: AufsBackend requires
root privileges, but is running as user mesos
W1022 08:53:51.869987 30372 backend.cpp:76] Failed to create 'bind' backend: BindBackend requires
root privileges
I1022 08:53:51.873517 30397 slave.cpp:208] Mesos agent started on (632)@172.17.0.2:35446
I1022 08:53:51.873538 30397 slave.cpp:209] Flags at startup: --acls="" --appc_simple_discovery_uri_prefix="http://"
--appc_store_dir="/tmp/mesos/store/appc" --authenticate_http_readonly="true" --authenticate_http_readwrite="true"
--authenticatee="crammd5" --authentication_backoff_factor="1secs" --authorizer="local" --cgroups_cpu_enable_pids_and_tids_count="false"
--cgroups_enable_cfs="false" --cgroups_hierarchy="/sys/fs/cgroup" --cgroups_limit_swap="false"
--cgroups_root="mesos" --container_disk_watch_interval="15secs" --containerizers="mesos" --credential="/tmp/Endpoint_SlaveEndpointTest_UnauthorizedRequest_0_aYsoit/credential"
--default_role="*" --disk_watch_interval="1mins" --docker="docker" --docker_kill_orphans="true"
--docker_registry="https://registry-1.docker.io" --docker_remove_delay="6hrs" --docker_socket="/var/run/docker.sock"
--docker_stop_timeout="0ns" --docker_store_dir="/tmp/mesos/store/docker" --docker_volume_checkpoint_dir="/var/run/mesos/isolators/docker/volume"
--enforce_container_disk_quota="false" --executor_registration_timeout="1mins" --executor_shutdown_grace_period="5secs"
--fetcher_cache_dir="/tmp/Endpoint_SlaveEndpointTest_UnauthorizedRequest_0_aYsoit/fetch" --fetcher_cache_size="2GB"
--frameworks_home="" --gc_delay="1weeks" --gc_disk_headroom="0.1" --hadoop_home="" --help="false"
--hostname_lookup="true" --http_authenticators="basic" --http_command_executor="false" --http_credentials="/tmp/Endpoint_SlaveEndpointTest_UnauthorizedRequest_0_aYsoit/http_credentials"
--image_provisioner_backend="copy" --initialize_driver_logging="true" --isolation="posix/cpu,posix/mem"
--launcher="posix" --launcher_dir="/mesos/mesos-1.2.0/_build/src" --logbufsecs="0" --logging_level="INFO"
--max_completed_executors_per_framework="150" --oversubscribed_resources_interval="15secs"
--perf_duration="10secs" --perf_interval="1mins" --qos_correction_interval_min="0ns" --quiet="false"
--recover="reconnect" --recovery_timeout="15mins" --registration_backoff_factor="10ms" --resources="cpus:2;gpus:0;mem:1024;disk:1024;ports:[31000-32000]"
--revocable_cpu_low_priority="true" --runtime_dir="/tmp/Endpoint_SlaveEndpointTest_UnauthorizedRequest_0_aYsoit"
--sandbox_directory="/mnt/mesos/sandbox" --strict="true" --switch_user="true" --systemd_enable_support="true"
--systemd_runtime_directory="/run/systemd/system" --version="false" --work_dir="/tmp/Endpoint_SlaveEndpointTest_UnauthorizedRequest_0_OXQuAs"
I1022 08:53:51.874114 30397 credentials.hpp:86] Loading credential for authentication from
'/tmp/Endpoint_SlaveEndpointTest_UnauthorizedRequest_0_aYsoit/credential'
I1022 08:53:51.874300 30397 slave.cpp:346] Agent using credential for: test-principal
I1022 08:53:51.874321 30397 credentials.hpp:37] Loading credentials for authentication from
'/tmp/Endpoint_SlaveEndpointTest_UnauthorizedRequest_0_aYsoit/http_credentials'
I1022 08:53:51.874532 30397 http.cpp:887] Using default 'basic' HTTP authenticator for realm
'mesos-agent-readonly'
I1022 08:53:51.874657 30397 http.cpp:887] Using default 'basic' HTTP authenticator for realm
'mesos-agent-readwrite'
I1022 08:53:51.875710 30397 slave.cpp:533] Agent resources: cpus(*):2; mem(*):1024; disk(*):1024;
ports(*):[31000-32000]
I1022 08:53:51.875818 30397 slave.cpp:541] Agent attributes: [  ]
I1022 08:53:51.875833 30397 slave.cpp:546] Agent hostname: cfe3b305f9f0
I1022 08:53:51.877280 30394 state.cpp:57] Recovering state from '/tmp/Endpoint_SlaveEndpointTest_UnauthorizedRequest_0_OXQuAs/meta'
I1022 08:53:51.877565 30395 status_update_manager.cpp:203] Recovering status update manager
I1022 08:53:51.877739 30402 containerizer.cpp:557] Recovering containerizer
I1022 08:53:51.878973 30399 provisioner.cpp:253] Provisioner recovery complete
I1022 08:53:51.879386 30404 slave.cpp:5399] Finished recovery
I1022 08:53:51.879865 30404 slave.cpp:5573] Querying resource estimator for oversubscribable
resources
I1022 08:53:51.880105 30405 slave.cpp:5587] Received oversubscribable resources {} from the
resource estimator
I1022 08:53:51.882508 30401 process.cpp:3377] Handling HTTP event for process 'slave(632)'
with path: '/slave(632)/monitor/statistics'
I1022 08:53:51.883414 30392 http.cpp:839] Authorizing principal 'test-principal' to GET the
'/monitor/statistics' endpoint
I1022 08:53:51.886781 30402 slave.cpp:787] Agent terminating
[       OK ] Endpoint/SlaveEndpointTest.UnauthorizedRequest/0 (42 ms)
[ RUN      ] Endpoint/SlaveEndpointTest.UnauthorizedRequest/1
I1022 08:53:51.912286 30372 containerizer.cpp:201] Using isolation: posix/cpu,posix/mem,filesystem/posix,network/cni
W1022 08:53:51.912863 30372 backend.cpp:76] Failed to create 'aufs' backend: AufsBackend requires
root privileges, but is running as user mesos
W1022 08:53:51.913020 30372 backend.cpp:76] Failed to create 'bind' backend: BindBackend requires
root privileges
I1022 08:53:51.915726 30400 slave.cpp:208] Mesos agent started on (633)@172.17.0.2:35446
I1022 08:53:51.915772 30400 slave.cpp:209] Flags at startup: --acls="" --appc_simple_discovery_uri_prefix="http://"
--appc_store_dir="/tmp/mesos/store/appc" --authenticate_http_readonly="true" --authenticate_http_readwrite="true"
--authenticatee="crammd5" --authentication_backoff_factor="1secs" --authorizer="local" --cgroups_cpu_enable_pids_and_tids_count="false"
--cgroups_enable_cfs="false" --cgroups_hierarchy="/sys/fs/cgroup" --cgroups_limit_swap="false"
--cgroups_root="mesos" --container_disk_watch_interval="15secs" --containerizers="mesos" --credential="/tmp/Endpoint_SlaveEndpointTest_UnauthorizedRequest_1_6tATuw/credential"
--default_role="*" --disk_watch_interval="1mins" --docker="docker" --docker_kill_orphans="true"
--docker_registry="https://registry-1.docker.io" --docker_remove_delay="6hrs" --docker_socket="/var/run/docker.sock"
--docker_stop_timeout="0ns" --docker_store_dir="/tmp/mesos/store/docker" --docker_volume_checkpoint_dir="/var/run/mesos/isolators/docker/volume"
--enforce_container_disk_quota="false" --executor_registration_timeout="1mins" --executor_shutdown_grace_period="5secs"
--fetcher_cache_dir="/tmp/Endpoint_SlaveEndpointTest_UnauthorizedRequest_1_6tATuw/fetch" --fetcher_cache_size="2GB"
--frameworks_home="" --gc_delay="1weeks" --gc_disk_headroom="0.1" --hadoop_home="" --help="false"
--hostname_lookup="true" --http_authenticators="basic" --http_command_executor="false" --http_credentials="/tmp/Endpoint_SlaveEndpointTest_UnauthorizedRequest_1_6tATuw/http_credentials"
--image_provisioner_backend="copy" --initialize_driver_logging="true" --isolation="posix/cpu,posix/mem"
--launcher="posix" --launcher_dir="/mesos/mesos-1.2.0/_build/src" --logbufsecs="0" --logging_level="INFO"
--max_completed_executors_per_framework="150" --oversubscribed_resources_interval="15secs"
--perf_duration="10secs" --perf_interval="1mins" --qos_correction_interval_min="0ns" --quiet="false"
--recover="reconnect" --recovery_timeout="15mins" --registration_backoff_factor="10ms" --resources="cpus:2;gpus:0;mem:1024;disk:1024;ports:[31000-32000]"
--revocable_cpu_low_priority="true" --runtime_dir="/tmp/Endpoint_SlaveEndpointTest_UnauthorizedRequest_1_6tATuw"
--sandbox_directory="/mnt/mesos/sandbox" --strict="true" --switch_user="true" --systemd_enable_support="true"
--systemd_runtime_directory="/run/systemd/system" --version="false" --work_dir="/tmp/Endpoint_SlaveEndpointTest_UnauthorizedRequest_1_2GcWFv"
I1022 08:53:51.916467 30400 credentials.hpp:86] Loading credential for authentication from
'/tmp/Endpoint_SlaveEndpointTest_UnauthorizedRequest_1_6tATuw/credential'
I1022 08:53:51.916687 30400 slave.cpp:346] Agent using credential for: test-principal
I1022 08:53:51.916714 30400 credentials.hpp:37] Loading credentials for authentication from
'/tmp/Endpoint_SlaveEndpointTest_UnauthorizedRequest_1_6tATuw/http_credentials'
I1022 08:53:51.917009 30400 http.cpp:887] Using default 'basic' HTTP authenticator for realm
'mesos-agent-readonly'
I1022 08:53:51.917202 30400 http.cpp:887] Using default 'basic' HTTP authenticator for realm
'mesos-agent-readwrite'
I1022 08:53:51.918577 30400 slave.cpp:533] Agent resources: cpus(*):2; mem(*):1024; disk(*):1024;
ports(*):[31000-32000]
I1022 08:53:51.918679 30400 slave.cpp:541] Agent attributes: [  ]
I1022 08:53:51.918697 30400 slave.cpp:546] Agent hostname: cfe3b305f9f0
I1022 08:53:51.920536 30406 state.cpp:57] Recovering state from '/tmp/Endpoint_SlaveEndpointTest_UnauthorizedRequest_1_2GcWFv/meta'
I1022 08:53:51.920832 30403 status_update_manager.cpp:203] Recovering status update manager
I1022 08:53:51.921145 30404 containerizer.cpp:557] Recovering containerizer
I1022 08:53:51.922747 30404 provisioner.cpp:253] Provisioner recovery complete
I1022 08:53:51.923233 30400 slave.cpp:5399] Finished recovery
I1022 08:53:51.923985 30400 slave.cpp:5573] Querying resource estimator for oversubscribable
resources
I1022 08:53:51.924357 30399 slave.cpp:5587] Received oversubscribable resources {} from the
resource estimator
I1022 08:53:51.926375 30396 process.cpp:3377] Handling HTTP event for process 'slave(633)'
with path: '/slave(633)/monitor/statistics.json'
I1022 08:53:51.927578 30396 http.cpp:839] Authorizing principal 'test-principal' to GET the
'/monitor/statistics.json' endpoint
I1022 08:53:51.930325 30391 slave.cpp:787] Agent terminating
[       OK ] Endpoint/SlaveEndpointTest.UnauthorizedRequest/1 (29 ms)
[ RUN      ] Endpoint/SlaveEndpointTest.UnauthorizedRequest/2
I1022 08:53:51.939450 30372 containerizer.cpp:201] Using isolation: posix/cpu,posix/mem,filesystem/posix,network/cni
W1022 08:53:51.940084 30372 backend.cpp:76] Failed to create 'aufs' backend: AufsBackend requires
root privileges, but is running as user mesos
W1022 08:53:51.940254 30372 backend.cpp:76] Failed to create 'bind' backend: BindBackend requires
root privileges
I1022 08:53:51.942925 30392 slave.cpp:208] Mesos agent started on (634)@172.17.0.2:35446
I1022 08:53:51.942950 30392 slave.cpp:209] Flags at startup: --acls="" --appc_simple_discovery_uri_prefix="http://"
--appc_store_dir="/tmp/mesos/store/appc" --authenticate_http_readonly="true" --authenticate_http_readwrite="true"
--authenticatee="crammd5" --authentication_backoff_factor="1secs" --authorizer="local" --cgroups_cpu_enable_pids_and_tids_count="false"
--cgroups_enable_cfs="false" --cgroups_hierarchy="/sys/fs/cgroup" --cgroups_limit_swap="false"
--cgroups_root="mesos" --container_disk_watch_interval="15secs" --containerizers="mesos" --credential="/tmp/Endpoint_SlaveEndpointTest_UnauthorizedRequest_2_2Bdc2z/credential"
--default_role="*" --disk_watch_interval="1mins" --docker="docker" --docker_kill_orphans="true"
--docker_registry="https://registry-1.docker.io" --docker_remove_delay="6hrs" --docker_socket="/var/run/docker.sock"
--docker_stop_timeout="0ns" --docker_store_dir="/tmp/mesos/store/docker" --docker_volume_checkpoint_dir="/var/run/mesos/isolators/docker/volume"
--enforce_container_disk_quota="false" --executor_registration_timeout="1mins" --executor_shutdown_grace_period="5secs"
--fetcher_cache_dir="/tmp/Endpoint_SlaveEndpointTest_UnauthorizedRequest_2_2Bdc2z/fetch" --fetcher_cache_size="2GB"
--frameworks_home="" --gc_delay="1weeks" --gc_disk_headroom="0.1" --hadoop_home="" --help="false"
--hostname_lookup="true" --http_authenticators="basic" --http_command_executor="false" --http_credentials="/tmp/Endpoint_SlaveEndpointTest_UnauthorizedRequest_2_2Bdc2z/http_credentials"
--image_provisioner_backend="copy" --initialize_driver_logging="true" --isolation="posix/cpu,posix/mem"
--launcher="posix" --launcher_dir="/mesos/mesos-1.2.0/_build/src" --logbufsecs="0" --logging_level="INFO"
--max_completed_executors_per_framework="150" --oversubscribed_resources_interval="15secs"
--perf_duration="10secs" --perf_interval="1mins" --qos_correction_interval_min="0ns" --quiet="false"
--recover="reconnect" --recovery_timeout="15mins" --registration_backoff_factor="10ms" --resources="cpus:2;gpus:0;mem:1024;disk:1024;ports:[31000-32000]"
--revocable_cpu_low_priority="true" --runtime_dir="/tmp/Endpoint_SlaveEndpointTest_UnauthorizedRequest_2_2Bdc2z"
--sandbox_directory="/mnt/mesos/sandbox" --strict="true" --switch_user="true" --systemd_enable_support="true"
--systemd_runtime_directory="/run/systemd/system" --version="false" --work_dir="/tmp/Endpoint_SlaveEndpointTest_UnauthorizedRequest_2_sItJ8y"
I1022 08:53:51.943648 30392 credentials.hpp:86] Loading credential for authentication from
'/tmp/Endpoint_SlaveEndpointTest_UnauthorizedRequest_2_2Bdc2z/credential'
I1022 08:53:51.943859 30392 slave.cpp:346] Agent using credential for: test-principal
I1022 08:53:51.943887 30392 credentials.hpp:37] Loading credentials for authentication from
'/tmp/Endpoint_SlaveEndpointTest_UnauthorizedRequest_2_2Bdc2z/http_credentials'
I1022 08:53:51.944134 30392 http.cpp:887] Using default 'basic' HTTP authenticator for realm
'mesos-agent-readonly'
I1022 08:53:51.944273 30392 http.cpp:887] Using default 'basic' HTTP authenticator for realm
'mesos-agent-readwrite'
I1022 08:53:51.945269 30392 slave.cpp:533] Agent resources: cpus(*):2; mem(*):1024; disk(*):1024;
ports(*):[31000-32000]
I1022 08:53:51.945343 30392 slave.cpp:541] Agent attributes: [  ]
I1022 08:53:51.945353 30392 slave.cpp:546] Agent hostname: cfe3b305f9f0
I1022 08:53:51.947010 30399 state.cpp:57] Recovering state from '/tmp/Endpoint_SlaveEndpointTest_UnauthorizedRequest_2_sItJ8y/meta'
I1022 08:53:51.947327 30406 status_update_manager.cpp:203] Recovering status update manager
I1022 08:53:51.947628 30392 containerizer.cpp:557] Recovering containerizer
I1022 08:53:51.949643 30401 provisioner.cpp:253] Provisioner recovery complete
I1022 08:53:51.950186 30393 slave.cpp:5399] Finished recovery
I1022 08:53:51.950824 30393 slave.cpp:5573] Querying resource estimator for oversubscribable
resources
I1022 08:53:51.951148 30397 slave.cpp:5587] Received oversubscribable resources {} from the
resource estimator
I1022 08:53:51.953243 30391 process.cpp:3377] Handling HTTP event for process 'slave(634)'
with path: '/slave(634)/containers'
I1022 08:53:51.954375 30406 http.cpp:839] Authorizing principal 'test-principal' to GET the
'/containers' endpoint
I1022 08:53:51.957643 30405 slave.cpp:787] Agent terminating
[       OK ] Endpoint/SlaveEndpointTest.UnauthorizedRequest/2 (28 ms)
[ RUN      ] Endpoint/SlaveEndpointTest.NoAuthorizer/0
I1022 08:53:51.968575 30372 containerizer.cpp:201] Using isolation: posix/cpu,posix/mem,filesystem/posix,network/cni
W1022 08:53:51.969127 30372 backend.cpp:76] Failed to create 'aufs' backend: AufsBackend requires
root privileges, but is running as user mesos
W1022 08:53:51.969274 30372 backend.cpp:76] Failed to create 'bind' backend: BindBackend requires
root privileges
I1022 08:53:51.970441 30372 cluster.cpp:435] Creating default 'local' authorizer
I1022 08:53:51.972403 30392 slave.cpp:208] Mesos agent started on (635)@172.17.0.2:35446
I1022 08:53:51.972429 30392 slave.cpp:209] Flags at startup: --acls="" --appc_simple_discovery_uri_prefix="http://"
--appc_store_dir="/tmp/mesos/store/appc" --authenticate_http_readonly="true" --authenticate_http_readwrite="true"
--authenticatee="crammd5" --authentication_backoff_factor="1secs" --authorizer="local" --cgroups_cpu_enable_pids_and_tids_count="false"
--cgroups_enable_cfs="false" --cgroups_hierarchy="/sys/fs/cgroup" --cgroups_limit_swap="false"
--cgroups_root="mesos" --container_disk_watch_interval="15secs" --containerizers="mesos" --credential="/tmp/Endpoint_SlaveEndpointTest_NoAuthorizer_0_0ucWRD/credential"
--default_role="*" --disk_watch_interval="1mins" --docker="docker" --docker_kill_orphans="true"
--docker_registry="https://registry-1.docker.io" --docker_remove_delay="6hrs" --docker_socket="/var/run/docker.sock"
--docker_stop_timeout="0ns" --docker_store_dir="/tmp/mesos/store/docker" --docker_volume_checkpoint_dir="/var/run/mesos/isolators/docker/volume"
--enforce_container_disk_quota="false" --executor_registration_timeout="1mins" --executor_shutdown_grace_period="5secs"
--fetcher_cache_dir="/tmp/Endpoint_SlaveEndpointTest_NoAuthorizer_0_0ucWRD/fetch" --fetcher_cache_size="2GB"
--frameworks_home="" --gc_delay="1weeks" --gc_disk_headroom="0.1" --hadoop_home="" --help="false"
--hostname_lookup="true" --http_authenticators="basic" --http_command_executor="false" --http_credentials="/tmp/Endpoint_SlaveEndpointTest_NoAuthorizer_0_0ucWRD/http_credentials"
--image_provisioner_backend="copy" --initialize_driver_logging="true" --isolation="posix/cpu,posix/mem"
--launcher="posix" --launcher_dir="/mesos/mesos-1.2.0/_build/src" --logbufsecs="0" --logging_level="INFO"
--max_completed_executors_per_framework="150" --oversubscribed_resources_interval="15secs"
--perf_duration="10secs" --perf_interval="1mins" --qos_correction_interval_min="0ns" --quiet="false"
--recover="reconnect" --recovery_timeout="15mins" --registration_backoff_factor="10ms" --resources="cpus:2;gpus:0;mem:1024;disk:1024;ports:[31000-32000]"
--revocable_cpu_low_priority="true" --runtime_dir="/tmp/Endpoint_SlaveEndpointTest_NoAuthorizer_0_0ucWRD"
--sandbox_directory="/mnt/mesos/sandbox" --strict="true" --switch_user="true" --systemd_enable_support="true"
--systemd_runtime_directory="/run/systemd/system" --version="false" --work_dir="/tmp/Endpoint_SlaveEndpointTest_NoAuthorizer_0_ACqMTC"
I1022 08:53:51.972870 30392 credentials.hpp:86] Loading credential for authentication from
'/tmp/Endpoint_SlaveEndpointTest_NoAuthorizer_0_0ucWRD/credential'
I1022 08:53:51.973065 30392 slave.cpp:346] Agent using credential for: test-principal
I1022 08:53:51.973089 30392 credentials.hpp:37] Loading credentials for authentication from
'/tmp/Endpoint_SlaveEndpointTest_NoAuthorizer_0_0ucWRD/http_credentials'
I1022 08:53:51.973333 30392 http.cpp:887] Using default 'basic' HTTP authenticator for realm
'mesos-agent-readonly'
I1022 08:53:51.973467 30392 http.cpp:887] Using default 'basic' HTTP authenticator for realm
'mesos-agent-readwrite'
I1022 08:53:51.974431 30392 slave.cpp:533] Agent resources: cpus(*):2; mem(*):1024; disk(*):1024;
ports(*):[31000-32000]
I1022 08:53:51.974508 30392 slave.cpp:541] Agent attributes: [  ]
I1022 08:53:51.974525 30392 slave.cpp:546] Agent hostname: cfe3b305f9f0
I1022 08:53:51.975983 30399 state.cpp:57] Recovering state from '/tmp/Endpoint_SlaveEndpointTest_NoAuthorizer_0_ACqMTC/meta'
I1022 08:53:51.976203 30405 status_update_manager.cpp:203] Recovering status update manager
I1022 08:53:51.976455 30397 containerizer.cpp:557] Recovering containerizer
I1022 08:53:51.977650 30403 provisioner.cpp:253] Provisioner recovery complete
I1022 08:53:51.977987 30399 slave.cpp:5399] Finished recovery
I1022 08:53:51.978492 30399 slave.cpp:5573] Querying resource estimator for oversubscribable
resources
I1022 08:53:51.978724 30395 slave.cpp:5587] Received oversubscribable resources {} from the
resource estimator
I1022 08:53:51.980289 30394 process.cpp:3377] Handling HTTP event for process 'slave(635)'
with path: '/slave(635)/monitor/statistics'
I1022 08:53:51.981309 30395 http.cpp:839] Authorizing principal 'test-principal' to GET the
'/monitor/statistics' endpoint
I1022 08:53:51.984706 30391 slave.cpp:787] Agent terminating
[       OK ] Endpoint/SlaveEndpointTest.NoAuthorizer/0 (26 ms)
[ RUN      ] Endpoint/SlaveEndpointTest.NoAuthorizer/1
I1022 08:53:51.996413 30372 containerizer.cpp:201] Using isolation: posix/cpu,posix/mem,filesystem/posix,network/cni
W1022 08:53:51.997063 30372 backend.cpp:76] Failed to create 'aufs' backend: AufsBackend requires
root privileges, but is running as user mesos
W1022 08:53:51.997242 30372 backend.cpp:76] Failed to create 'bind' backend: BindBackend requires
root privileges
I1022 08:53:51.998569 30372 cluster.cpp:435] Creating default 'local' authorizer
I1022 08:53:52.000300 30391 slave.cpp:208] Mesos agent started on (636)@172.17.0.2:35446
I1022 08:53:52.000322 30391 slave.cpp:209] Flags at startup: --acls="" --appc_simple_discovery_uri_prefix="http://"
--appc_store_dir="/tmp/mesos/store/appc" --authenticate_http_readonly="true" --authenticate_http_readwrite="true"
--authenticatee="crammd5" --authentication_backoff_factor="1secs" --authorizer="local" --cgroups_cpu_enable_pids_and_tids_count="false"
--cgroups_enable_cfs="false" --cgroups_hierarchy="/sys/fs/cgroup" --cgroups_limit_swap="false"
--cgroups_root="mesos" --container_disk_watch_interval="15secs" --containerizers="mesos" --credential="/tmp/Endpoint_SlaveEndpointTest_NoAuthorizer_1_4yrjZH/credential"
--default_role="*" --disk_watch_interval="1mins" --docker="docker" --docker_kill_orphans="true"
--docker_registry="https://registry-1.docker.io" --docker_remove_delay="6hrs" --docker_socket="/var/run/docker.sock"
--docker_stop_timeout="0ns" --docker_store_dir="/tmp/mesos/store/docker" --docker_volume_checkpoint_dir="/var/run/mesos/isolators/docker/volume"
--enforce_container_disk_quota="false" --executor_registration_timeout="1mins" --executor_shutdown_grace_period="5secs"
--fetcher_cache_dir="/tmp/Endpoint_SlaveEndpointTest_NoAuthorizer_1_4yrjZH/fetch" --fetcher_cache_size="2GB"
--frameworks_home="" --gc_delay="1weeks" --gc_disk_headroom="0.1" --hadoop_home="" --help="false"
--hostname_lookup="true" --http_authenticators="basic" --http_command_executor="false" --http_credentials="/tmp/Endpoint_SlaveEndpointTest_NoAuthorizer_1_4yrjZH/http_credentials"
--image_provisioner_backend="copy" --initialize_driver_logging="true" --isolation="posix/cpu,posix/mem"
--launcher="posix" --launcher_dir="/mesos/mesos-1.2.0/_build/src" --logbufsecs="0" --logging_level="INFO"
--max_completed_executors_per_framework="150" --oversubscribed_resources_interval="15secs"
--perf_duration="10secs" --perf_interval="1mins" --qos_correction_interval_min="0ns" --quiet="false"
--recover="reconnect" --recovery_timeout="15mins" --registration_backoff_factor="10ms" --resources="cpus:2;gpus:0;mem:1024;disk:1024;ports:[31000-32000]"
--revocable_cpu_low_priority="true" --runtime_dir="/tmp/Endpoint_SlaveEndpointTest_NoAuthorizer_1_4yrjZH"
--sandbox_directory="/mnt/mesos/sandbox" --strict="true" --switch_user="true" --systemd_enable_support="true"
--systemd_runtime_directory="/run/systemd/system" --version="false" --work_dir="/tmp/Endpoint_SlaveEndpointTest_NoAuthorizer_1_S5UKWG"
I1022 08:53:52.000970 30391 credentials.hpp:86] Loading credential for authentication from
'/tmp/Endpoint_SlaveEndpointTest_NoAuthorizer_1_4yrjZH/credential'
I1022 08:53:52.001132 30391 slave.cpp:346] Agent using credential for: test-principal
I1022 08:53:52.001159 30391 credentials.hpp:37] Loading credentials for authentication from
'/tmp/Endpoint_SlaveEndpointTest_NoAuthorizer_1_4yrjZH/http_credentials'
I1022 08:53:52.001416 30391 http.cpp:887] Using default 'basic' HTTP authenticator for realm
'mesos-agent-readonly'
I1022 08:53:52.001565 30391 http.cpp:887] Using default 'basic' HTTP authenticator for realm
'mesos-agent-readwrite'
I1022 08:53:52.002714 30391 slave.cpp:533] Agent resources: cpus(*):2; mem(*):1024; disk(*):1024;
ports(*):[31000-32000]
I1022 08:53:52.002804 30391 slave.cpp:541] Agent attributes: [  ]
I1022 08:53:52.002825 30391 slave.cpp:546] Agent hostname: cfe3b305f9f0
I1022 08:53:52.004439 30401 state.cpp:57] Recovering state from '/tmp/Endpoint_SlaveEndpointTest_NoAuthorizer_1_S5UKWG/meta'
I1022 08:53:52.004714 30393 status_update_manager.cpp:203] Recovering status update manager
I1022 08:53:52.004962 30404 containerizer.cpp:557] Recovering containerizer
I1022 08:53:52.006275 30391 provisioner.cpp:253] Provisioner recovery complete
I1022 08:53:52.006706 30398 slave.cpp:5399] Finished recovery
I1022 08:53:52.007254 30398 slave.cpp:5573] Querying resource estimator for oversubscribable
resources
I1022 08:53:52.007534 30406 slave.cpp:5587] Received oversubscribable resources {} from the
resource estimator
I1022 08:53:52.009601 30392 process.cpp:3377] Handling HTTP event for process 'slave(636)'
with path: '/slave(636)/monitor/statistics.json'
I1022 08:53:52.010751 30394 http.cpp:839] Authorizing principal 'test-principal' to GET the
'/monitor/statistics.json' endpoint
I1022 08:53:52.015352 30393 slave.cpp:787] Agent terminating
[       OK ] Endpoint/SlaveEndpointTest.NoAuthorizer/1 (30 ms)
[ RUN      ] Endpoint/SlaveEndpointTest.NoAuthorizer/2
I1022 08:53:52.025429 30372 containerizer.cpp:201] Using isolation: posix/cpu,posix/mem,filesystem/posix,network/cni
W1022 08:53:52.025988 30372 backend.cpp:76] Failed to create 'aufs' backend: AufsBackend requires
root privileges, but is running as user mesos
W1022 08:53:52.026126 30372 backend.cpp:76] Failed to create 'bind' backend: BindBackend requires
root privileges
I1022 08:53:52.027576 30372 cluster.cpp:435] Creating default 'local' authorizer
I1022 08:53:52.029217 30402 slave.cpp:208] Mesos agent started on (637)@172.17.0.2:35446
I1022 08:53:52.029249 30402 slave.cpp:209] Flags at startup: --acls="" --appc_simple_discovery_uri_prefix="http://"
--appc_store_dir="/tmp/mesos/store/appc" --authenticate_http_readonly="true" --authenticate_http_readwrite="true"
--authenticatee="crammd5" --authentication_backoff_factor="1secs" --authorizer="local" --cgroups_cpu_enable_pids_and_tids_count="false"
--cgroups_enable_cfs="false" --cgroups_hierarchy="/sys/fs/cgroup" --cgroups_limit_swap="false"
--cgroups_root="mesos" --container_disk_watch_interval="15secs" --containerizers="mesos" --credential="/tmp/Endpoint_SlaveEndpointTest_NoAuthorizer_2_vDEVpM/credential"
--default_role="*" --disk_watch_interval="1mins" --docker="docker" --docker_kill_orphans="true"
--docker_registry="https://registry-1.docker.io" --docker_remove_delay="6hrs" --docker_socket="/var/run/docker.sock"
--docker_stop_timeout="0ns" --docker_store_dir="/tmp/mesos/store/docker" --docker_volume_checkpoint_dir="/var/run/mesos/isolators/docker/volume"
--enforce_container_disk_quota="false" --executor_registration_timeout="1mins" --executor_shutdown_grace_period="5secs"
--fetcher_cache_dir="/tmp/Endpoint_SlaveEndpointTest_NoAuthorizer_2_vDEVpM/fetch" --fetcher_cache_size="2GB"
--frameworks_home="" --gc_delay="1weeks" --gc_disk_headroom="0.1" --hadoop_home="" --help="false"
--hostname_lookup="true" --http_authenticators="basic" --http_command_executor="false" --http_credentials="/tmp/Endpoint_SlaveEndpointTest_NoAuthorizer_2_vDEVpM/http_credentials"
--image_provisioner_backend="copy" --initialize_driver_logging="true" --isolation="posix/cpu,posix/mem"
--launcher="posix" --launcher_dir="/mesos/mesos-1.2.0/_build/src" --logbufsecs="0" --logging_level="INFO"
--max_completed_executors_per_framework="150" --oversubscribed_resources_interval="15secs"
--perf_duration="10secs" --perf_interval="1mins" --qos_correction_interval_min="0ns" --quiet="false"
--recover="reconnect" --recovery_timeout="15mins" --registration_backoff_factor="10ms" --resources="cpus:2;gpus:0;mem:1024;disk:1024;ports:[31000-32000]"
--revocable_cpu_low_priority="true" --runtime_dir="/tmp/Endpoint_SlaveEndpointTest_NoAuthorizer_2_vDEVpM"
--sandbox_directory="/mnt/mesos/sandbox" --strict="true" --switch_user="true" --systemd_enable_support="true"
--systemd_runtime_directory="/run/systemd/system" --version="false" --work_dir="/tmp/Endpoint_SlaveEndpointTest_NoAuthorizer_2_BuNxiL"
I1022 08:53:52.029947 30402 credentials.hpp:86] Loading credential for authentication from
'/tmp/Endpoint_SlaveEndpointTest_NoAuthorizer_2_vDEVpM/credential'
I1022 08:53:52.030187 30402 slave.cpp:346] Agent using credential for: test-principal
I1022 08:53:52.030215 30402 credentials.hpp:37] Loading credentials for authentication from
'/tmp/Endpoint_SlaveEndpointTest_NoAuthorizer_2_vDEVpM/http_credentials'
I1022 08:53:52.030506 30402 http.cpp:887] Using default 'basic' HTTP authenticator for realm
'mesos-agent-readonly'
I1022 08:53:52.030679 30402 http.cpp:887] Using default 'basic' HTTP authenticator for realm
'mesos-agent-readwrite'
I1022 08:53:52.032119 30402 slave.cpp:533] Agent resources: cpus(*):2; mem(*):1024; disk(*):1024;
ports(*):[31000-32000]
I1022 08:53:52.032222 30402 slave.cpp:541] Agent attributes: [  ]
I1022 08:53:52.032238 30402 slave.cpp:546] Agent hostname: cfe3b305f9f0
I1022 08:53:52.034078 30403 state.cpp:57] Recovering state from '/tmp/Endpoint_SlaveEndpointTest_NoAuthorizer_2_BuNxiL/meta'
I1022 08:53:52.034407 30394 status_update_manager.cpp:203] Recovering status update manager
I1022 08:53:52.034737 30399 containerizer.cpp:557] Recovering containerizer
I1022 08:53:52.036125 30391 provisioner.cpp:253] Provisioner recovery complete
I1022 08:53:52.036496 30394 slave.cpp:5399] Finished recovery
I1022 08:53:52.036983 30394 slave.cpp:5573] Querying resource estimator for oversubscribable
resources
I1022 08:53:52.037255 30398 slave.cpp:5587] Received oversubscribable resources {} from the
resource estimator
I1022 08:53:52.039136 30398 process.cpp:3377] Handling HTTP event for process 'slave(637)'
with path: '/slave(637)/containers'
I1022 08:53:52.039983 30393 http.cpp:839] Authorizing principal 'test-principal' to GET the
'/containers' endpoint
I1022 08:53:52.043267 30397 slave.cpp:787] Agent terminating
[       OK ] Endpoint/SlaveEndpointTest.NoAuthorizer/2 (27 ms)
[----------] 9 tests from Endpoint/SlaveEndpointTest (276 ms total)

[----------] Global test environment tear-down
[==========] 1360 tests from 154 test cases ran. (1031234 ms total)
[  PASSED  ] 1359 tests.
[  FAILED  ] 1 test, listed below:
[  FAILED  ] MasterTest.UnreachableTaskAfterFailover

 1 FAILED TEST
  YOU HAVE 5 DISABLED TESTS

make[4]: *** [check-local] Error 1
make[4]: Leaving directory `/mesos/mesos-1.2.0/_build/src'
make[3]: *** [check-am] Error 2
make[3]: Leaving directory `/mesos/mesos-1.2.0/_build/src'
make[2]: *** [check] Error 2
make[2]: Leaving directory `/mesos/mesos-1.2.0/_build/src'
make[1]: *** [check-recursive] Error 1
make[1]: Leaving directory `/mesos/mesos-1.2.0/_build'
make: *** [distcheck] Error 1
+ docker rmi mesos-1477123568-26461
Untagged: mesos-1477123568-26461:latest
Deleted: sha256:b51406256c6c5877c840540ad4c9e1d82ec9865699b59dd801b621e45bb17ef3
Deleted: sha256:38f00120fb6b0c0f337a5ab15c523e8baeefb89b997c28e4a5cc3e458c8e8a3c
Deleted: sha256:394d11e3043b1ef31045b2d8e880e7f2118ac12e841f8f12df9a9083d984be9d
Deleted: sha256:e15b828fe3f706abf726fbf3ba41278efd30b938893203960ca747e967c9766a
Deleted: sha256:17fbb2244fc2c554aea13be9272f483b56289807bd811b23d9e87a829b98fb60
Deleted: sha256:487e32d35b707abf7624fe510f0a5d29bbe00e0ea006a884bb8df88ecd8f2600
Deleted: sha256:fad4edd4163119f785ced24b0216de0f61cfa6c1847d078fbc5d7c11783ba311
Deleted: sha256:8c8a96adc4fe8877b8ce27a95ae05bd08821386e26402ded9f4c293210f9ce99
Deleted: sha256:e8d55f4a86e4b9f963ac88ed791676a538ee03a794c8c9b359674a81d89bdb6e
Deleted: sha256:5f8117a4721d39ac3fa657ec45340331e431c92527559f6c451889a0451a9f7f
Deleted: sha256:ce0be2c77d06d0ffa1b3d4f2a61a881624186139adf8ac1ab14a950b209f2e74
Deleted: sha256:9dbdeb71d49dc4385d3d55586fd333c24a018569dbfdc6b7222cda07628e9b29
Deleted: sha256:f26ea0b4bdd008351700f30cf6148f2a27adfc0510b70466a5f2920f9772a27d
Deleted: sha256:e8be91e3848c3f1c0b60b292a2ed8279f27b3b0d8c43715e2abd22d00a51a27f
Deleted: sha256:ae16e1d2b70e38e6035f6c572e4de6e9a1a9c767f749bda0456d323e2c67856f
Deleted: sha256:492d44d3aa06772571d3bdd08d06414fb47f46db8c6aab3d492995106314d55f
Deleted: sha256:e0000cadba31ff700bc8a29708404fc88e73d2c0981bc537448f2e8fb271fd40
Deleted: sha256:b5c5948f1b6408ad3d0dfc0fcde8680ad3fff58952af08df8697ed7aa60e799d
Deleted: sha256:6483dc396fab50226b7f61d424e15f31f3676279fd1940a6aa64272714d99f8c
Deleted: sha256:4e1b7c86df5f6e4230a21a4c882ba2505c65e9ffbe7e517b3859ade169c07ada
Deleted: sha256:a2ece662f517f9493189f7e9aa03943c0306b0cab2d8db37acc2793aab5ee52e
Deleted: sha256:5a88cf98c9365dfe973470f7f83b97dd7e321768eddf915633e02150b448c2a0
Deleted: sha256:015d524709f9edb18d759fbeccf1cd40b921b32f68fce9a9c38400b6d237494f
Deleted: sha256:19769b7656e06d3928557751051cc244fa3bd6f7a683b1ebd7f220df5ccfdf17
Deleted: sha256:b52159d88215127442eb465426a6b41250a0fa5c75e48340e7888331db9469dc
Build step 'Execute shell' marked build as failure

Mime
View raw message