mesos-builds mailing list archives

Site index · List index
Message view « Date » · « Thread »
Top « Date » · « Thread »
From Apache Jenkins Server <jenk...@builds.apache.org>
Subject Build failed in Jenkins: Mesos » autotools,clang,--verbose,GLOG_v=1 MESOS_VERBOSE=1,ubuntu:14.04,(docker||Hadoop)&&(!ubuntu-us1)&&(!ubuntu-6) #2821
Date Sat, 22 Oct 2016 07:47:10 GMT
See <https://builds.apache.org/job/Mesos/BUILDTOOL=autotools,COMPILER=clang,CONFIGURATION=--verbose,ENVIRONMENT=GLOG_v=1%20MESOS_VERBOSE=1,OS=ubuntu%3A14.04,label_exp=(docker%7C%7CHadoop)&&(!ubuntu-us1)&&(!ubuntu-6)/2821/changes>

Changes:

[bmahler] Factored out the port range helpers into a test header.

[bmahler] Added benchmark test for `Resources::contains`.

[bmahler] Minor cleanup to the resource arithmetic benchmark test.

[yujie.jay] Added abstractions for working with POSIX resource limits.

[yujie.jay] Add rlimit support to Mesos containerizer.

[yujie.jay] Added rlimit isolator.

[yujie.jay] Consistently use rlimits in the code base.

[yujie.jay] Added tests for rlimits isolator.

------------------------------------------
[...truncated 214280 lines...]
I1022 07:46:53.084116 27847 containerizer.cpp:201] Using isolation: posix/cpu,posix/mem,filesystem/posix,network/cni
W1022 07:46:53.084681 27847 backend.cpp:76] Failed to create 'aufs' backend: AufsBackend requires
root privileges, but is running as user mesos
W1022 07:46:53.084826 27847 backend.cpp:76] Failed to create 'bind' backend: BindBackend requires
root privileges
I1022 07:46:53.087741 27872 slave.cpp:208] Mesos agent started on (633)@172.17.0.2:49711
I1022 07:46:53.087776 27872 slave.cpp:209] Flags at startup: --acls="" --appc_simple_discovery_uri_prefix="http://"
--appc_store_dir="/tmp/mesos/store/appc" --authenticate_http_readonly="true" --authenticate_http_readwrite="true"
--authenticatee="crammd5" --authentication_backoff_factor="1secs" --authorizer="local" --cgroups_cpu_enable_pids_and_tids_count="false"
--cgroups_enable_cfs="false" --cgroups_hierarchy="/sys/fs/cgroup" --cgroups_limit_swap="false"
--cgroups_root="mesos" --container_disk_watch_interval="15secs" --containerizers="mesos" --credential="/tmp/Endpoint_SlaveEndpointTest_AuthorizedRequest_1_AbET3P/credential"
--default_role="*" --disk_watch_interval="1mins" --docker="docker" --docker_kill_orphans="true"
--docker_registry="https://registry-1.docker.io" --docker_remove_delay="6hrs" --docker_socket="/var/run/docker.sock"
--docker_stop_timeout="0ns" --docker_store_dir="/tmp/mesos/store/docker" --docker_volume_checkpoint_dir="/var/run/mesos/isolators/docker/volume"
--enforce_container_disk_quota="false" --executor_registration_timeout="1mins" --executor_shutdown_grace_period="5secs"
--fetcher_cache_dir="/tmp/Endpoint_SlaveEndpointTest_AuthorizedRequest_1_AbET3P/fetch" --fetcher_cache_size="2GB"
--frameworks_home="" --gc_delay="1weeks" --gc_disk_headroom="0.1" --hadoop_home="" --help="false"
--hostname_lookup="true" --http_authenticators="basic" --http_command_executor="false" --http_credentials="/tmp/Endpoint_SlaveEndpointTest_AuthorizedRequest_1_AbET3P/http_credentials"
--image_provisioner_backend="copy" --initialize_driver_logging="true" --isolation="posix/cpu,posix/mem"
--launcher="posix" --launcher_dir="/mesos/mesos-1.2.0/_build/src" --logbufsecs="0" --logging_level="INFO"
--max_completed_executors_per_framework="150" --oversubscribed_resources_interval="15secs"
--perf_duration="10secs" --perf_interval="1mins" --qos_correction_interval_min="0ns" --quiet="false"
--recover="reconnect" --recovery_timeout="15mins" --registration_backoff_factor="10ms" --resources="cpus:2;gpus:0;mem:1024;disk:1024;ports:[31000-32000]"
--revocable_cpu_low_priority="true" --runtime_dir="/tmp/Endpoint_SlaveEndpointTest_AuthorizedRequest_1_AbET3P"
--sandbox_directory="/mnt/mesos/sandbox" --strict="true" --switch_user="true" --systemd_enable_support="true"
--systemd_runtime_directory="/run/systemd/system" --version="false" --work_dir="/tmp/Endpoint_SlaveEndpointTest_AuthorizedRequest_1_TIIjmm"
I1022 07:46:53.088330 27872 credentials.hpp:86] Loading credential for authentication from
'/tmp/Endpoint_SlaveEndpointTest_AuthorizedRequest_1_AbET3P/credential'
I1022 07:46:53.088467 27872 slave.cpp:346] Agent using credential for: test-principal
I1022 07:46:53.088486 27872 credentials.hpp:37] Loading credentials for authentication from
'/tmp/Endpoint_SlaveEndpointTest_AuthorizedRequest_1_AbET3P/http_credentials'
I1022 07:46:53.088675 27872 http.cpp:887] Using default 'basic' HTTP authenticator for realm
'mesos-agent-readonly'
I1022 07:46:53.088795 27872 http.cpp:887] Using default 'basic' HTTP authenticator for realm
'mesos-agent-readwrite'
I1022 07:46:53.089733 27872 slave.cpp:533] Agent resources: cpus(*):2; mem(*):1024; disk(*):1024;
ports(*):[31000-32000]
I1022 07:46:53.089804 27872 slave.cpp:541] Agent attributes: [  ]
I1022 07:46:53.089818 27872 slave.cpp:546] Agent hostname: e27adbc2a48d
I1022 07:46:53.091061 27871 state.cpp:57] Recovering state from '/tmp/Endpoint_SlaveEndpointTest_AuthorizedRequest_1_TIIjmm/meta'
I1022 07:46:53.091310 27869 status_update_manager.cpp:203] Recovering status update manager
I1022 07:46:53.091573 27875 containerizer.cpp:557] Recovering containerizer
I1022 07:46:53.092885 27875 provisioner.cpp:253] Provisioner recovery complete
I1022 07:46:53.093328 27867 slave.cpp:5399] Finished recovery
I1022 07:46:53.093760 27867 slave.cpp:5573] Querying resource estimator for oversubscribable
resources
I1022 07:46:53.094041 27879 slave.cpp:5587] Received oversubscribable resources {} from the
resource estimator
I1022 07:46:53.095552 27875 process.cpp:3377] Handling HTTP event for process 'slave(633)'
with path: '/slave(633)/monitor/statistics.json'
I1022 07:46:53.096339 27877 http.cpp:839] Authorizing principal 'test-principal' to GET the
'/monitor/statistics.json' endpoint
I1022 07:46:53.099474 27867 slave.cpp:787] Agent terminating
[       OK ] Endpoint/SlaveEndpointTest.AuthorizedRequest/1 (25 ms)
[ RUN      ] Endpoint/SlaveEndpointTest.AuthorizedRequest/2
I1022 07:46:53.109055 27847 containerizer.cpp:201] Using isolation: posix/cpu,posix/mem,filesystem/posix,network/cni
W1022 07:46:53.109586 27847 backend.cpp:76] Failed to create 'aufs' backend: AufsBackend requires
root privileges, but is running as user mesos
W1022 07:46:53.109787 27847 backend.cpp:76] Failed to create 'bind' backend: BindBackend requires
root privileges
I1022 07:46:53.112665 27872 slave.cpp:208] Mesos agent started on (634)@172.17.0.2:49711
I1022 07:46:53.112694 27872 slave.cpp:209] Flags at startup: --acls="" --appc_simple_discovery_uri_prefix="http://"
--appc_store_dir="/tmp/mesos/store/appc" --authenticate_http_readonly="true" --authenticate_http_readwrite="true"
--authenticatee="crammd5" --authentication_backoff_factor="1secs" --authorizer="local" --cgroups_cpu_enable_pids_and_tids_count="false"
--cgroups_enable_cfs="false" --cgroups_hierarchy="/sys/fs/cgroup" --cgroups_limit_swap="false"
--cgroups_root="mesos" --container_disk_watch_interval="15secs" --containerizers="mesos" --credential="/tmp/Endpoint_SlaveEndpointTest_AuthorizedRequest_2_EpH35K/credential"
--default_role="*" --disk_watch_interval="1mins" --docker="docker" --docker_kill_orphans="true"
--docker_registry="https://registry-1.docker.io" --docker_remove_delay="6hrs" --docker_socket="/var/run/docker.sock"
--docker_stop_timeout="0ns" --docker_store_dir="/tmp/mesos/store/docker" --docker_volume_checkpoint_dir="/var/run/mesos/isolators/docker/volume"
--enforce_container_disk_quota="false" --executor_registration_timeout="1mins" --executor_shutdown_grace_period="5secs"
--fetcher_cache_dir="/tmp/Endpoint_SlaveEndpointTest_AuthorizedRequest_2_EpH35K/fetch" --fetcher_cache_size="2GB"
--frameworks_home="" --gc_delay="1weeks" --gc_disk_headroom="0.1" --hadoop_home="" --help="false"
--hostname_lookup="true" --http_authenticators="basic" --http_command_executor="false" --http_credentials="/tmp/Endpoint_SlaveEndpointTest_AuthorizedRequest_2_EpH35K/http_credentials"
--image_provisioner_backend="copy" --initialize_driver_logging="true" --isolation="posix/cpu,posix/mem"
--launcher="posix" --launcher_dir="/mesos/mesos-1.2.0/_build/src" --logbufsecs="0" --logging_level="INFO"
--max_completed_executors_per_framework="150" --oversubscribed_resources_interval="15secs"
--perf_duration="10secs" --perf_interval="1mins" --qos_correction_interval_min="0ns" --quiet="false"
--recover="reconnect" --recovery_timeout="15mins" --registration_backoff_factor="10ms" --resources="cpus:2;gpus:0;mem:1024;disk:1024;ports:[31000-32000]"
--revocable_cpu_low_priority="true" --runtime_dir="/tmp/Endpoint_SlaveEndpointTest_AuthorizedRequest_2_EpH35K"
--sandbox_directory="/mnt/mesos/sandbox" --strict="true" --switch_user="true" --systemd_enable_support="true"
--systemd_runtime_directory="/run/systemd/system" --version="false" --work_dir="/tmp/Endpoint_SlaveEndpointTest_AuthorizedRequest_2_DH4nkh"
I1022 07:46:53.113287 27872 credentials.hpp:86] Loading credential for authentication from
'/tmp/Endpoint_SlaveEndpointTest_AuthorizedRequest_2_EpH35K/credential'
I1022 07:46:53.113462 27872 slave.cpp:346] Agent using credential for: test-principal
I1022 07:46:53.113497 27872 credentials.hpp:37] Loading credentials for authentication from
'/tmp/Endpoint_SlaveEndpointTest_AuthorizedRequest_2_EpH35K/http_credentials'
I1022 07:46:53.113777 27872 http.cpp:887] Using default 'basic' HTTP authenticator for realm
'mesos-agent-readonly'
I1022 07:46:53.113948 27872 http.cpp:887] Using default 'basic' HTTP authenticator for realm
'mesos-agent-readwrite'
I1022 07:46:53.115214 27872 slave.cpp:533] Agent resources: cpus(*):2; mem(*):1024; disk(*):1024;
ports(*):[31000-32000]
I1022 07:46:53.115289 27872 slave.cpp:541] Agent attributes: [  ]
I1022 07:46:53.115301 27872 slave.cpp:546] Agent hostname: e27adbc2a48d
I1022 07:46:53.116768 27865 state.cpp:57] Recovering state from '/tmp/Endpoint_SlaveEndpointTest_AuthorizedRequest_2_DH4nkh/meta'
I1022 07:46:53.117024 27879 status_update_manager.cpp:203] Recovering status update manager
I1022 07:46:53.117261 27878 containerizer.cpp:557] Recovering containerizer
I1022 07:46:53.118340 27872 provisioner.cpp:253] Provisioner recovery complete
I1022 07:46:53.118818 27875 slave.cpp:5399] Finished recovery
I1022 07:46:53.119194 27875 slave.cpp:5573] Querying resource estimator for oversubscribable
resources
I1022 07:46:53.119484 27874 slave.cpp:5587] Received oversubscribable resources {} from the
resource estimator
I1022 07:46:53.120950 27880 process.cpp:3377] Handling HTTP event for process 'slave(634)'
with path: '/slave(634)/containers'
I1022 07:46:53.121955 27878 http.cpp:839] Authorizing principal 'test-principal' to GET the
'/containers' endpoint
I1022 07:46:53.125572 27876 slave.cpp:787] Agent terminating
[       OK ] Endpoint/SlaveEndpointTest.AuthorizedRequest/2 (25 ms)
[ RUN      ] Endpoint/SlaveEndpointTest.UnauthorizedRequest/0
I1022 07:46:53.135557 27847 containerizer.cpp:201] Using isolation: posix/cpu,posix/mem,filesystem/posix,network/cni
W1022 07:46:53.136288 27847 backend.cpp:76] Failed to create 'aufs' backend: AufsBackend requires
root privileges, but is running as user mesos
W1022 07:46:53.136463 27847 backend.cpp:76] Failed to create 'bind' backend: BindBackend requires
root privileges
I1022 07:46:53.139652 27875 slave.cpp:208] Mesos agent started on (635)@172.17.0.2:49711
I1022 07:46:53.139711 27875 slave.cpp:209] Flags at startup: --acls="" --appc_simple_discovery_uri_prefix="http://"
--appc_store_dir="/tmp/mesos/store/appc" --authenticate_http_readonly="true" --authenticate_http_readwrite="true"
--authenticatee="crammd5" --authentication_backoff_factor="1secs" --authorizer="local" --cgroups_cpu_enable_pids_and_tids_count="false"
--cgroups_enable_cfs="false" --cgroups_hierarchy="/sys/fs/cgroup" --cgroups_limit_swap="false"
--cgroups_root="mesos" --container_disk_watch_interval="15secs" --containerizers="mesos" --credential="/tmp/Endpoint_SlaveEndpointTest_UnauthorizedRequest_0_1hnVoG/credential"
--default_role="*" --disk_watch_interval="1mins" --docker="docker" --docker_kill_orphans="true"
--docker_registry="https://registry-1.docker.io" --docker_remove_delay="6hrs" --docker_socket="/var/run/docker.sock"
--docker_stop_timeout="0ns" --docker_store_dir="/tmp/mesos/store/docker" --docker_volume_checkpoint_dir="/var/run/mesos/isolators/docker/volume"
--enforce_container_disk_quota="false" --executor_registration_timeout="1mins" --executor_shutdown_grace_period="5secs"
--fetcher_cache_dir="/tmp/Endpoint_SlaveEndpointTest_UnauthorizedRequest_0_1hnVoG/fetch" --fetcher_cache_size="2GB"
--frameworks_home="" --gc_delay="1weeks" --gc_disk_headroom="0.1" --hadoop_home="" --help="false"
--hostname_lookup="true" --http_authenticators="basic" --http_command_executor="false" --http_credentials="/tmp/Endpoint_SlaveEndpointTest_UnauthorizedRequest_0_1hnVoG/http_credentials"
--image_provisioner_backend="copy" --initialize_driver_logging="true" --isolation="posix/cpu,posix/mem"
--launcher="posix" --launcher_dir="/mesos/mesos-1.2.0/_build/src" --logbufsecs="0" --logging_level="INFO"
--max_completed_executors_per_framework="150" --oversubscribed_resources_interval="15secs"
--perf_duration="10secs" --perf_interval="1mins" --qos_correction_interval_min="0ns" --quiet="false"
--recover="reconnect" --recovery_timeout="15mins" --registration_backoff_factor="10ms" --resources="cpus:2;gpus:0;mem:1024;disk:1024;ports:[31000-32000]"
--revocable_cpu_low_priority="true" --runtime_dir="/tmp/Endpoint_SlaveEndpointTest_UnauthorizedRequest_0_1hnVoG"
--sandbox_directory="/mnt/mesos/sandbox" --strict="true" --switch_user="true" --systemd_enable_support="true"
--systemd_runtime_directory="/run/systemd/system" --version="false" --work_dir="/tmp/Endpoint_SlaveEndpointTest_UnauthorizedRequest_0_Q083yc"
I1022 07:46:53.140278 27875 credentials.hpp:86] Loading credential for authentication from
'/tmp/Endpoint_SlaveEndpointTest_UnauthorizedRequest_0_1hnVoG/credential'
I1022 07:46:53.140491 27875 slave.cpp:346] Agent using credential for: test-principal
I1022 07:46:53.140519 27875 credentials.hpp:37] Loading credentials for authentication from
'/tmp/Endpoint_SlaveEndpointTest_UnauthorizedRequest_0_1hnVoG/http_credentials'
I1022 07:46:53.140797 27875 http.cpp:887] Using default 'basic' HTTP authenticator for realm
'mesos-agent-readonly'
I1022 07:46:53.140940 27875 http.cpp:887] Using default 'basic' HTTP authenticator for realm
'mesos-agent-readwrite'
I1022 07:46:53.142091 27875 slave.cpp:533] Agent resources: cpus(*):2; mem(*):1024; disk(*):1024;
ports(*):[31000-32000]
I1022 07:46:53.142180 27875 slave.cpp:541] Agent attributes: [  ]
I1022 07:46:53.142202 27875 slave.cpp:546] Agent hostname: e27adbc2a48d
I1022 07:46:53.143797 27867 state.cpp:57] Recovering state from '/tmp/Endpoint_SlaveEndpointTest_UnauthorizedRequest_0_Q083yc/meta'
I1022 07:46:53.144075 27880 status_update_manager.cpp:203] Recovering status update manager
I1022 07:46:53.144310 27865 containerizer.cpp:557] Recovering containerizer
I1022 07:46:53.145423 27870 provisioner.cpp:253] Provisioner recovery complete
I1022 07:46:53.145732 27879 slave.cpp:5399] Finished recovery
I1022 07:46:53.146141 27879 slave.cpp:5573] Querying resource estimator for oversubscribable
resources
I1022 07:46:53.146421 27869 slave.cpp:5587] Received oversubscribable resources {} from the
resource estimator
I1022 07:46:53.147873 27878 process.cpp:3377] Handling HTTP event for process 'slave(635)'
with path: '/slave(635)/monitor/statistics'
I1022 07:46:53.148819 27872 http.cpp:839] Authorizing principal 'test-principal' to GET the
'/monitor/statistics' endpoint
I1022 07:46:53.150813 27879 slave.cpp:787] Agent terminating
[       OK ] Endpoint/SlaveEndpointTest.UnauthorizedRequest/0 (25 ms)
[ RUN      ] Endpoint/SlaveEndpointTest.UnauthorizedRequest/1
I1022 07:46:53.160792 27847 containerizer.cpp:201] Using isolation: posix/cpu,posix/mem,filesystem/posix,network/cni
W1022 07:46:53.161463 27847 backend.cpp:76] Failed to create 'aufs' backend: AufsBackend requires
root privileges, but is running as user mesos
W1022 07:46:53.161625 27847 backend.cpp:76] Failed to create 'bind' backend: BindBackend requires
root privileges
I1022 07:46:53.165612 27871 slave.cpp:208] Mesos agent started on (636)@172.17.0.2:49711
I1022 07:46:53.165647 27871 slave.cpp:209] Flags at startup: --acls="" --appc_simple_discovery_uri_prefix="http://"
--appc_store_dir="/tmp/mesos/store/appc" --authenticate_http_readonly="true" --authenticate_http_readwrite="true"
--authenticatee="crammd5" --authentication_backoff_factor="1secs" --authorizer="local" --cgroups_cpu_enable_pids_and_tids_count="false"
--cgroups_enable_cfs="false" --cgroups_hierarchy="/sys/fs/cgroup" --cgroups_limit_swap="false"
--cgroups_root="mesos" --container_disk_watch_interval="15secs" --containerizers="mesos" --credential="/tmp/Endpoint_SlaveEndpointTest_UnauthorizedRequest_1_Bh3qYB/credential"
--default_role="*" --disk_watch_interval="1mins" --docker="docker" --docker_kill_orphans="true"
--docker_registry="https://registry-1.docker.io" --docker_remove_delay="6hrs" --docker_socket="/var/run/docker.sock"
--docker_stop_timeout="0ns" --docker_store_dir="/tmp/mesos/store/docker" --docker_volume_checkpoint_dir="/var/run/mesos/isolators/docker/volume"
--enforce_container_disk_quota="false" --executor_registration_timeout="1mins" --executor_shutdown_grace_period="5secs"
--fetcher_cache_dir="/tmp/Endpoint_SlaveEndpointTest_UnauthorizedRequest_1_Bh3qYB/fetch" --fetcher_cache_size="2GB"
--frameworks_home="" --gc_delay="1weeks" --gc_disk_headroom="0.1" --hadoop_home="" --help="false"
--hostname_lookup="true" --http_authenticators="basic" --http_command_executor="false" --http_credentials="/tmp/Endpoint_SlaveEndpointTest_UnauthorizedRequest_1_Bh3qYB/http_credentials"
--image_provisioner_backend="copy" --initialize_driver_logging="true" --isolation="posix/cpu,posix/mem"
--launcher="posix" --launcher_dir="/mesos/mesos-1.2.0/_build/src" --logbufsecs="0" --logging_level="INFO"
--max_completed_executors_per_framework="150" --oversubscribed_resources_interval="15secs"
--perf_duration="10secs" --perf_interval="1mins" --qos_correction_interval_min="0ns" --quiet="false"
--recover="reconnect" --recovery_timeout="15mins" --registration_backoff_factor="10ms" --resources="cpus:2;gpus:0;mem:1024;disk:1024;ports:[31000-32000]"
--revocable_cpu_low_priority="true" --runtime_dir="/tmp/Endpoint_SlaveEndpointTest_UnauthorizedRequest_1_Bh3qYB"
--sandbox_directory="/mnt/mesos/sandbox" --strict="true" --switch_user="true" --systemd_enable_support="true"
--systemd_runtime_directory="/run/systemd/system" --version="false" --work_dir="/tmp/Endpoint_SlaveEndpointTest_UnauthorizedRequest_1_MXBt47"
I1022 07:46:53.166157 27871 credentials.hpp:86] Loading credential for authentication from
'/tmp/Endpoint_SlaveEndpointTest_UnauthorizedRequest_1_Bh3qYB/credential'
I1022 07:46:53.166303 27871 slave.cpp:346] Agent using credential for: test-principal
I1022 07:46:53.166326 27871 credentials.hpp:37] Loading credentials for authentication from
'/tmp/Endpoint_SlaveEndpointTest_UnauthorizedRequest_1_Bh3qYB/http_credentials'
I1022 07:46:53.166579 27871 http.cpp:887] Using default 'basic' HTTP authenticator for realm
'mesos-agent-readonly'
I1022 07:46:53.166692 27871 http.cpp:887] Using default 'basic' HTTP authenticator for realm
'mesos-agent-readwrite'
I1022 07:46:53.167640 27871 slave.cpp:533] Agent resources: cpus(*):2; mem(*):1024; disk(*):1024;
ports(*):[31000-32000]
I1022 07:46:53.167712 27871 slave.cpp:541] Agent attributes: [  ]
I1022 07:46:53.167723 27871 slave.cpp:546] Agent hostname: e27adbc2a48d
I1022 07:46:53.168972 27876 state.cpp:57] Recovering state from '/tmp/Endpoint_SlaveEndpointTest_UnauthorizedRequest_1_MXBt47/meta'
I1022 07:46:53.169307 27877 status_update_manager.cpp:203] Recovering status update manager
I1022 07:46:53.169577 27871 containerizer.cpp:557] Recovering containerizer
I1022 07:46:53.170848 27880 provisioner.cpp:253] Provisioner recovery complete
I1022 07:46:53.171269 27870 slave.cpp:5399] Finished recovery
I1022 07:46:53.172080 27870 slave.cpp:5573] Querying resource estimator for oversubscribable
resources
I1022 07:46:53.172386 27868 slave.cpp:5587] Received oversubscribable resources {} from the
resource estimator
I1022 07:46:53.173761 27870 process.cpp:3377] Handling HTTP event for process 'slave(636)'
with path: '/slave(636)/monitor/statistics.json'
I1022 07:46:53.174696 27877 http.cpp:839] Authorizing principal 'test-principal' to GET the
'/monitor/statistics.json' endpoint
I1022 07:46:53.176908 27877 slave.cpp:787] Agent terminating
[       OK ] Endpoint/SlaveEndpointTest.UnauthorizedRequest/1 (26 ms)
[ RUN      ] Endpoint/SlaveEndpointTest.UnauthorizedRequest/2
I1022 07:46:53.186262 27847 containerizer.cpp:201] Using isolation: posix/cpu,posix/mem,filesystem/posix,network/cni
W1022 07:46:53.186803 27847 backend.cpp:76] Failed to create 'aufs' backend: AufsBackend requires
root privileges, but is running as user mesos
W1022 07:46:53.186931 27847 backend.cpp:76] Failed to create 'bind' backend: BindBackend requires
root privileges
I1022 07:46:53.189702 27865 slave.cpp:208] Mesos agent started on (637)@172.17.0.2:49711
I1022 07:46:53.189750 27865 slave.cpp:209] Flags at startup: --acls="" --appc_simple_discovery_uri_prefix="http://"
--appc_store_dir="/tmp/mesos/store/appc" --authenticate_http_readonly="true" --authenticate_http_readwrite="true"
--authenticatee="crammd5" --authentication_backoff_factor="1secs" --authorizer="local" --cgroups_cpu_enable_pids_and_tids_count="false"
--cgroups_enable_cfs="false" --cgroups_hierarchy="/sys/fs/cgroup" --cgroups_limit_swap="false"
--cgroups_root="mesos" --container_disk_watch_interval="15secs" --containerizers="mesos" --credential="/tmp/Endpoint_SlaveEndpointTest_UnauthorizedRequest_2_JJNSOx/credential"
--default_role="*" --disk_watch_interval="1mins" --docker="docker" --docker_kill_orphans="true"
--docker_registry="https://registry-1.docker.io" --docker_remove_delay="6hrs" --docker_socket="/var/run/docker.sock"
--docker_stop_timeout="0ns" --docker_store_dir="/tmp/mesos/store/docker" --docker_volume_checkpoint_dir="/var/run/mesos/isolators/docker/volume"
--enforce_container_disk_quota="false" --executor_registration_timeout="1mins" --executor_shutdown_grace_period="5secs"
--fetcher_cache_dir="/tmp/Endpoint_SlaveEndpointTest_UnauthorizedRequest_2_JJNSOx/fetch" --fetcher_cache_size="2GB"
--frameworks_home="" --gc_delay="1weeks" --gc_disk_headroom="0.1" --hadoop_home="" --help="false"
--hostname_lookup="true" --http_authenticators="basic" --http_command_executor="false" --http_credentials="/tmp/Endpoint_SlaveEndpointTest_UnauthorizedRequest_2_JJNSOx/http_credentials"
--image_provisioner_backend="copy" --initialize_driver_logging="true" --isolation="posix/cpu,posix/mem"
--launcher="posix" --launcher_dir="/mesos/mesos-1.2.0/_build/src" --logbufsecs="0" --logging_level="INFO"
--max_completed_executors_per_framework="150" --oversubscribed_resources_interval="15secs"
--perf_duration="10secs" --perf_interval="1mins" --qos_correction_interval_min="0ns" --quiet="false"
--recover="reconnect" --recovery_timeout="15mins" --registration_backoff_factor="10ms" --resources="cpus:2;gpus:0;mem:1024;disk:1024;ports:[31000-32000]"
--revocable_cpu_low_priority="true" --runtime_dir="/tmp/Endpoint_SlaveEndpointTest_UnauthorizedRequest_2_JJNSOx"
--sandbox_directory="/mnt/mesos/sandbox" --strict="true" --switch_user="true" --systemd_enable_support="true"
--systemd_runtime_directory="/run/systemd/system" --version="false" --work_dir="/tmp/Endpoint_SlaveEndpointTest_UnauthorizedRequest_2_GH2GQ3"
I1022 07:46:53.190827 27865 credentials.hpp:86] Loading credential for authentication from
'/tmp/Endpoint_SlaveEndpointTest_UnauthorizedRequest_2_JJNSOx/credential'
I1022 07:46:53.191042 27865 slave.cpp:346] Agent using credential for: test-principal
I1022 07:46:53.191072 27865 credentials.hpp:37] Loading credentials for authentication from
'/tmp/Endpoint_SlaveEndpointTest_UnauthorizedRequest_2_JJNSOx/http_credentials'
I1022 07:46:53.191381 27865 http.cpp:887] Using default 'basic' HTTP authenticator for realm
'mesos-agent-readonly'
I1022 07:46:53.191555 27865 http.cpp:887] Using default 'basic' HTTP authenticator for realm
'mesos-agent-readwrite'
I1022 07:46:53.192903 27865 slave.cpp:533] Agent resources: cpus(*):2; mem(*):1024; disk(*):1024;
ports(*):[31000-32000]
I1022 07:46:53.193003 27865 slave.cpp:541] Agent attributes: [  ]
I1022 07:46:53.193018 27865 slave.cpp:546] Agent hostname: e27adbc2a48d
I1022 07:46:53.194598 27879 state.cpp:57] Recovering state from '/tmp/Endpoint_SlaveEndpointTest_UnauthorizedRequest_2_GH2GQ3/meta'
I1022 07:46:53.194878 27868 status_update_manager.cpp:203] Recovering status update manager
I1022 07:46:53.195174 27880 containerizer.cpp:557] Recovering containerizer
I1022 07:46:53.196447 27879 provisioner.cpp:253] Provisioner recovery complete
I1022 07:46:53.196811 27876 slave.cpp:5399] Finished recovery
I1022 07:46:53.197252 27876 slave.cpp:5573] Querying resource estimator for oversubscribable
resources
I1022 07:46:53.197692 27870 slave.cpp:5587] Received oversubscribable resources {} from the
resource estimator
I1022 07:46:53.199314 27875 process.cpp:3377] Handling HTTP event for process 'slave(637)'
with path: '/slave(637)/containers'
I1022 07:46:53.200461 27866 http.cpp:839] Authorizing principal 'test-principal' to GET the
'/containers' endpoint
I1022 07:46:53.202841 27880 slave.cpp:787] Agent terminating
[       OK ] Endpoint/SlaveEndpointTest.UnauthorizedRequest/2 (25 ms)
[ RUN      ] Endpoint/SlaveEndpointTest.NoAuthorizer/0
I1022 07:46:53.213702 27847 containerizer.cpp:201] Using isolation: posix/cpu,posix/mem,filesystem/posix,network/cni
W1022 07:46:53.214383 27847 backend.cpp:76] Failed to create 'aufs' backend: AufsBackend requires
root privileges, but is running as user mesos
W1022 07:46:53.214632 27847 backend.cpp:76] Failed to create 'bind' backend: BindBackend requires
root privileges
I1022 07:46:53.216004 27847 cluster.cpp:435] Creating default 'local' authorizer
I1022 07:46:53.217883 27870 slave.cpp:208] Mesos agent started on (638)@172.17.0.2:49711
I1022 07:46:53.217942 27870 slave.cpp:209] Flags at startup: --acls="" --appc_simple_discovery_uri_prefix="http://"
--appc_store_dir="/tmp/mesos/store/appc" --authenticate_http_readonly="true" --authenticate_http_readwrite="true"
--authenticatee="crammd5" --authentication_backoff_factor="1secs" --authorizer="local" --cgroups_cpu_enable_pids_and_tids_count="false"
--cgroups_enable_cfs="false" --cgroups_hierarchy="/sys/fs/cgroup" --cgroups_limit_swap="false"
--cgroups_root="mesos" --container_disk_watch_interval="15secs" --containerizers="mesos" --credential="/tmp/Endpoint_SlaveEndpointTest_NoAuthorizer_0_vHzkWt/credential"
--default_role="*" --disk_watch_interval="1mins" --docker="docker" --docker_kill_orphans="true"
--docker_registry="https://registry-1.docker.io" --docker_remove_delay="6hrs" --docker_socket="/var/run/docker.sock"
--docker_stop_timeout="0ns" --docker_store_dir="/tmp/mesos/store/docker" --docker_volume_checkpoint_dir="/var/run/mesos/isolators/docker/volume"
--enforce_container_disk_quota="false" --executor_registration_timeout="1mins" --executor_shutdown_grace_period="5secs"
--fetcher_cache_dir="/tmp/Endpoint_SlaveEndpointTest_NoAuthorizer_0_vHzkWt/fetch" --fetcher_cache_size="2GB"
--frameworks_home="" --gc_delay="1weeks" --gc_disk_headroom="0.1" --hadoop_home="" --help="false"
--hostname_lookup="true" --http_authenticators="basic" --http_command_executor="false" --http_credentials="/tmp/Endpoint_SlaveEndpointTest_NoAuthorizer_0_vHzkWt/http_credentials"
--image_provisioner_backend="copy" --initialize_driver_logging="true" --isolation="posix/cpu,posix/mem"
--launcher="posix" --launcher_dir="/mesos/mesos-1.2.0/_build/src" --logbufsecs="0" --logging_level="INFO"
--max_completed_executors_per_framework="150" --oversubscribed_resources_interval="15secs"
--perf_duration="10secs" --perf_interval="1mins" --qos_correction_interval_min="0ns" --quiet="false"
--recover="reconnect" --recovery_timeout="15mins" --registration_backoff_factor="10ms" --resources="cpus:2;gpus:0;mem:1024;disk:1024;ports:[31000-32000]"
--revocable_cpu_low_priority="true" --runtime_dir="/tmp/Endpoint_SlaveEndpointTest_NoAuthorizer_0_vHzkWt"
--sandbox_directory="/mnt/mesos/sandbox" --strict="true" --switch_user="true" --systemd_enable_support="true"
--systemd_runtime_directory="/run/systemd/system" --version="false" --work_dir="/tmp/Endpoint_SlaveEndpointTest_NoAuthorizer_0_OebPTZ"
I1022 07:46:53.218400 27870 credentials.hpp:86] Loading credential for authentication from
'/tmp/Endpoint_SlaveEndpointTest_NoAuthorizer_0_vHzkWt/credential'
I1022 07:46:53.218550 27870 slave.cpp:346] Agent using credential for: test-principal
I1022 07:46:53.218571 27870 credentials.hpp:37] Loading credentials for authentication from
'/tmp/Endpoint_SlaveEndpointTest_NoAuthorizer_0_vHzkWt/http_credentials'
I1022 07:46:53.218767 27870 http.cpp:887] Using default 'basic' HTTP authenticator for realm
'mesos-agent-readonly'
I1022 07:46:53.218878 27870 http.cpp:887] Using default 'basic' HTTP authenticator for realm
'mesos-agent-readwrite'
I1022 07:46:53.219862 27870 slave.cpp:533] Agent resources: cpus(*):2; mem(*):1024; disk(*):1024;
ports(*):[31000-32000]
I1022 07:46:53.219935 27870 slave.cpp:541] Agent attributes: [  ]
I1022 07:46:53.219946 27870 slave.cpp:546] Agent hostname: e27adbc2a48d
I1022 07:46:53.221637 27866 state.cpp:57] Recovering state from '/tmp/Endpoint_SlaveEndpointTest_NoAuthorizer_0_OebPTZ/meta'
I1022 07:46:53.221935 27875 status_update_manager.cpp:203] Recovering status update manager
I1022 07:46:53.222350 27875 containerizer.cpp:557] Recovering containerizer
I1022 07:46:53.223439 27872 provisioner.cpp:253] Provisioner recovery complete
I1022 07:46:53.223911 27878 slave.cpp:5399] Finished recovery
I1022 07:46:53.224349 27878 slave.cpp:5573] Querying resource estimator for oversubscribable
resources
I1022 07:46:53.224555 27866 slave.cpp:5587] Received oversubscribable resources {} from the
resource estimator
I1022 07:46:53.225883 27865 process.cpp:3377] Handling HTTP event for process 'slave(638)'
with path: '/slave(638)/monitor/statistics'
I1022 07:46:53.226794 27880 http.cpp:839] Authorizing principal 'test-principal' to GET the
'/monitor/statistics' endpoint
I1022 07:46:53.230238 27873 slave.cpp:787] Agent terminating
[       OK ] Endpoint/SlaveEndpointTest.NoAuthorizer/0 (26 ms)
[ RUN      ] Endpoint/SlaveEndpointTest.NoAuthorizer/1
I1022 07:46:53.240355 27847 containerizer.cpp:201] Using isolation: posix/cpu,posix/mem,filesystem/posix,network/cni
W1022 07:46:53.241027 27847 backend.cpp:76] Failed to create 'aufs' backend: AufsBackend requires
root privileges, but is running as user mesos
W1022 07:46:53.241303 27847 backend.cpp:76] Failed to create 'bind' backend: BindBackend requires
root privileges
I1022 07:46:53.242735 27847 cluster.cpp:435] Creating default 'local' authorizer
I1022 07:46:53.244946 27871 slave.cpp:208] Mesos agent started on (639)@172.17.0.2:49711
I1022 07:46:53.244990 27871 slave.cpp:209] Flags at startup: --acls="" --appc_simple_discovery_uri_prefix="http://"
--appc_store_dir="/tmp/mesos/store/appc" --authenticate_http_readonly="true" --authenticate_http_readwrite="true"
--authenticatee="crammd5" --authentication_backoff_factor="1secs" --authorizer="local" --cgroups_cpu_enable_pids_and_tids_count="false"
--cgroups_enable_cfs="false" --cgroups_hierarchy="/sys/fs/cgroup" --cgroups_limit_swap="false"
--cgroups_root="mesos" --container_disk_watch_interval="15secs" --containerizers="mesos" --credential="/tmp/Endpoint_SlaveEndpointTest_NoAuthorizer_1_PpFblq/credential"
--default_role="*" --disk_watch_interval="1mins" --docker="docker" --docker_kill_orphans="true"
--docker_registry="https://registry-1.docker.io" --docker_remove_delay="6hrs" --docker_socket="/var/run/docker.sock"
--docker_stop_timeout="0ns" --docker_store_dir="/tmp/mesos/store/docker" --docker_volume_checkpoint_dir="/var/run/mesos/isolators/docker/volume"
--enforce_container_disk_quota="false" --executor_registration_timeout="1mins" --executor_shutdown_grace_period="5secs"
--fetcher_cache_dir="/tmp/Endpoint_SlaveEndpointTest_NoAuthorizer_1_PpFblq/fetch" --fetcher_cache_size="2GB"
--frameworks_home="" --gc_delay="1weeks" --gc_disk_headroom="0.1" --hadoop_home="" --help="false"
--hostname_lookup="true" --http_authenticators="basic" --http_command_executor="false" --http_credentials="/tmp/Endpoint_SlaveEndpointTest_NoAuthorizer_1_PpFblq/http_credentials"
--image_provisioner_backend="copy" --initialize_driver_logging="true" --isolation="posix/cpu,posix/mem"
--launcher="posix" --launcher_dir="/mesos/mesos-1.2.0/_build/src" --logbufsecs="0" --logging_level="INFO"
--max_completed_executors_per_framework="150" --oversubscribed_resources_interval="15secs"
--perf_duration="10secs" --perf_interval="1mins" --qos_correction_interval_min="0ns" --quiet="false"
--recover="reconnect" --recovery_timeout="15mins" --registration_backoff_factor="10ms" --resources="cpus:2;gpus:0;mem:1024;disk:1024;ports:[31000-32000]"
--revocable_cpu_low_priority="true" --runtime_dir="/tmp/Endpoint_SlaveEndpointTest_NoAuthorizer_1_PpFblq"
--sandbox_directory="/mnt/mesos/sandbox" --strict="true" --switch_user="true" --systemd_enable_support="true"
--systemd_runtime_directory="/run/systemd/system" --version="false" --work_dir="/tmp/Endpoint_SlaveEndpointTest_NoAuthorizer_1_8OXleW"
I1022 07:46:53.245570 27871 credentials.hpp:86] Loading credential for authentication from
'/tmp/Endpoint_SlaveEndpointTest_NoAuthorizer_1_PpFblq/credential'
I1022 07:46:53.245802 27871 slave.cpp:346] Agent using credential for: test-principal
I1022 07:46:53.245831 27871 credentials.hpp:37] Loading credentials for authentication from
'/tmp/Endpoint_SlaveEndpointTest_NoAuthorizer_1_PpFblq/http_credentials'
I1022 07:46:53.246127 27871 http.cpp:887] Using default 'basic' HTTP authenticator for realm
'mesos-agent-readonly'
I1022 07:46:53.246265 27871 http.cpp:887] Using default 'basic' HTTP authenticator for realm
'mesos-agent-readwrite'
I1022 07:46:53.247910 27871 slave.cpp:533] Agent resources: cpus(*):2; mem(*):1024; disk(*):1024;
ports(*):[31000-32000]
I1022 07:46:53.248011 27871 slave.cpp:541] Agent attributes: [  ]
I1022 07:46:53.248026 27871 slave.cpp:546] Agent hostname: e27adbc2a48d
I1022 07:46:53.249426 27867 state.cpp:57] Recovering state from '/tmp/Endpoint_SlaveEndpointTest_NoAuthorizer_1_8OXleW/meta'
I1022 07:46:53.249781 27870 status_update_manager.cpp:203] Recovering status update manager
I1022 07:46:53.250233 27879 containerizer.cpp:557] Recovering containerizer
I1022 07:46:53.251559 27868 provisioner.cpp:253] Provisioner recovery complete
I1022 07:46:53.252005 27873 slave.cpp:5399] Finished recovery
I1022 07:46:53.252524 27873 slave.cpp:5573] Querying resource estimator for oversubscribable
resources
I1022 07:46:53.252784 27869 slave.cpp:5587] Received oversubscribable resources {} from the
resource estimator
I1022 07:46:53.254233 27865 process.cpp:3377] Handling HTTP event for process 'slave(639)'
with path: '/slave(639)/monitor/statistics.json'
I1022 07:46:53.255282 27876 http.cpp:839] Authorizing principal 'test-principal' to GET the
'/monitor/statistics.json' endpoint
I1022 07:46:53.258849 27866 slave.cpp:787] Agent terminating
[       OK ] Endpoint/SlaveEndpointTest.NoAuthorizer/1 (29 ms)
[ RUN      ] Endpoint/SlaveEndpointTest.NoAuthorizer/2
I1022 07:46:53.268712 27847 containerizer.cpp:201] Using isolation: posix/cpu,posix/mem,filesystem/posix,network/cni
W1022 07:46:53.269227 27847 backend.cpp:76] Failed to create 'aufs' backend: AufsBackend requires
root privileges, but is running as user mesos
W1022 07:46:53.269398 27847 backend.cpp:76] Failed to create 'bind' backend: BindBackend requires
root privileges
I1022 07:46:53.270519 27847 cluster.cpp:435] Creating default 'local' authorizer
I1022 07:46:53.271965 27865 slave.cpp:208] Mesos agent started on (640)@172.17.0.2:49711
I1022 07:46:53.272006 27865 slave.cpp:209] Flags at startup: --acls="" --appc_simple_discovery_uri_prefix="http://"
--appc_store_dir="/tmp/mesos/store/appc" --authenticate_http_readonly="true" --authenticate_http_readwrite="true"
--authenticatee="crammd5" --authentication_backoff_factor="1secs" --authorizer="local" --cgroups_cpu_enable_pids_and_tids_count="false"
--cgroups_enable_cfs="false" --cgroups_hierarchy="/sys/fs/cgroup" --cgroups_limit_swap="false"
--cgroups_root="mesos" --container_disk_watch_interval="15secs" --containerizers="mesos" --credential="/tmp/Endpoint_SlaveEndpointTest_NoAuthorizer_2_3OWS2m/credential"
--default_role="*" --disk_watch_interval="1mins" --docker="docker" --docker_kill_orphans="true"
--docker_registry="https://registry-1.docker.io" --docker_remove_delay="6hrs" --docker_socket="/var/run/docker.sock"
--docker_stop_timeout="0ns" --docker_store_dir="/tmp/mesos/store/docker" --docker_volume_checkpoint_dir="/var/run/mesos/isolators/docker/volume"
--enforce_container_disk_quota="false" --executor_registration_timeout="1mins" --executor_shutdown_grace_period="5secs"
--fetcher_cache_dir="/tmp/Endpoint_SlaveEndpointTest_NoAuthorizer_2_3OWS2m/fetch" --fetcher_cache_size="2GB"
--frameworks_home="" --gc_delay="1weeks" --gc_disk_headroom="0.1" --hadoop_home="" --help="false"
--hostname_lookup="true" --http_authenticators="basic" --http_command_executor="false" --http_credentials="/tmp/Endpoint_SlaveEndpointTest_NoAuthorizer_2_3OWS2m/http_credentials"
--image_provisioner_backend="copy" --initialize_driver_logging="true" --isolation="posix/cpu,posix/mem"
--launcher="posix" --launcher_dir="/mesos/mesos-1.2.0/_build/src" --logbufsecs="0" --logging_level="INFO"
--max_completed_executors_per_framework="150" --oversubscribed_resources_interval="15secs"
--perf_duration="10secs" --perf_interval="1mins" --qos_correction_interval_min="0ns" --quiet="false"
--recover="reconnect" --recovery_timeout="15mins" --registration_backoff_factor="10ms" --resources="cpus:2;gpus:0;mem:1024;disk:1024;ports:[31000-32000]"
--revocable_cpu_low_priority="true" --runtime_dir="/tmp/Endpoint_SlaveEndpointTest_NoAuthorizer_2_3OWS2m"
--sandbox_directory="/mnt/mesos/sandbox" --strict="true" --switch_user="true" --systemd_enable_support="true"
--systemd_runtime_directory="/run/systemd/system" --version="false" --work_dir="/tmp/Endpoint_SlaveEndpointTest_NoAuthorizer_2_sIdjRS"
I1022 07:46:53.272598 27865 credentials.hpp:86] Loading credential for authentication from
'/tmp/Endpoint_SlaveEndpointTest_NoAuthorizer_2_3OWS2m/credential'
I1022 07:46:53.272760 27865 slave.cpp:346] Agent using credential for: test-principal
I1022 07:46:53.272786 27865 credentials.hpp:37] Loading credentials for authentication from
'/tmp/Endpoint_SlaveEndpointTest_NoAuthorizer_2_3OWS2m/http_credentials'
I1022 07:46:53.273032 27865 http.cpp:887] Using default 'basic' HTTP authenticator for realm
'mesos-agent-readonly'
I1022 07:46:53.273186 27865 http.cpp:887] Using default 'basic' HTTP authenticator for realm
'mesos-agent-readwrite'
I1022 07:46:53.274621 27865 slave.cpp:533] Agent resources: cpus(*):2; mem(*):1024; disk(*):1024;
ports(*):[31000-32000]
I1022 07:46:53.274718 27865 slave.cpp:541] Agent attributes: [  ]
I1022 07:46:53.274735 27865 slave.cpp:546] Agent hostname: e27adbc2a48d
I1022 07:46:53.276103 27877 state.cpp:57] Recovering state from '/tmp/Endpoint_SlaveEndpointTest_NoAuthorizer_2_sIdjRS/meta'
I1022 07:46:53.276353 27868 status_update_manager.cpp:203] Recovering status update manager
I1022 07:46:53.276705 27874 containerizer.cpp:557] Recovering containerizer
I1022 07:46:53.278138 27870 provisioner.cpp:253] Provisioner recovery complete
I1022 07:46:53.278664 27879 slave.cpp:5399] Finished recovery
I1022 07:46:53.279192 27879 slave.cpp:5573] Querying resource estimator for oversubscribable
resources
I1022 07:46:53.279434 27870 slave.cpp:5587] Received oversubscribable resources {} from the
resource estimator
I1022 07:46:53.282845 27866 process.cpp:3377] Handling HTTP event for process 'slave(640)'
with path: '/slave(640)/containers'
I1022 07:46:53.283893 27871 http.cpp:839] Authorizing principal 'test-principal' to GET the
'/containers' endpoint
I1022 07:46:53.287567 27879 slave.cpp:787] Agent terminating
[       OK ] Endpoint/SlaveEndpointTest.NoAuthorizer/2 (28 ms)
[----------] 9 tests from Endpoint/SlaveEndpointTest (241 ms total)

[----------] Global test environment tear-down
[==========] 1367 tests from 155 test cases ran. (386774 ms total)
[  PASSED  ] 1366 tests.
[  FAILED  ] 1 test, listed below:
[  FAILED  ] MasterTest.UnreachableTaskAfterFailover

 1 FAILED TEST
  YOU HAVE 5 DISABLED TESTS

make[4]: *** [check-local] Error 1
make[4]: Leaving directory `/mesos/mesos-1.2.0/_build/src'
make[3]: *** [check-am] Error 2
make[3]: Leaving directory `/mesos/mesos-1.2.0/_build/src'
make[2]: *** [check] Error 2
make[2]: Leaving directory `/mesos/mesos-1.2.0/_build/src'
make[1]: *** [check-recursive] Error 1
make[1]: Leaving directory `/mesos/mesos-1.2.0/_build'
make: *** [distcheck] Error 1
+ docker rmi mesos-1477120277-21480
Untagged: mesos-1477120277-21480:latest
Deleted: sha256:29c0e689a4accdd8298f51c9810cf1614fbfccab047c05137fa8acee9caaaa17
Deleted: sha256:2b69a0474bf2b29977c6b22e85770ae94129ed90d72bd448ae28a2b0ad422d08
Deleted: sha256:df15be2669c991f5c3f53e90ead741b93c272cc085cdd8ccc437132f63fc2eae
Deleted: sha256:165f4d38b58358a1def8080bf35c844657dd4861fe47a772a8c88e8000d9f8ba
Deleted: sha256:7e7ef954b8e4674b3528855d253ce519ca226e002fbb97e997f79d31bcf3aed3
Deleted: sha256:1595d74e5727984c992d572784fcb6ff60dfc0b9130c3fcd4b06b5b7361139ee
Deleted: sha256:4dad5237c458a6cb5a6c21d63bbaebf6aee21428aaadef0989d2b282f08e0e93
Deleted: sha256:29d596932a7993fcb269339ebfd94659283fd848c2c35c13456ca37c52b308e5
Deleted: sha256:96ee394b24c8375afd9395ffb8d06e02a34973e72a770d3a8de29df76bdc162c
Deleted: sha256:7366e35fd000a03845e18ad3d1314a9949f6732020f8d259bc33a574b6feb841
Deleted: sha256:811a6f69b59a24e8e3105fa75c3e9283a093bd95fd608c6baf5b6b0c8f46bc7c
Deleted: sha256:3f88c7ca57db3a5e2f2a9cffb119df453bf637740cd9d8d79ef689301d583a1d
Deleted: sha256:12e5d44032bf3c71e6ab5a25f4c081e9f1fe7c17df20868aea92ae9c456b9071
Deleted: sha256:aea296e7a211751f82b2045c502cb2645a81e5f108b716fedab6e37c48f5ce01
Deleted: sha256:e292253a745378948d0f27e4b35f7ee5bcc1f36a46c6b0fc12a3af481aa3ea6a
Deleted: sha256:8be7aa4dc964521481ad1f632de10cc34d097f572f848549a830f23a17265133
Deleted: sha256:1d202005186e544ac84a22ee4128f2030eca481aade52d1ce0ec31a933082160
Deleted: sha256:65ccec948ab46589e4326fe19fb1dfa3ae8d9713a0da66e17be8fdabde1ab56e
Deleted: sha256:60fe9f56a4247a1e8ebce04cfc4d32f4b14f5573a2b0638574b49b8ff64c9cf0
Deleted: sha256:c50d8d59200fa9b3bc73aca7497c68073f4a1cff52ea099243379a17190f0d31
Deleted: sha256:3dfca025a2f11ac504c1695268879a95c2cd5437271d710fd522d1222748dd61
Deleted: sha256:a95be70343623b052ed6c92fc6d831f995dc5808d44ffd0772285b8f6202e863
Deleted: sha256:4c981fc6a5b8a6071662947489dc2a9c7017977dfaf2d33ffc4b0e37d0b4a1fc
Deleted: sha256:4737fba85b07ce7a220029786b9b12fe1d92264fbd64599db5c77fab45d4deef
Build step 'Execute shell' marked build as failure

Mime
View raw message