mesos-builds mailing list archives

Site index · List index
Message view « Date » · « Thread »
Top « Date » · « Thread »
From Apache Jenkins Server <jenk...@builds.apache.org>
Subject Build failed in Jenkins: Mesos » autotools,gcc,--verbose,GLOG_v=1 MESOS_VERBOSE=1,centos:7,(docker||Hadoop)&&(!ubuntu-us1)&&(!ubuntu-6) #2850
Date Sat, 29 Oct 2016 03:28:03 GMT
See <https://builds.apache.org/job/Mesos/BUILDTOOL=autotools,COMPILER=gcc,CONFIGURATION=--verbose,ENVIRONMENT=GLOG_v=1%20MESOS_VERBOSE=1,OS=centos%3A7,label_exp=(docker%7C%7CHadoop)&&(!ubuntu-us1)&&(!ubuntu-6)/2850/changes>

Changes:

[anand] Updated UUID::fromString to not throw an exception on error.

[anand] Updated scheduler library to handle UUID parsing error.

------------------------------------------
[...truncated 196949 lines...]
W1029 03:25:43.291877 29163 backend.cpp:75] Failed to create 'bind' backend: BindBackend requires
root privileges
I1029 03:25:43.296787 29194 slave.cpp:198] Agent started on 552)@172.17.0.3:60243
I1029 03:25:43.296813 29194 slave.cpp:199] Flags at startup: --acls="" --appc_simple_discovery_uri_prefix="http://"
--appc_store_dir="/tmp/mesos/store/appc" --authenticate_http_readonly="true" --authenticate_http_readwrite="true"
--authenticatee="crammd5" --authentication_backoff_factor="1secs" --authorizer="local" --cgroups_cpu_enable_pids_and_tids_count="false"
--cgroups_enable_cfs="false" --cgroups_hierarchy="/sys/fs/cgroup" --cgroups_limit_swap="false"
--cgroups_root="mesos" --container_disk_watch_interval="15secs" --containerizers="mesos" --credential="/tmp/Endpoint_SlaveEndpointTest_AuthorizedRequest_2_MyrCoc/credential"
--default_role="*" --disk_watch_interval="1mins" --docker="docker" --docker_kill_orphans="true"
--docker_registry="https://registry-1.docker.io" --docker_remove_delay="6hrs" --docker_socket="/var/run/docker.sock"
--docker_stop_timeout="0ns" --docker_store_dir="/tmp/mesos/store/docker" --docker_volume_checkpoint_dir="/var/run/mesos/isolators/docker/volume"
--enforce_container_disk_quota="false" --executor_registration_timeout="1mins" --executor_shutdown_grace_period="5secs"
--fetcher_cache_dir="/tmp/Endpoint_SlaveEndpointTest_AuthorizedRequest_2_MyrCoc/fetch" --fetcher_cache_size="2GB"
--frameworks_home="" --gc_delay="1weeks" --gc_disk_headroom="0.1" --hadoop_home="" --help="true"
--hostname_lookup="true" --http_authenticators="basic" --http_command_executor="false" --http_credentials="/tmp/Endpoint_SlaveEndpointTest_AuthorizedRequest_2_MyrCoc/http_credentials"
--image_provisioner_backend="copy" --initialize_driver_logging="true" --isolation="posix/cpu,posix/mem"
--launcher_dir="/mesos/mesos-1.0.2/_build/src" --logbufsecs="0" --logging_level="INFO" --oversubscribed_resources_interval="15secs"
--perf_duration="10secs" --perf_interval="1mins" --qos_correction_interval_min="0ns" --quiet="false"
--recover="reconnect" --recovery_timeout="15mins" --registration_backoff_factor="10ms" --resources="cpus:2;gpus:0;mem:1024;disk:1024;ports:[31000-32000]"
--revocable_cpu_low_priority="true" --sandbox_directory="/mnt/mesos/sandbox" --strict="true"
--switch_user="true" --systemd_enable_support="true" --systemd_runtime_directory="/run/systemd/system"
--version="false" --work_dir="/tmp/Endpoint_SlaveEndpointTest_AuthorizedRequest_2_MyrCoc"
I1029 03:25:43.297406 29194 credentials.hpp:86] Loading credential for authentication from
'/tmp/Endpoint_SlaveEndpointTest_AuthorizedRequest_2_MyrCoc/credential'
I1029 03:25:43.297569 29194 slave.cpp:336] Agent using credential for: test-principal
I1029 03:25:43.297600 29194 credentials.hpp:37] Loading credentials for authentication from
'/tmp/Endpoint_SlaveEndpointTest_AuthorizedRequest_2_MyrCoc/http_credentials'
I1029 03:25:43.297878 29194 http.cpp:883] Using default 'basic' HTTP authenticator for realm
'mesos-agent-readonly'
I1029 03:25:43.298300 29194 http.cpp:883] Using default 'basic' HTTP authenticator for realm
'mesos-agent-readwrite'
I1029 03:25:43.298717 29194 resources.cpp:572] Parsing resources as JSON failed: cpus:2;gpus:0;mem:1024;disk:1024;ports:[31000-32000]
Trying semicolon-delimited string format instead
I1029 03:25:43.299060 29194 resources.cpp:572] Parsing resources as JSON failed: cpus:2;gpus:0;mem:1024;disk:1024;ports:[31000-32000]
Trying semicolon-delimited string format instead
I1029 03:25:43.299530 29194 slave.cpp:519] Agent resources: cpus(*):2; mem(*):1024; disk(*):1024;
ports(*):[31000-32000]
I1029 03:25:43.299603 29194 slave.cpp:527] Agent attributes: [  ]
I1029 03:25:43.299619 29194 slave.cpp:532] Agent hostname: 1edd70b94af1
I1029 03:25:43.301205 29196 state.cpp:57] Recovering state from '/tmp/Endpoint_SlaveEndpointTest_AuthorizedRequest_2_MyrCoc/meta'
I1029 03:25:43.301278 29194 process.cpp:3364] Handling HTTP event for process 'slave(552)'
with path: '/slave(552)/containers'
I1029 03:25:43.301854 29189 status_update_manager.cpp:200] Recovering status update manager
I1029 03:25:43.302076 29182 containerizer.cpp:522] Recovering containerizer
I1029 03:25:43.302500 29191 http.cpp:835] Authorizing principal 'test-principal' to GET the
'/containers' endpoint
I1029 03:25:43.303612 29189 provisioner.cpp:253] Provisioner recovery complete
I1029 03:25:43.303881 29185 slave.cpp:4810] Finished recovery
I1029 03:25:43.305048 29185 slave.cpp:4982] Querying resource estimator for oversubscribable
resources
I1029 03:25:43.305639 29182 slave.cpp:4996] Received oversubscribable resources  from the
resource estimator
I1029 03:25:43.306339 29184 slave.cpp:767] Agent terminating
[       OK ] Endpoint/SlaveEndpointTest.AuthorizedRequest/2 (25 ms)
[ RUN      ] Endpoint/SlaveEndpointTest.UnauthorizedRequest/0
I1029 03:25:43.317203 29163 containerizer.cpp:196] Using isolation: posix/cpu,posix/mem,filesystem/posix,network/cni
W1029 03:25:43.318140 29163 backend.cpp:75] Failed to create 'aufs' backend: AufsBackend requires
root privileges, but is running as user mesos
W1029 03:25:43.318320 29163 backend.cpp:75] Failed to create 'bind' backend: BindBackend requires
root privileges
I1029 03:25:43.321990 29197 slave.cpp:198] Agent started on 553)@172.17.0.3:60243
I1029 03:25:43.322026 29197 slave.cpp:199] Flags at startup: --acls="" --appc_simple_discovery_uri_prefix="http://"
--appc_store_dir="/tmp/mesos/store/appc" --authenticate_http_readonly="true" --authenticate_http_readwrite="true"
--authenticatee="crammd5" --authentication_backoff_factor="1secs" --authorizer="local" --cgroups_cpu_enable_pids_and_tids_count="false"
--cgroups_enable_cfs="false" --cgroups_hierarchy="/sys/fs/cgroup" --cgroups_limit_swap="false"
--cgroups_root="mesos" --container_disk_watch_interval="15secs" --containerizers="mesos" --credential="/tmp/Endpoint_SlaveEndpointTest_UnauthorizedRequest_0_tRKYYL/credential"
--default_role="*" --disk_watch_interval="1mins" --docker="docker" --docker_kill_orphans="true"
--docker_registry="https://registry-1.docker.io" --docker_remove_delay="6hrs" --docker_socket="/var/run/docker.sock"
--docker_stop_timeout="0ns" --docker_store_dir="/tmp/mesos/store/docker" --docker_volume_checkpoint_dir="/var/run/mesos/isolators/docker/volume"
--enforce_container_disk_quota="false" --executor_registration_timeout="1mins" --executor_shutdown_grace_period="5secs"
--fetcher_cache_dir="/tmp/Endpoint_SlaveEndpointTest_UnauthorizedRequest_0_tRKYYL/fetch" --fetcher_cache_size="2GB"
--frameworks_home="" --gc_delay="1weeks" --gc_disk_headroom="0.1" --hadoop_home="" --help="true"
--hostname_lookup="true" --http_authenticators="basic" --http_command_executor="false" --http_credentials="/tmp/Endpoint_SlaveEndpointTest_UnauthorizedRequest_0_tRKYYL/http_credentials"
--image_provisioner_backend="copy" --initialize_driver_logging="true" --isolation="posix/cpu,posix/mem"
--launcher_dir="/mesos/mesos-1.0.2/_build/src" --logbufsecs="0" --logging_level="INFO" --oversubscribed_resources_interval="15secs"
--perf_duration="10secs" --perf_interval="1mins" --qos_correction_interval_min="0ns" --quiet="false"
--recover="reconnect" --recovery_timeout="15mins" --registration_backoff_factor="10ms" --resources="cpus:2;gpus:0;mem:1024;disk:1024;ports:[31000-32000]"
--revocable_cpu_low_priority="true" --sandbox_directory="/mnt/mesos/sandbox" --strict="true"
--switch_user="true" --systemd_enable_support="true" --systemd_runtime_directory="/run/systemd/system"
--version="false" --work_dir="/tmp/Endpoint_SlaveEndpointTest_UnauthorizedRequest_0_tRKYYL"
I1029 03:25:43.322815 29197 credentials.hpp:86] Loading credential for authentication from
'/tmp/Endpoint_SlaveEndpointTest_UnauthorizedRequest_0_tRKYYL/credential'
I1029 03:25:43.323051 29197 slave.cpp:336] Agent using credential for: test-principal
I1029 03:25:43.323086 29197 credentials.hpp:37] Loading credentials for authentication from
'/tmp/Endpoint_SlaveEndpointTest_UnauthorizedRequest_0_tRKYYL/http_credentials'
I1029 03:25:43.323483 29197 http.cpp:883] Using default 'basic' HTTP authenticator for realm
'mesos-agent-readonly'
I1029 03:25:43.323730 29197 http.cpp:883] Using default 'basic' HTTP authenticator for realm
'mesos-agent-readwrite'
I1029 03:25:43.324175 29197 resources.cpp:572] Parsing resources as JSON failed: cpus:2;gpus:0;mem:1024;disk:1024;ports:[31000-32000]
Trying semicolon-delimited string format instead
I1029 03:25:43.324532 29197 resources.cpp:572] Parsing resources as JSON failed: cpus:2;gpus:0;mem:1024;disk:1024;ports:[31000-32000]
Trying semicolon-delimited string format instead
I1029 03:25:43.325000 29197 slave.cpp:519] Agent resources: cpus(*):2; mem(*):1024; disk(*):1024;
ports(*):[31000-32000]
I1029 03:25:43.325075 29197 slave.cpp:527] Agent attributes: [  ]
I1029 03:25:43.325093 29197 slave.cpp:532] Agent hostname: 1edd70b94af1
I1029 03:25:43.326802 29186 state.cpp:57] Recovering state from '/tmp/Endpoint_SlaveEndpointTest_UnauthorizedRequest_0_tRKYYL/meta'
I1029 03:25:43.326864 29197 process.cpp:3364] Handling HTTP event for process 'slave(553)'
with path: '/slave(553)/monitor/statistics'
I1029 03:25:43.327419 29188 status_update_manager.cpp:200] Recovering status update manager
I1029 03:25:43.327669 29192 containerizer.cpp:522] Recovering containerizer
I1029 03:25:43.328068 29185 http.cpp:835] Authorizing principal 'test-principal' to GET the
'/monitor/statistics' endpoint
I1029 03:25:43.329316 29196 provisioner.cpp:253] Provisioner recovery complete
I1029 03:25:43.329577 29183 slave.cpp:4810] Finished recovery
I1029 03:25:43.330353 29183 slave.cpp:4982] Querying resource estimator for oversubscribable
resources
I1029 03:25:43.330613 29183 slave.cpp:767] Agent terminating
[       OK ] Endpoint/SlaveEndpointTest.UnauthorizedRequest/0 (22 ms)
[ RUN      ] Endpoint/SlaveEndpointTest.UnauthorizedRequest/1
I1029 03:25:43.339812 29163 containerizer.cpp:196] Using isolation: posix/cpu,posix/mem,filesystem/posix,network/cni
W1029 03:25:43.340674 29163 backend.cpp:75] Failed to create 'aufs' backend: AufsBackend requires
root privileges, but is running as user mesos
W1029 03:25:43.340840 29163 backend.cpp:75] Failed to create 'bind' backend: BindBackend requires
root privileges
I1029 03:25:43.344497 29183 slave.cpp:198] Agent started on 554)@172.17.0.3:60243
I1029 03:25:43.344528 29183 slave.cpp:199] Flags at startup: --acls="" --appc_simple_discovery_uri_prefix="http://"
--appc_store_dir="/tmp/mesos/store/appc" --authenticate_http_readonly="true" --authenticate_http_readwrite="true"
--authenticatee="crammd5" --authentication_backoff_factor="1secs" --authorizer="local" --cgroups_cpu_enable_pids_and_tids_count="false"
--cgroups_enable_cfs="false" --cgroups_hierarchy="/sys/fs/cgroup" --cgroups_limit_swap="false"
--cgroups_root="mesos" --container_disk_watch_interval="15secs" --containerizers="mesos" --credential="/tmp/Endpoint_SlaveEndpointTest_UnauthorizedRequest_1_8HGVKl/credential"
--default_role="*" --disk_watch_interval="1mins" --docker="docker" --docker_kill_orphans="true"
--docker_registry="https://registry-1.docker.io" --docker_remove_delay="6hrs" --docker_socket="/var/run/docker.sock"
--docker_stop_timeout="0ns" --docker_store_dir="/tmp/mesos/store/docker" --docker_volume_checkpoint_dir="/var/run/mesos/isolators/docker/volume"
--enforce_container_disk_quota="false" --executor_registration_timeout="1mins" --executor_shutdown_grace_period="5secs"
--fetcher_cache_dir="/tmp/Endpoint_SlaveEndpointTest_UnauthorizedRequest_1_8HGVKl/fetch" --fetcher_cache_size="2GB"
--frameworks_home="" --gc_delay="1weeks" --gc_disk_headroom="0.1" --hadoop_home="" --help="true"
--hostname_lookup="true" --http_authenticators="basic" --http_command_executor="false" --http_credentials="/tmp/Endpoint_SlaveEndpointTest_UnauthorizedRequest_1_8HGVKl/http_credentials"
--image_provisioner_backend="copy" --initialize_driver_logging="true" --isolation="posix/cpu,posix/mem"
--launcher_dir="/mesos/mesos-1.0.2/_build/src" --logbufsecs="0" --logging_level="INFO" --oversubscribed_resources_interval="15secs"
--perf_duration="10secs" --perf_interval="1mins" --qos_correction_interval_min="0ns" --quiet="false"
--recover="reconnect" --recovery_timeout="15mins" --registration_backoff_factor="10ms" --resources="cpus:2;gpus:0;mem:1024;disk:1024;ports:[31000-32000]"
--revocable_cpu_low_priority="true" --sandbox_directory="/mnt/mesos/sandbox" --strict="true"
--switch_user="true" --systemd_enable_support="true" --systemd_runtime_directory="/run/systemd/system"
--version="false" --work_dir="/tmp/Endpoint_SlaveEndpointTest_UnauthorizedRequest_1_8HGVKl"
I1029 03:25:43.345252 29183 credentials.hpp:86] Loading credential for authentication from
'/tmp/Endpoint_SlaveEndpointTest_UnauthorizedRequest_1_8HGVKl/credential'
I1029 03:25:43.345470 29183 slave.cpp:336] Agent using credential for: test-principal
I1029 03:25:43.345502 29183 credentials.hpp:37] Loading credentials for authentication from
'/tmp/Endpoint_SlaveEndpointTest_UnauthorizedRequest_1_8HGVKl/http_credentials'
I1029 03:25:43.345929 29183 http.cpp:883] Using default 'basic' HTTP authenticator for realm
'mesos-agent-readonly'
I1029 03:25:43.346150 29183 http.cpp:883] Using default 'basic' HTTP authenticator for realm
'mesos-agent-readwrite'
I1029 03:25:43.346585 29183 resources.cpp:572] Parsing resources as JSON failed: cpus:2;gpus:0;mem:1024;disk:1024;ports:[31000-32000]
Trying semicolon-delimited string format instead
I1029 03:25:43.346954 29183 resources.cpp:572] Parsing resources as JSON failed: cpus:2;gpus:0;mem:1024;disk:1024;ports:[31000-32000]
Trying semicolon-delimited string format instead
I1029 03:25:43.347432 29183 slave.cpp:519] Agent resources: cpus(*):2; mem(*):1024; disk(*):1024;
ports(*):[31000-32000]
I1029 03:25:43.347512 29183 slave.cpp:527] Agent attributes: [  ]
I1029 03:25:43.347529 29183 slave.cpp:532] Agent hostname: 1edd70b94af1
I1029 03:25:43.349400 29191 state.cpp:57] Recovering state from '/tmp/Endpoint_SlaveEndpointTest_UnauthorizedRequest_1_8HGVKl/meta'
I1029 03:25:43.349418 29183 process.cpp:3364] Handling HTTP event for process 'slave(554)'
with path: '/slave(554)/monitor/statistics.json'
I1029 03:25:43.350157 29187 status_update_manager.cpp:200] Recovering status update manager
I1029 03:25:43.350486 29183 containerizer.cpp:522] Recovering containerizer
I1029 03:25:43.350687 29188 http.cpp:835] Authorizing principal 'test-principal' to GET the
'/monitor/statistics.json' endpoint
I1029 03:25:43.352612 29192 provisioner.cpp:253] Provisioner recovery complete
I1029 03:25:43.353216 29197 slave.cpp:4810] Finished recovery
I1029 03:25:43.353749 29197 slave.cpp:4982] Querying resource estimator for oversubscribable
resources
I1029 03:25:43.353863 29197 slave.cpp:767] Agent terminating
[       OK ] Endpoint/SlaveEndpointTest.UnauthorizedRequest/1 (23 ms)
[ RUN      ] Endpoint/SlaveEndpointTest.UnauthorizedRequest/2
I1029 03:25:43.363411 29163 containerizer.cpp:196] Using isolation: posix/cpu,posix/mem,filesystem/posix,network/cni
W1029 03:25:43.364316 29163 backend.cpp:75] Failed to create 'aufs' backend: AufsBackend requires
root privileges, but is running as user mesos
W1029 03:25:43.364500 29163 backend.cpp:75] Failed to create 'bind' backend: BindBackend requires
root privileges
I1029 03:25:43.368243 29194 slave.cpp:198] Agent started on 555)@172.17.0.3:60243
I1029 03:25:43.368269 29194 slave.cpp:199] Flags at startup: --acls="" --appc_simple_discovery_uri_prefix="http://"
--appc_store_dir="/tmp/mesos/store/appc" --authenticate_http_readonly="true" --authenticate_http_readwrite="true"
--authenticatee="crammd5" --authentication_backoff_factor="1secs" --authorizer="local" --cgroups_cpu_enable_pids_and_tids_count="false"
--cgroups_enable_cfs="false" --cgroups_hierarchy="/sys/fs/cgroup" --cgroups_limit_swap="false"
--cgroups_root="mesos" --container_disk_watch_interval="15secs" --containerizers="mesos" --credential="/tmp/Endpoint_SlaveEndpointTest_UnauthorizedRequest_2_GUVlIV/credential"
--default_role="*" --disk_watch_interval="1mins" --docker="docker" --docker_kill_orphans="true"
--docker_registry="https://registry-1.docker.io" --docker_remove_delay="6hrs" --docker_socket="/var/run/docker.sock"
--docker_stop_timeout="0ns" --docker_store_dir="/tmp/mesos/store/docker" --docker_volume_checkpoint_dir="/var/run/mesos/isolators/docker/volume"
--enforce_container_disk_quota="false" --executor_registration_timeout="1mins" --executor_shutdown_grace_period="5secs"
--fetcher_cache_dir="/tmp/Endpoint_SlaveEndpointTest_UnauthorizedRequest_2_GUVlIV/fetch" --fetcher_cache_size="2GB"
--frameworks_home="" --gc_delay="1weeks" --gc_disk_headroom="0.1" --hadoop_home="" --help="true"
--hostname_lookup="true" --http_authenticators="basic" --http_command_executor="false" --http_credentials="/tmp/Endpoint_SlaveEndpointTest_UnauthorizedRequest_2_GUVlIV/http_credentials"
--image_provisioner_backend="copy" --initialize_driver_logging="true" --isolation="posix/cpu,posix/mem"
--launcher_dir="/mesos/mesos-1.0.2/_build/src" --logbufsecs="0" --logging_level="INFO" --oversubscribed_resources_interval="15secs"
--perf_duration="10secs" --perf_interval="1mins" --qos_correction_interval_min="0ns" --quiet="false"
--recover="reconnect" --recovery_timeout="15mins" --registration_backoff_factor="10ms" --resources="cpus:2;gpus:0;mem:1024;disk:1024;ports:[31000-32000]"
--revocable_cpu_low_priority="true" --sandbox_directory="/mnt/mesos/sandbox" --strict="true"
--switch_user="true" --systemd_enable_support="true" --systemd_runtime_directory="/run/systemd/system"
--version="false" --work_dir="/tmp/Endpoint_SlaveEndpointTest_UnauthorizedRequest_2_GUVlIV"
I1029 03:25:43.368804 29194 credentials.hpp:86] Loading credential for authentication from
'/tmp/Endpoint_SlaveEndpointTest_UnauthorizedRequest_2_GUVlIV/credential'
I1029 03:25:43.368989 29194 slave.cpp:336] Agent using credential for: test-principal
I1029 03:25:43.369012 29194 credentials.hpp:37] Loading credentials for authentication from
'/tmp/Endpoint_SlaveEndpointTest_UnauthorizedRequest_2_GUVlIV/http_credentials'
I1029 03:25:43.369325 29194 http.cpp:883] Using default 'basic' HTTP authenticator for realm
'mesos-agent-readonly'
I1029 03:25:43.369474 29194 http.cpp:883] Using default 'basic' HTTP authenticator for realm
'mesos-agent-readwrite'
I1029 03:25:43.370012 29194 resources.cpp:572] Parsing resources as JSON failed: cpus:2;gpus:0;mem:1024;disk:1024;ports:[31000-32000]
Trying semicolon-delimited string format instead
I1029 03:25:43.370606 29194 resources.cpp:572] Parsing resources as JSON failed: cpus:2;gpus:0;mem:1024;disk:1024;ports:[31000-32000]
Trying semicolon-delimited string format instead
I1029 03:25:43.371125 29194 slave.cpp:519] Agent resources: cpus(*):2; mem(*):1024; disk(*):1024;
ports(*):[31000-32000]
I1029 03:25:43.371202 29194 slave.cpp:527] Agent attributes: [  ]
I1029 03:25:43.371217 29194 slave.cpp:532] Agent hostname: 1edd70b94af1
I1029 03:25:43.372920 29187 state.cpp:57] Recovering state from '/tmp/Endpoint_SlaveEndpointTest_UnauthorizedRequest_2_GUVlIV/meta'
I1029 03:25:43.373020 29194 process.cpp:3364] Handling HTTP event for process 'slave(555)'
with path: '/slave(555)/containers'
I1029 03:25:43.373528 29185 status_update_manager.cpp:200] Recovering status update manager
I1029 03:25:43.373803 29187 containerizer.cpp:522] Recovering containerizer
I1029 03:25:43.374215 29194 http.cpp:835] Authorizing principal 'test-principal' to GET the
'/containers' endpoint
I1029 03:25:43.375591 29197 provisioner.cpp:253] Provisioner recovery complete
I1029 03:25:43.376018 29182 slave.cpp:4810] Finished recovery
I1029 03:25:43.376652 29182 slave.cpp:4982] Querying resource estimator for oversubscribable
resources
I1029 03:25:43.377107 29189 slave.cpp:4996] Received oversubscribable resources  from the
resource estimator
I1029 03:25:43.377297 29196 slave.cpp:767] Agent terminating
[       OK ] Endpoint/SlaveEndpointTest.UnauthorizedRequest/2 (25 ms)
[ RUN      ] Endpoint/SlaveEndpointTest.NoAuthorizer/0
I1029 03:25:43.388648 29163 containerizer.cpp:196] Using isolation: posix/cpu,posix/mem,filesystem/posix,network/cni
W1029 03:25:43.389533 29163 backend.cpp:75] Failed to create 'aufs' backend: AufsBackend requires
root privileges, but is running as user mesos
W1029 03:25:43.389710 29163 backend.cpp:75] Failed to create 'bind' backend: BindBackend requires
root privileges
I1029 03:25:43.391537 29163 cluster.cpp:434] Creating default 'local' authorizer
I1029 03:25:43.393769 29183 slave.cpp:198] Agent started on 556)@172.17.0.3:60243
I1029 03:25:43.393798 29183 slave.cpp:199] Flags at startup: --acls="" --appc_simple_discovery_uri_prefix="http://"
--appc_store_dir="/tmp/mesos/store/appc" --authenticate_http_readonly="true" --authenticate_http_readwrite="true"
--authenticatee="crammd5" --authentication_backoff_factor="1secs" --authorizer="local" --cgroups_cpu_enable_pids_and_tids_count="false"
--cgroups_enable_cfs="false" --cgroups_hierarchy="/sys/fs/cgroup" --cgroups_limit_swap="false"
--cgroups_root="mesos" --container_disk_watch_interval="15secs" --containerizers="mesos" --credential="/tmp/Endpoint_SlaveEndpointTest_NoAuthorizer_0_mTlCRv/credential"
--default_role="*" --disk_watch_interval="1mins" --docker="docker" --docker_kill_orphans="true"
--docker_registry="https://registry-1.docker.io" --docker_remove_delay="6hrs" --docker_socket="/var/run/docker.sock"
--docker_stop_timeout="0ns" --docker_store_dir="/tmp/mesos/store/docker" --docker_volume_checkpoint_dir="/var/run/mesos/isolators/docker/volume"
--enforce_container_disk_quota="false" --executor_registration_timeout="1mins" --executor_shutdown_grace_period="5secs"
--fetcher_cache_dir="/tmp/Endpoint_SlaveEndpointTest_NoAuthorizer_0_mTlCRv/fetch" --fetcher_cache_size="2GB"
--frameworks_home="" --gc_delay="1weeks" --gc_disk_headroom="0.1" --hadoop_home="" --help="false"
--hostname_lookup="true" --http_authenticators="basic" --http_command_executor="false" --http_credentials="/tmp/Endpoint_SlaveEndpointTest_NoAuthorizer_0_mTlCRv/http_credentials"
--image_provisioner_backend="copy" --initialize_driver_logging="true" --isolation="posix/cpu,posix/mem"
--launcher_dir="/mesos/mesos-1.0.2/_build/src" --logbufsecs="0" --logging_level="INFO" --oversubscribed_resources_interval="15secs"
--perf_duration="10secs" --perf_interval="1mins" --qos_correction_interval_min="0ns" --quiet="false"
--recover="reconnect" --recovery_timeout="15mins" --registration_backoff_factor="10ms" --resources="cpus:2;gpus:0;mem:1024;disk:1024;ports:[31000-32000]"
--revocable_cpu_low_priority="true" --sandbox_directory="/mnt/mesos/sandbox" --strict="true"
--switch_user="true" --systemd_enable_support="true" --systemd_runtime_directory="/run/systemd/system"
--version="false" --work_dir="/tmp/Endpoint_SlaveEndpointTest_NoAuthorizer_0_mTlCRv"
I1029 03:25:43.394446 29183 credentials.hpp:86] Loading credential for authentication from
'/tmp/Endpoint_SlaveEndpointTest_NoAuthorizer_0_mTlCRv/credential'
I1029 03:25:43.394625 29183 slave.cpp:336] Agent using credential for: test-principal
I1029 03:25:43.394654 29183 credentials.hpp:37] Loading credentials for authentication from
'/tmp/Endpoint_SlaveEndpointTest_NoAuthorizer_0_mTlCRv/http_credentials'
I1029 03:25:43.394940 29183 http.cpp:883] Using default 'basic' HTTP authenticator for realm
'mesos-agent-readonly'
I1029 03:25:43.395105 29183 http.cpp:883] Using default 'basic' HTTP authenticator for realm
'mesos-agent-readwrite'
I1029 03:25:43.395666 29183 resources.cpp:572] Parsing resources as JSON failed: cpus:2;gpus:0;mem:1024;disk:1024;ports:[31000-32000]
Trying semicolon-delimited string format instead
I1029 03:25:43.396083 29183 resources.cpp:572] Parsing resources as JSON failed: cpus:2;gpus:0;mem:1024;disk:1024;ports:[31000-32000]
Trying semicolon-delimited string format instead
I1029 03:25:43.396569 29183 slave.cpp:519] Agent resources: cpus(*):2; mem(*):1024; disk(*):1024;
ports(*):[31000-32000]
I1029 03:25:43.396646 29183 slave.cpp:527] Agent attributes: [  ]
I1029 03:25:43.396672 29183 slave.cpp:532] Agent hostname: 1edd70b94af1
I1029 03:25:43.398226 29193 state.cpp:57] Recovering state from '/tmp/Endpoint_SlaveEndpointTest_NoAuthorizer_0_mTlCRv/meta'
I1029 03:25:43.398309 29183 process.cpp:3364] Handling HTTP event for process 'slave(556)'
with path: '/slave(556)/monitor/statistics'
I1029 03:25:43.398928 29195 status_update_manager.cpp:200] Recovering status update manager
I1029 03:25:43.399196 29187 containerizer.cpp:522] Recovering containerizer
I1029 03:25:43.399410 29191 http.cpp:835] Authorizing principal 'test-principal' to GET the
'/monitor/statistics' endpoint
I1029 03:25:43.400612 29191 provisioner.cpp:253] Provisioner recovery complete
I1029 03:25:43.401237 29182 slave.cpp:4810] Finished recovery
I1029 03:25:43.401751 29182 slave.cpp:4982] Querying resource estimator for oversubscribable
resources
I1029 03:25:43.401970 29190 slave.cpp:4996] Received oversubscribable resources  from the
resource estimator
I1029 03:25:43.403256 29185 slave.cpp:767] Agent terminating
[       OK ] Endpoint/SlaveEndpointTest.NoAuthorizer/0 (22 ms)
[ RUN      ] Endpoint/SlaveEndpointTest.NoAuthorizer/1
I1029 03:25:43.411968 29163 containerizer.cpp:196] Using isolation: posix/cpu,posix/mem,filesystem/posix,network/cni
W1029 03:25:43.412802 29163 backend.cpp:75] Failed to create 'aufs' backend: AufsBackend requires
root privileges, but is running as user mesos
W1029 03:25:43.412976 29163 backend.cpp:75] Failed to create 'bind' backend: BindBackend requires
root privileges
I1029 03:25:43.414718 29163 cluster.cpp:434] Creating default 'local' authorizer
I1029 03:25:43.416658 29196 slave.cpp:198] Agent started on 557)@172.17.0.3:60243
I1029 03:25:43.416689 29196 slave.cpp:199] Flags at startup: --acls="" --appc_simple_discovery_uri_prefix="http://"
--appc_store_dir="/tmp/mesos/store/appc" --authenticate_http_readonly="true" --authenticate_http_readwrite="true"
--authenticatee="crammd5" --authentication_backoff_factor="1secs" --authorizer="local" --cgroups_cpu_enable_pids_and_tids_count="false"
--cgroups_enable_cfs="false" --cgroups_hierarchy="/sys/fs/cgroup" --cgroups_limit_swap="false"
--cgroups_root="mesos" --container_disk_watch_interval="15secs" --containerizers="mesos" --credential="/tmp/Endpoint_SlaveEndpointTest_NoAuthorizer_1_d9fyc6/credential"
--default_role="*" --disk_watch_interval="1mins" --docker="docker" --docker_kill_orphans="true"
--docker_registry="https://registry-1.docker.io" --docker_remove_delay="6hrs" --docker_socket="/var/run/docker.sock"
--docker_stop_timeout="0ns" --docker_store_dir="/tmp/mesos/store/docker" --docker_volume_checkpoint_dir="/var/run/mesos/isolators/docker/volume"
--enforce_container_disk_quota="false" --executor_registration_timeout="1mins" --executor_shutdown_grace_period="5secs"
--fetcher_cache_dir="/tmp/Endpoint_SlaveEndpointTest_NoAuthorizer_1_d9fyc6/fetch" --fetcher_cache_size="2GB"
--frameworks_home="" --gc_delay="1weeks" --gc_disk_headroom="0.1" --hadoop_home="" --help="false"
--hostname_lookup="true" --http_authenticators="basic" --http_command_executor="false" --http_credentials="/tmp/Endpoint_SlaveEndpointTest_NoAuthorizer_1_d9fyc6/http_credentials"
--image_provisioner_backend="copy" --initialize_driver_logging="true" --isolation="posix/cpu,posix/mem"
--launcher_dir="/mesos/mesos-1.0.2/_build/src" --logbufsecs="0" --logging_level="INFO" --oversubscribed_resources_interval="15secs"
--perf_duration="10secs" --perf_interval="1mins" --qos_correction_interval_min="0ns" --quiet="false"
--recover="reconnect" --recovery_timeout="15mins" --registration_backoff_factor="10ms" --resources="cpus:2;gpus:0;mem:1024;disk:1024;ports:[31000-32000]"
--revocable_cpu_low_priority="true" --sandbox_directory="/mnt/mesos/sandbox" --strict="true"
--switch_user="true" --systemd_enable_support="true" --systemd_runtime_directory="/run/systemd/system"
--version="false" --work_dir="/tmp/Endpoint_SlaveEndpointTest_NoAuthorizer_1_d9fyc6"
I1029 03:25:43.417596 29196 credentials.hpp:86] Loading credential for authentication from
'/tmp/Endpoint_SlaveEndpointTest_NoAuthorizer_1_d9fyc6/credential'
I1029 03:25:43.417780 29196 slave.cpp:336] Agent using credential for: test-principal
I1029 03:25:43.417812 29196 credentials.hpp:37] Loading credentials for authentication from
'/tmp/Endpoint_SlaveEndpointTest_NoAuthorizer_1_d9fyc6/http_credentials'
I1029 03:25:43.418185 29196 http.cpp:883] Using default 'basic' HTTP authenticator for realm
'mesos-agent-readonly'
I1029 03:25:43.418334 29196 http.cpp:883] Using default 'basic' HTTP authenticator for realm
'mesos-agent-readwrite'
I1029 03:25:43.418814 29196 resources.cpp:572] Parsing resources as JSON failed: cpus:2;gpus:0;mem:1024;disk:1024;ports:[31000-32000]
Trying semicolon-delimited string format instead
I1029 03:25:43.419152 29196 resources.cpp:572] Parsing resources as JSON failed: cpus:2;gpus:0;mem:1024;disk:1024;ports:[31000-32000]
Trying semicolon-delimited string format instead
I1029 03:25:43.419625 29196 slave.cpp:519] Agent resources: cpus(*):2; mem(*):1024; disk(*):1024;
ports(*):[31000-32000]
I1029 03:25:43.419700 29196 slave.cpp:527] Agent attributes: [  ]
I1029 03:25:43.419716 29196 slave.cpp:532] Agent hostname: 1edd70b94af1
I1029 03:25:43.421195 29188 state.cpp:57] Recovering state from '/tmp/Endpoint_SlaveEndpointTest_NoAuthorizer_1_d9fyc6/meta'
I1029 03:25:43.421269 29196 process.cpp:3364] Handling HTTP event for process 'slave(557)'
with path: '/slave(557)/monitor/statistics.json'
I1029 03:25:43.421881 29190 status_update_manager.cpp:200] Recovering status update manager
I1029 03:25:43.422251 29192 containerizer.cpp:522] Recovering containerizer
I1029 03:25:43.422427 29190 http.cpp:835] Authorizing principal 'test-principal' to GET the
'/monitor/statistics.json' endpoint
I1029 03:25:43.423805 29182 provisioner.cpp:253] Provisioner recovery complete
I1029 03:25:43.424268 29195 slave.cpp:4810] Finished recovery
I1029 03:25:43.424932 29195 slave.cpp:4982] Querying resource estimator for oversubscribable
resources
I1029 03:25:43.425120 29190 slave.cpp:4996] Received oversubscribable resources  from the
resource estimator
I1029 03:25:43.426802 29187 slave.cpp:767] Agent terminating
[       OK ] Endpoint/SlaveEndpointTest.NoAuthorizer/1 (25 ms)
[ RUN      ] Endpoint/SlaveEndpointTest.NoAuthorizer/2
I1029 03:25:43.436980 29163 containerizer.cpp:196] Using isolation: posix/cpu,posix/mem,filesystem/posix,network/cni
W1029 03:25:43.437757 29163 backend.cpp:75] Failed to create 'aufs' backend: AufsBackend requires
root privileges, but is running as user mesos
W1029 03:25:43.437932 29163 backend.cpp:75] Failed to create 'bind' backend: BindBackend requires
root privileges
I1029 03:25:43.439607 29163 cluster.cpp:434] Creating default 'local' authorizer
I1029 03:25:43.441901 29183 slave.cpp:198] Agent started on 558)@172.17.0.3:60243
I1029 03:25:43.441962 29183 slave.cpp:199] Flags at startup: --acls="" --appc_simple_discovery_uri_prefix="http://"
--appc_store_dir="/tmp/mesos/store/appc" --authenticate_http_readonly="true" --authenticate_http_readwrite="true"
--authenticatee="crammd5" --authentication_backoff_factor="1secs" --authorizer="local" --cgroups_cpu_enable_pids_and_tids_count="false"
--cgroups_enable_cfs="false" --cgroups_hierarchy="/sys/fs/cgroup" --cgroups_limit_swap="false"
--cgroups_root="mesos" --container_disk_watch_interval="15secs" --containerizers="mesos" --credential="/tmp/Endpoint_SlaveEndpointTest_NoAuthorizer_2_IReoJG/credential"
--default_role="*" --disk_watch_interval="1mins" --docker="docker" --docker_kill_orphans="true"
--docker_registry="https://registry-1.docker.io" --docker_remove_delay="6hrs" --docker_socket="/var/run/docker.sock"
--docker_stop_timeout="0ns" --docker_store_dir="/tmp/mesos/store/docker" --docker_volume_checkpoint_dir="/var/run/mesos/isolators/docker/volume"
--enforce_container_disk_quota="false" --executor_registration_timeout="1mins" --executor_shutdown_grace_period="5secs"
--fetcher_cache_dir="/tmp/Endpoint_SlaveEndpointTest_NoAuthorizer_2_IReoJG/fetch" --fetcher_cache_size="2GB"
--frameworks_home="" --gc_delay="1weeks" --gc_disk_headroom="0.1" --hadoop_home="" --help="false"
--hostname_lookup="true" --http_authenticators="basic" --http_command_executor="false" --http_credentials="/tmp/Endpoint_SlaveEndpointTest_NoAuthorizer_2_IReoJG/http_credentials"
--image_provisioner_backend="copy" --initialize_driver_logging="true" --isolation="posix/cpu,posix/mem"
--launcher_dir="/mesos/mesos-1.0.2/_build/src" --logbufsecs="0" --logging_level="INFO" --oversubscribed_resources_interval="15secs"
--perf_duration="10secs" --perf_interval="1mins" --qos_correction_interval_min="0ns" --quiet="false"
--recover="reconnect" --recovery_timeout="15mins" --registration_backoff_factor="10ms" --resources="cpus:2;gpus:0;mem:1024;disk:1024;ports:[31000-32000]"
--revocable_cpu_low_priority="true" --sandbox_directory="/mnt/mesos/sandbox" --strict="true"
--switch_user="true" --systemd_enable_support="true" --systemd_runtime_directory="/run/systemd/system"
--version="false" --work_dir="/tmp/Endpoint_SlaveEndpointTest_NoAuthorizer_2_IReoJG"
I1029 03:25:43.442831 29183 credentials.hpp:86] Loading credential for authentication from
'/tmp/Endpoint_SlaveEndpointTest_NoAuthorizer_2_IReoJG/credential'
I1029 03:25:43.443053 29183 slave.cpp:336] Agent using credential for: test-principal
I1029 03:25:43.443089 29183 credentials.hpp:37] Loading credentials for authentication from
'/tmp/Endpoint_SlaveEndpointTest_NoAuthorizer_2_IReoJG/http_credentials'
I1029 03:25:43.443393 29183 http.cpp:883] Using default 'basic' HTTP authenticator for realm
'mesos-agent-readonly'
I1029 03:25:43.443539 29183 http.cpp:883] Using default 'basic' HTTP authenticator for realm
'mesos-agent-readwrite'
I1029 03:25:43.443995 29183 resources.cpp:572] Parsing resources as JSON failed: cpus:2;gpus:0;mem:1024;disk:1024;ports:[31000-32000]
Trying semicolon-delimited string format instead
I1029 03:25:43.444406 29183 resources.cpp:572] Parsing resources as JSON failed: cpus:2;gpus:0;mem:1024;disk:1024;ports:[31000-32000]
Trying semicolon-delimited string format instead
I1029 03:25:43.444910 29183 slave.cpp:519] Agent resources: cpus(*):2; mem(*):1024; disk(*):1024;
ports(*):[31000-32000]
I1029 03:25:43.444984 29183 slave.cpp:527] Agent attributes: [  ]
I1029 03:25:43.445003 29183 slave.cpp:532] Agent hostname: 1edd70b94af1
I1029 03:25:43.446612 29184 state.cpp:57] Recovering state from '/tmp/Endpoint_SlaveEndpointTest_NoAuthorizer_2_IReoJG/meta'
I1029 03:25:43.446689 29183 process.cpp:3364] Handling HTTP event for process 'slave(558)'
with path: '/slave(558)/containers'
I1029 03:25:43.447228 29195 status_update_manager.cpp:200] Recovering status update manager
I1029 03:25:43.447433 29189 containerizer.cpp:522] Recovering containerizer
I1029 03:25:43.447780 29187 http.cpp:835] Authorizing principal 'test-principal' to GET the
'/containers' endpoint
I1029 03:25:43.448983 29195 provisioner.cpp:253] Provisioner recovery complete
I1029 03:25:43.449357 29191 slave.cpp:4810] Finished recovery
I1029 03:25:43.449982 29191 slave.cpp:4982] Querying resource estimator for oversubscribable
resources
I1029 03:25:43.450412 29193 slave.cpp:4996] Received oversubscribable resources  from the
resource estimator
I1029 03:25:43.451645 29188 slave.cpp:767] Agent terminating
[       OK ] Endpoint/SlaveEndpointTest.NoAuthorizer/2 (24 ms)
[----------] 9 tests from Endpoint/SlaveEndpointTest (218 ms total)

[----------] Global test environment tear-down
[==========] 1243 tests from 141 test cases ran. (500856 ms total)
[  PASSED  ] 1242 tests.
[  FAILED  ] 1 test, listed below:
[  FAILED  ] Strict/RegistrarTest.Readmit/0, where GetParam() = false

 1 FAILED TEST
  YOU HAVE 6 DISABLED TESTS

make[4]: *** [check-local] Error 1
make[4]: Leaving directory `/mesos/mesos-1.0.2/_build/src'
make[3]: *** [check-am] Error 2
make[3]: Leaving directory `/mesos/mesos-1.0.2/_build/src'
make[2]: *** [check] Error 2
make[2]: Leaving directory `/mesos/mesos-1.0.2/_build/src'
make[1]: *** [check-recursive] Error 1
make[1]: Leaving directory `/mesos/mesos-1.0.2/_build'
make: *** [distcheck] Error 1
+ docker rmi mesos-1477709459-7186
Untagged: mesos-1477709459-7186:latest
Deleted: sha256:4c571d1f273b2706fac61817e5dae73dec2d321dbfadd94d784cd10a13cbea12
Deleted: sha256:0ee6bf3456cd4810284935cdcff9e078bf12b5d23a05f08fb41fecd20a688825
Deleted: sha256:e7c26a2daeb206afff2f753ecf492377b979f7351855b89d97af912f56012886
Deleted: sha256:b554d3061d1f0179deb21443cd7a3d37471392af9bbb6078fce76fca792ed51f
Deleted: sha256:3a995a7ab5ef0d1dcda8ad44b7711c5ba325dd14344c0ea85dd58a35b32180ed
Deleted: sha256:6644fdcff0c2551515ca1b21e9b572cdaaec487392b0d74ddba78d492d934aac
Deleted: sha256:9f356c07cf832b030b8a73816c1c3bffcab03bcf78c945fae64bfc5d12a6dfdc
Deleted: sha256:7a93c34d1a7a546c61d1802f6e0ad5f64f7969937d889bf503720ca6110153d0
Deleted: sha256:ddc2fd07e3ff6529a366bf7dbc31fed6da1d5fa38ce11966780b86f37eb0b66f
Deleted: sha256:2cd6941ffe24466384b59f3153f0349979654bf1368f70996604a3b2a94c546c
Deleted: sha256:ec32410aff482322ca33cd8a5138cfd6e8d9a711707b76938ce40ad922722240
Deleted: sha256:a80e896cdcb4a50f60aaa86225853518c0ca5ac0aa88f9070c6467e0c4d41493
Deleted: sha256:6af418d3987ef59a0a9f983eb774f7d5ef7b997e04c1601cf88b78967c9c0551
Deleted: sha256:937714bca6205efad02175cfd72163d73945fde88f8dbae692961ebc8b754667
Deleted: sha256:d852087f03a038e19c2029b9000be36ce6ede3ba4442a2a8db7e9e28fa951426
Deleted: sha256:7426cc93a30912e4a2de9cb0b8d3a29693d301c6b025127ce635fcc3756260ce
Deleted: sha256:3804552b755e6804c171b2efab9c749a8fa18336d984c1b3454a81329f4d82be
Deleted: sha256:3fbd5450c40001caea88ce43b332b59262b8c8b27fca77b8a6f888f41c4b40d9
Deleted: sha256:1f04ca9772a844ade0bb90740e2cf5ff6de11f9edfe96a0d5397875498e2dcff
Deleted: sha256:2f1e6f57ac6e2176967052116be209d22ca89371c284e75529dd105a9b5abf90
Deleted: sha256:874623007ae094f4296b1a5b082664a98102455f72b577b963c3336b9e6afd60
Deleted: sha256:6f2d1823595e8a61e6b5c66d3266218ea7e36e7a76ca1d6585d6b6eeb89868e7
Deleted: sha256:2a064c77a621038d93a36544bd4fd6074b07cfa621f870f0f5aeaa6901922161
Deleted: sha256:5e4461456c2ba7d87c74384bb461b9dca04bb97cf5883ab1ff99384fd219d337
Deleted: sha256:f37aa3bda7786c29761308bb24b26b405583b21dcebc28ed52a48cf3760b2e03
Build step 'Execute shell' marked build as failure

Mime
View raw message