mesos-builds mailing list archives

Site index · List index
Message view « Date » · « Thread »
Top « Date » · « Thread »
From Apache Jenkins Server <jenk...@builds.apache.org>
Subject Build failed in Jenkins: Mesos » autotools,clang,--verbose --enable-libevent --enable-ssl,GLOG_v=1 MESOS_VERBOSE=1,ubuntu:14.04,(docker||Hadoop)&&(!ubuntu-us1)&&(!ubuntu-6) #2826
Date Tue, 25 Oct 2016 21:44:17 GMT
See <https://builds.apache.org/job/Mesos/BUILDTOOL=autotools,COMPILER=clang,CONFIGURATION=--verbose%20--enable-libevent%20--enable-ssl,ENVIRONMENT=GLOG_v=1%20MESOS_VERBOSE=1,OS=ubuntu%3A14.04,label_exp=(docker%7C%7CHadoop)&&(!ubuntu-us1)&&(!ubuntu-6)/2826/>

------------------------------------------
[...truncated 216138 lines...]
[ RUN      ] Endpoint/SlaveEndpointTest.AuthorizedRequest/1
I1025 21:42:52.047004 28882 containerizer.cpp:200] Using isolation: posix/cpu,posix/mem,filesystem/posix,network/cni
W1025 21:42:52.047693 28882 backend.cpp:75] Failed to create 'aufs' backend: AufsBackend requires
root privileges, but is running as user mesos
W1025 21:42:52.047873 28882 backend.cpp:75] Failed to create 'bind' backend: BindBackend requires
root privileges
I1025 21:42:52.051720 28908 slave.cpp:208] Mesos agent started on (621)@172.17.0.2:54619
I1025 21:42:52.051769 28908 slave.cpp:209] Flags at startup: --acls="" --appc_simple_discovery_uri_prefix="http://"
--appc_store_dir="/tmp/mesos/store/appc" --authenticate_http_readonly="true" --authenticate_http_readwrite="true"
--authenticatee="crammd5" --authentication_backoff_factor="1secs" --authorizer="local" --cgroups_cpu_enable_pids_and_tids_count="false"
--cgroups_enable_cfs="false" --cgroups_hierarchy="/sys/fs/cgroup" --cgroups_limit_swap="false"
--cgroups_root="mesos" --container_disk_watch_interval="15secs" --containerizers="mesos" --credential="/tmp/Endpoint_SlaveEndpointTest_AuthorizedRequest_1_kFLghK/credential"
--default_role="*" --disk_watch_interval="1mins" --docker="docker" --docker_kill_orphans="true"
--docker_registry="https://registry-1.docker.io" --docker_remove_delay="6hrs" --docker_socket="/var/run/docker.sock"
--docker_stop_timeout="0ns" --docker_store_dir="/tmp/mesos/store/docker" --docker_volume_checkpoint_dir="/var/run/mesos/isolators/docker/volume"
--enforce_container_disk_quota="false" --executor_registration_timeout="1mins" --executor_shutdown_grace_period="5secs"
--fetcher_cache_dir="/tmp/Endpoint_SlaveEndpointTest_AuthorizedRequest_1_kFLghK/fetch" --fetcher_cache_size="2GB"
--frameworks_home="" --gc_delay="1weeks" --gc_disk_headroom="0.1" --hadoop_home="" --help="false"
--hostname_lookup="true" --http_authenticators="basic" --http_command_executor="false" --http_credentials="/tmp/Endpoint_SlaveEndpointTest_AuthorizedRequest_1_kFLghK/http_credentials"
--image_provisioner_backend="copy" --initialize_driver_logging="true" --isolation="posix/cpu,posix/mem"
--launcher="posix" --launcher_dir="/mesos/mesos-1.1.0/_build/src" --logbufsecs="0" --logging_level="INFO"
--max_completed_executors_per_framework="150" --oversubscribed_resources_interval="15secs"
--perf_duration="10secs" --perf_interval="1mins" --qos_correction_interval_min="0ns" --quiet="false"
--recover="reconnect" --recovery_timeout="15mins" --registration_backoff_factor="10ms" --resources="cpus:2;gpus:0;mem:1024;disk:1024;ports:[31000-32000]"
--revocable_cpu_low_priority="true" --runtime_dir="/tmp/Endpoint_SlaveEndpointTest_AuthorizedRequest_1_kFLghK"
--sandbox_directory="/mnt/mesos/sandbox" --strict="true" --switch_user="true" --systemd_enable_support="true"
--systemd_runtime_directory="/run/systemd/system" --version="false" --work_dir="/tmp/Endpoint_SlaveEndpointTest_AuthorizedRequest_1_04JtBz"
I1025 21:42:52.052289 28908 credentials.hpp:86] Loading credential for authentication from
'/tmp/Endpoint_SlaveEndpointTest_AuthorizedRequest_1_kFLghK/credential'
I1025 21:42:52.052475 28908 slave.cpp:346] Agent using credential for: test-principal
I1025 21:42:52.052505 28908 credentials.hpp:37] Loading credentials for authentication from
'/tmp/Endpoint_SlaveEndpointTest_AuthorizedRequest_1_kFLghK/http_credentials'
I1025 21:42:52.052815 28908 http.cpp:887] Using default 'basic' HTTP authenticator for realm
'mesos-agent-readonly'
I1025 21:42:52.052968 28908 http.cpp:887] Using default 'basic' HTTP authenticator for realm
'mesos-agent-readwrite'
I1025 21:42:52.054311 28908 slave.cpp:533] Agent resources: cpus(*):2; mem(*):1024; disk(*):1024;
ports(*):[31000-32000]
I1025 21:42:52.054410 28908 slave.cpp:541] Agent attributes: [  ]
I1025 21:42:52.054428 28908 slave.cpp:546] Agent hostname: f8fcbeec1375
I1025 21:42:52.056031 28900 state.cpp:57] Recovering state from '/tmp/Endpoint_SlaveEndpointTest_AuthorizedRequest_1_04JtBz/meta'
I1025 21:42:52.056129 28908 process.cpp:3377] Handling HTTP event for process 'slave(621)'
with path: '/slave(621)/monitor/statistics.json'
I1025 21:42:52.056571 28915 status_update_manager.cpp:203] Recovering status update manager
I1025 21:42:52.056857 28915 containerizer.cpp:555] Recovering containerizer
I1025 21:42:52.057164 28904 http.cpp:839] Authorizing principal 'test-principal' to GET the
'/monitor/statistics.json' endpoint
I1025 21:42:52.058475 28906 provisioner.cpp:253] Provisioner recovery complete
I1025 21:42:52.058935 28904 slave.cpp:5281] Finished recovery
I1025 21:42:52.059480 28904 slave.cpp:5455] Querying resource estimator for oversubscribable
resources
I1025 21:42:52.059713 28915 slave.cpp:5469] Received oversubscribable resources {} from the
resource estimator
I1025 21:42:52.060752 28906 slave.cpp:787] Agent terminating
[       OK ] Endpoint/SlaveEndpointTest.AuthorizedRequest/1 (24 ms)
[ RUN      ] Endpoint/SlaveEndpointTest.AuthorizedRequest/2
I1025 21:42:52.071660 28882 containerizer.cpp:200] Using isolation: posix/cpu,posix/mem,filesystem/posix,network/cni
W1025 21:42:52.072362 28882 backend.cpp:75] Failed to create 'aufs' backend: AufsBackend requires
root privileges, but is running as user mesos
W1025 21:42:52.072536 28882 backend.cpp:75] Failed to create 'bind' backend: BindBackend requires
root privileges
I1025 21:42:52.075533 28905 slave.cpp:208] Mesos agent started on (622)@172.17.0.2:54619
I1025 21:42:52.075569 28905 slave.cpp:209] Flags at startup: --acls="" --appc_simple_discovery_uri_prefix="http://"
--appc_store_dir="/tmp/mesos/store/appc" --authenticate_http_readonly="true" --authenticate_http_readwrite="true"
--authenticatee="crammd5" --authentication_backoff_factor="1secs" --authorizer="local" --cgroups_cpu_enable_pids_and_tids_count="false"
--cgroups_enable_cfs="false" --cgroups_hierarchy="/sys/fs/cgroup" --cgroups_limit_swap="false"
--cgroups_root="mesos" --container_disk_watch_interval="15secs" --containerizers="mesos" --credential="/tmp/Endpoint_SlaveEndpointTest_AuthorizedRequest_2_Qhptcr/credential"
--default_role="*" --disk_watch_interval="1mins" --docker="docker" --docker_kill_orphans="true"
--docker_registry="https://registry-1.docker.io" --docker_remove_delay="6hrs" --docker_socket="/var/run/docker.sock"
--docker_stop_timeout="0ns" --docker_store_dir="/tmp/mesos/store/docker" --docker_volume_checkpoint_dir="/var/run/mesos/isolators/docker/volume"
--enforce_container_disk_quota="false" --executor_registration_timeout="1mins" --executor_shutdown_grace_period="5secs"
--fetcher_cache_dir="/tmp/Endpoint_SlaveEndpointTest_AuthorizedRequest_2_Qhptcr/fetch" --fetcher_cache_size="2GB"
--frameworks_home="" --gc_delay="1weeks" --gc_disk_headroom="0.1" --hadoop_home="" --help="false"
--hostname_lookup="true" --http_authenticators="basic" --http_command_executor="false" --http_credentials="/tmp/Endpoint_SlaveEndpointTest_AuthorizedRequest_2_Qhptcr/http_credentials"
--image_provisioner_backend="copy" --initialize_driver_logging="true" --isolation="posix/cpu,posix/mem"
--launcher="posix" --launcher_dir="/mesos/mesos-1.1.0/_build/src" --logbufsecs="0" --logging_level="INFO"
--max_completed_executors_per_framework="150" --oversubscribed_resources_interval="15secs"
--perf_duration="10secs" --perf_interval="1mins" --qos_correction_interval_min="0ns" --quiet="false"
--recover="reconnect" --recovery_timeout="15mins" --registration_backoff_factor="10ms" --resources="cpus:2;gpus:0;mem:1024;disk:1024;ports:[31000-32000]"
--revocable_cpu_low_priority="true" --runtime_dir="/tmp/Endpoint_SlaveEndpointTest_AuthorizedRequest_2_Qhptcr"
--sandbox_directory="/mnt/mesos/sandbox" --strict="true" --switch_user="true" --systemd_enable_support="true"
--systemd_runtime_directory="/run/systemd/system" --version="false" --work_dir="/tmp/Endpoint_SlaveEndpointTest_AuthorizedRequest_2_wPJGsg"
I1025 21:42:52.075963 28905 credentials.hpp:86] Loading credential for authentication from
'/tmp/Endpoint_SlaveEndpointTest_AuthorizedRequest_2_Qhptcr/credential'
I1025 21:42:52.076113 28905 slave.cpp:346] Agent using credential for: test-principal
I1025 21:42:52.076138 28905 credentials.hpp:37] Loading credentials for authentication from
'/tmp/Endpoint_SlaveEndpointTest_AuthorizedRequest_2_Qhptcr/http_credentials'
I1025 21:42:52.076335 28905 http.cpp:887] Using default 'basic' HTTP authenticator for realm
'mesos-agent-readonly'
I1025 21:42:52.076442 28905 http.cpp:887] Using default 'basic' HTTP authenticator for realm
'mesos-agent-readwrite'
I1025 21:42:52.077838 28905 slave.cpp:533] Agent resources: cpus(*):2; mem(*):1024; disk(*):1024;
ports(*):[31000-32000]
I1025 21:42:52.077932 28905 slave.cpp:541] Agent attributes: [  ]
I1025 21:42:52.077947 28905 slave.cpp:546] Agent hostname: f8fcbeec1375
I1025 21:42:52.079552 28912 state.cpp:57] Recovering state from '/tmp/Endpoint_SlaveEndpointTest_AuthorizedRequest_2_wPJGsg/meta'
I1025 21:42:52.079643 28905 process.cpp:3377] Handling HTTP event for process 'slave(622)'
with path: '/slave(622)/containers'
I1025 21:42:52.080160 28914 status_update_manager.cpp:203] Recovering status update manager
I1025 21:42:52.080457 28906 containerizer.cpp:555] Recovering containerizer
I1025 21:42:52.080623 28904 http.cpp:839] Authorizing principal 'test-principal' to GET the
'/containers' endpoint
I1025 21:42:52.081974 28906 provisioner.cpp:253] Provisioner recovery complete
I1025 21:42:52.082489 28902 slave.cpp:5281] Finished recovery
I1025 21:42:52.083003 28902 slave.cpp:5455] Querying resource estimator for oversubscribable
resources
I1025 21:42:52.083297 28914 slave.cpp:5469] Received oversubscribable resources {} from the
resource estimator
I1025 21:42:52.083994 28908 slave.cpp:787] Agent terminating
[       OK ] Endpoint/SlaveEndpointTest.AuthorizedRequest/2 (22 ms)
[ RUN      ] Endpoint/SlaveEndpointTest.UnauthorizedRequest/0
I1025 21:42:52.093225 28882 containerizer.cpp:200] Using isolation: posix/cpu,posix/mem,filesystem/posix,network/cni
W1025 21:42:52.093868 28882 backend.cpp:75] Failed to create 'aufs' backend: AufsBackend requires
root privileges, but is running as user mesos
W1025 21:42:52.094032 28882 backend.cpp:75] Failed to create 'bind' backend: BindBackend requires
root privileges
I1025 21:42:52.096307 28907 slave.cpp:208] Mesos agent started on (623)@172.17.0.2:54619
I1025 21:42:52.096344 28907 slave.cpp:209] Flags at startup: --acls="" --appc_simple_discovery_uri_prefix="http://"
--appc_store_dir="/tmp/mesos/store/appc" --authenticate_http_readonly="true" --authenticate_http_readwrite="true"
--authenticatee="crammd5" --authentication_backoff_factor="1secs" --authorizer="local" --cgroups_cpu_enable_pids_and_tids_count="false"
--cgroups_enable_cfs="false" --cgroups_hierarchy="/sys/fs/cgroup" --cgroups_limit_swap="false"
--cgroups_root="mesos" --container_disk_watch_interval="15secs" --containerizers="mesos" --credential="/tmp/Endpoint_SlaveEndpointTest_UnauthorizedRequest_0_8oFam8/credential"
--default_role="*" --disk_watch_interval="1mins" --docker="docker" --docker_kill_orphans="true"
--docker_registry="https://registry-1.docker.io" --docker_remove_delay="6hrs" --docker_socket="/var/run/docker.sock"
--docker_stop_timeout="0ns" --docker_store_dir="/tmp/mesos/store/docker" --docker_volume_checkpoint_dir="/var/run/mesos/isolators/docker/volume"
--enforce_container_disk_quota="false" --executor_registration_timeout="1mins" --executor_shutdown_grace_period="5secs"
--fetcher_cache_dir="/tmp/Endpoint_SlaveEndpointTest_UnauthorizedRequest_0_8oFam8/fetch" --fetcher_cache_size="2GB"
--frameworks_home="" --gc_delay="1weeks" --gc_disk_headroom="0.1" --hadoop_home="" --help="false"
--hostname_lookup="true" --http_authenticators="basic" --http_command_executor="false" --http_credentials="/tmp/Endpoint_SlaveEndpointTest_UnauthorizedRequest_0_8oFam8/http_credentials"
--image_provisioner_backend="copy" --initialize_driver_logging="true" --isolation="posix/cpu,posix/mem"
--launcher="posix" --launcher_dir="/mesos/mesos-1.1.0/_build/src" --logbufsecs="0" --logging_level="INFO"
--max_completed_executors_per_framework="150" --oversubscribed_resources_interval="15secs"
--perf_duration="10secs" --perf_interval="1mins" --qos_correction_interval_min="0ns" --quiet="false"
--recover="reconnect" --recovery_timeout="15mins" --registration_backoff_factor="10ms" --resources="cpus:2;gpus:0;mem:1024;disk:1024;ports:[31000-32000]"
--revocable_cpu_low_priority="true" --runtime_dir="/tmp/Endpoint_SlaveEndpointTest_UnauthorizedRequest_0_8oFam8"
--sandbox_directory="/mnt/mesos/sandbox" --strict="true" --switch_user="true" --systemd_enable_support="true"
--systemd_runtime_directory="/run/systemd/system" --version="false" --work_dir="/tmp/Endpoint_SlaveEndpointTest_UnauthorizedRequest_0_GXzRyX"
I1025 21:42:52.096730 28907 credentials.hpp:86] Loading credential for authentication from
'/tmp/Endpoint_SlaveEndpointTest_UnauthorizedRequest_0_8oFam8/credential'
I1025 21:42:52.096870 28907 slave.cpp:346] Agent using credential for: test-principal
I1025 21:42:52.096891 28907 credentials.hpp:37] Loading credentials for authentication from
'/tmp/Endpoint_SlaveEndpointTest_UnauthorizedRequest_0_8oFam8/http_credentials'
I1025 21:42:52.097084 28907 http.cpp:887] Using default 'basic' HTTP authenticator for realm
'mesos-agent-readonly'
I1025 21:42:52.097259 28907 http.cpp:887] Using default 'basic' HTTP authenticator for realm
'mesos-agent-readwrite'
I1025 21:42:52.098243 28907 slave.cpp:533] Agent resources: cpus(*):2; mem(*):1024; disk(*):1024;
ports(*):[31000-32000]
I1025 21:42:52.098312 28907 slave.cpp:541] Agent attributes: [  ]
I1025 21:42:52.098325 28907 slave.cpp:546] Agent hostname: f8fcbeec1375
I1025 21:42:52.099737 28906 state.cpp:57] Recovering state from '/tmp/Endpoint_SlaveEndpointTest_UnauthorizedRequest_0_GXzRyX/meta'
I1025 21:42:52.099831 28907 process.cpp:3377] Handling HTTP event for process 'slave(623)'
with path: '/slave(623)/monitor/statistics'
I1025 21:42:52.100215 28915 status_update_manager.cpp:203] Recovering status update manager
I1025 21:42:52.100428 28903 containerizer.cpp:555] Recovering containerizer
I1025 21:42:52.100515 28915 http.cpp:839] Authorizing principal 'test-principal' to GET the
'/monitor/statistics' endpoint
I1025 21:42:52.101488 28904 provisioner.cpp:253] Provisioner recovery complete
I1025 21:42:52.101778 28901 slave.cpp:5281] Finished recovery
I1025 21:42:52.102221 28901 slave.cpp:5455] Querying resource estimator for oversubscribable
resources
I1025 21:42:52.102388 28904 slave.cpp:5469] Received oversubscribable resources {} from the
resource estimator
I1025 21:42:52.102823 28912 slave.cpp:787] Agent terminating
[       OK ] Endpoint/SlaveEndpointTest.UnauthorizedRequest/0 (17 ms)
[ RUN      ] Endpoint/SlaveEndpointTest.UnauthorizedRequest/1
I1025 21:42:52.111755 28882 containerizer.cpp:200] Using isolation: posix/cpu,posix/mem,filesystem/posix,network/cni
W1025 21:42:52.112412 28882 backend.cpp:75] Failed to create 'aufs' backend: AufsBackend requires
root privileges, but is running as user mesos
W1025 21:42:52.112591 28882 backend.cpp:75] Failed to create 'bind' backend: BindBackend requires
root privileges
I1025 21:42:52.115787 28907 slave.cpp:208] Mesos agent started on (624)@172.17.0.2:54619
I1025 21:42:52.115836 28907 slave.cpp:209] Flags at startup: --acls="" --appc_simple_discovery_uri_prefix="http://"
--appc_store_dir="/tmp/mesos/store/appc" --authenticate_http_readonly="true" --authenticate_http_readwrite="true"
--authenticatee="crammd5" --authentication_backoff_factor="1secs" --authorizer="local" --cgroups_cpu_enable_pids_and_tids_count="false"
--cgroups_enable_cfs="false" --cgroups_hierarchy="/sys/fs/cgroup" --cgroups_limit_swap="false"
--cgroups_root="mesos" --container_disk_watch_interval="15secs" --containerizers="mesos" --credential="/tmp/Endpoint_SlaveEndpointTest_UnauthorizedRequest_1_0tEVHP/credential"
--default_role="*" --disk_watch_interval="1mins" --docker="docker" --docker_kill_orphans="true"
--docker_registry="https://registry-1.docker.io" --docker_remove_delay="6hrs" --docker_socket="/var/run/docker.sock"
--docker_stop_timeout="0ns" --docker_store_dir="/tmp/mesos/store/docker" --docker_volume_checkpoint_dir="/var/run/mesos/isolators/docker/volume"
--enforce_container_disk_quota="false" --executor_registration_timeout="1mins" --executor_shutdown_grace_period="5secs"
--fetcher_cache_dir="/tmp/Endpoint_SlaveEndpointTest_UnauthorizedRequest_1_0tEVHP/fetch" --fetcher_cache_size="2GB"
--frameworks_home="" --gc_delay="1weeks" --gc_disk_headroom="0.1" --hadoop_home="" --help="false"
--hostname_lookup="true" --http_authenticators="basic" --http_command_executor="false" --http_credentials="/tmp/Endpoint_SlaveEndpointTest_UnauthorizedRequest_1_0tEVHP/http_credentials"
--image_provisioner_backend="copy" --initialize_driver_logging="true" --isolation="posix/cpu,posix/mem"
--launcher="posix" --launcher_dir="/mesos/mesos-1.1.0/_build/src" --logbufsecs="0" --logging_level="INFO"
--max_completed_executors_per_framework="150" --oversubscribed_resources_interval="15secs"
--perf_duration="10secs" --perf_interval="1mins" --qos_correction_interval_min="0ns" --quiet="false"
--recover="reconnect" --recovery_timeout="15mins" --registration_backoff_factor="10ms" --resources="cpus:2;gpus:0;mem:1024;disk:1024;ports:[31000-32000]"
--revocable_cpu_low_priority="true" --runtime_dir="/tmp/Endpoint_SlaveEndpointTest_UnauthorizedRequest_1_0tEVHP"
--sandbox_directory="/mnt/mesos/sandbox" --strict="true" --switch_user="true" --systemd_enable_support="true"
--systemd_runtime_directory="/run/systemd/system" --version="false" --work_dir="/tmp/Endpoint_SlaveEndpointTest_UnauthorizedRequest_1_CrcCRE"
I1025 21:42:52.116377 28907 credentials.hpp:86] Loading credential for authentication from
'/tmp/Endpoint_SlaveEndpointTest_UnauthorizedRequest_1_0tEVHP/credential'
I1025 21:42:52.116580 28907 slave.cpp:346] Agent using credential for: test-principal
I1025 21:42:52.116607 28907 credentials.hpp:37] Loading credentials for authentication from
'/tmp/Endpoint_SlaveEndpointTest_UnauthorizedRequest_1_0tEVHP/http_credentials'
I1025 21:42:52.116904 28907 http.cpp:887] Using default 'basic' HTTP authenticator for realm
'mesos-agent-readonly'
I1025 21:42:52.117045 28907 http.cpp:887] Using default 'basic' HTTP authenticator for realm
'mesos-agent-readwrite'
I1025 21:42:52.118513 28907 slave.cpp:533] Agent resources: cpus(*):2; mem(*):1024; disk(*):1024;
ports(*):[31000-32000]
I1025 21:42:52.118610 28907 slave.cpp:541] Agent attributes: [  ]
I1025 21:42:52.118626 28907 slave.cpp:546] Agent hostname: f8fcbeec1375
I1025 21:42:52.120208 28912 state.cpp:57] Recovering state from '/tmp/Endpoint_SlaveEndpointTest_UnauthorizedRequest_1_CrcCRE/meta'
I1025 21:42:52.120301 28907 process.cpp:3377] Handling HTTP event for process 'slave(624)'
with path: '/slave(624)/monitor/statistics.json'
I1025 21:42:52.121026 28903 status_update_manager.cpp:203] Recovering status update manager
I1025 21:42:52.121444 28903 containerizer.cpp:555] Recovering containerizer
I1025 21:42:52.121572 28909 http.cpp:839] Authorizing principal 'test-principal' to GET the
'/monitor/statistics.json' endpoint
I1025 21:42:52.122962 28906 provisioner.cpp:253] Provisioner recovery complete
I1025 21:42:52.123404 28911 slave.cpp:5281] Finished recovery
I1025 21:42:52.124033 28911 slave.cpp:5455] Querying resource estimator for oversubscribable
resources
I1025 21:42:52.124300 28904 slave.cpp:5469] Received oversubscribable resources {} from the
resource estimator
I1025 21:42:52.124388 28904 slave.cpp:787] Agent terminating
[       OK ] Endpoint/SlaveEndpointTest.UnauthorizedRequest/1 (21 ms)
[ RUN      ] Endpoint/SlaveEndpointTest.UnauthorizedRequest/2
I1025 21:42:52.133548 28882 containerizer.cpp:200] Using isolation: posix/cpu,posix/mem,filesystem/posix,network/cni
W1025 21:42:52.134155 28882 backend.cpp:75] Failed to create 'aufs' backend: AufsBackend requires
root privileges, but is running as user mesos
W1025 21:42:52.134308 28882 backend.cpp:75] Failed to create 'bind' backend: BindBackend requires
root privileges
I1025 21:42:52.137586 28908 slave.cpp:208] Mesos agent started on (625)@172.17.0.2:54619
I1025 21:42:52.137631 28908 slave.cpp:209] Flags at startup: --acls="" --appc_simple_discovery_uri_prefix="http://"
--appc_store_dir="/tmp/mesos/store/appc" --authenticate_http_readonly="true" --authenticate_http_readwrite="true"
--authenticatee="crammd5" --authentication_backoff_factor="1secs" --authorizer="local" --cgroups_cpu_enable_pids_and_tids_count="false"
--cgroups_enable_cfs="false" --cgroups_hierarchy="/sys/fs/cgroup" --cgroups_limit_swap="false"
--cgroups_root="mesos" --container_disk_watch_interval="15secs" --containerizers="mesos" --credential="/tmp/Endpoint_SlaveEndpointTest_UnauthorizedRequest_2_82H3hx/credential"
--default_role="*" --disk_watch_interval="1mins" --docker="docker" --docker_kill_orphans="true"
--docker_registry="https://registry-1.docker.io" --docker_remove_delay="6hrs" --docker_socket="/var/run/docker.sock"
--docker_stop_timeout="0ns" --docker_store_dir="/tmp/mesos/store/docker" --docker_volume_checkpoint_dir="/var/run/mesos/isolators/docker/volume"
--enforce_container_disk_quota="false" --executor_registration_timeout="1mins" --executor_shutdown_grace_period="5secs"
--fetcher_cache_dir="/tmp/Endpoint_SlaveEndpointTest_UnauthorizedRequest_2_82H3hx/fetch" --fetcher_cache_size="2GB"
--frameworks_home="" --gc_delay="1weeks" --gc_disk_headroom="0.1" --hadoop_home="" --help="false"
--hostname_lookup="true" --http_authenticators="basic" --http_command_executor="false" --http_credentials="/tmp/Endpoint_SlaveEndpointTest_UnauthorizedRequest_2_82H3hx/http_credentials"
--image_provisioner_backend="copy" --initialize_driver_logging="true" --isolation="posix/cpu,posix/mem"
--launcher="posix" --launcher_dir="/mesos/mesos-1.1.0/_build/src" --logbufsecs="0" --logging_level="INFO"
--max_completed_executors_per_framework="150" --oversubscribed_resources_interval="15secs"
--perf_duration="10secs" --perf_interval="1mins" --qos_correction_interval_min="0ns" --quiet="false"
--recover="reconnect" --recovery_timeout="15mins" --registration_backoff_factor="10ms" --resources="cpus:2;gpus:0;mem:1024;disk:1024;ports:[31000-32000]"
--revocable_cpu_low_priority="true" --runtime_dir="/tmp/Endpoint_SlaveEndpointTest_UnauthorizedRequest_2_82H3hx"
--sandbox_directory="/mnt/mesos/sandbox" --strict="true" --switch_user="true" --systemd_enable_support="true"
--systemd_runtime_directory="/run/systemd/system" --version="false" --work_dir="/tmp/Endpoint_SlaveEndpointTest_UnauthorizedRequest_2_krS8nm"
I1025 21:42:52.138293 28908 credentials.hpp:86] Loading credential for authentication from
'/tmp/Endpoint_SlaveEndpointTest_UnauthorizedRequest_2_82H3hx/credential'
I1025 21:42:52.138473 28908 slave.cpp:346] Agent using credential for: test-principal
I1025 21:42:52.138504 28908 credentials.hpp:37] Loading credentials for authentication from
'/tmp/Endpoint_SlaveEndpointTest_UnauthorizedRequest_2_82H3hx/http_credentials'
I1025 21:42:52.138766 28908 http.cpp:887] Using default 'basic' HTTP authenticator for realm
'mesos-agent-readonly'
I1025 21:42:52.138913 28908 http.cpp:887] Using default 'basic' HTTP authenticator for realm
'mesos-agent-readwrite'
I1025 21:42:52.140172 28908 slave.cpp:533] Agent resources: cpus(*):2; mem(*):1024; disk(*):1024;
ports(*):[31000-32000]
I1025 21:42:52.140270 28908 slave.cpp:541] Agent attributes: [  ]
I1025 21:42:52.140293 28908 slave.cpp:546] Agent hostname: f8fcbeec1375
I1025 21:42:52.141618 28903 state.cpp:57] Recovering state from '/tmp/Endpoint_SlaveEndpointTest_UnauthorizedRequest_2_krS8nm/meta'
I1025 21:42:52.141708 28908 process.cpp:3377] Handling HTTP event for process 'slave(625)'
with path: '/slave(625)/containers'
I1025 21:42:52.142272 28911 status_update_manager.cpp:203] Recovering status update manager
I1025 21:42:52.142449 28901 containerizer.cpp:555] Recovering containerizer
I1025 21:42:52.142894 28907 http.cpp:839] Authorizing principal 'test-principal' to GET the
'/containers' endpoint
I1025 21:42:52.143862 28905 provisioner.cpp:253] Provisioner recovery complete
I1025 21:42:52.144505 28910 slave.cpp:5281] Finished recovery
I1025 21:42:52.144949 28910 slave.cpp:5455] Querying resource estimator for oversubscribable
resources
I1025 21:42:52.145283 28910 slave.cpp:787] Agent terminating
[       OK ] Endpoint/SlaveEndpointTest.UnauthorizedRequest/2 (21 ms)
[ RUN      ] Endpoint/SlaveEndpointTest.NoAuthorizer/0
I1025 21:42:52.155459 28882 containerizer.cpp:200] Using isolation: posix/cpu,posix/mem,filesystem/posix,network/cni
W1025 21:42:52.155932 28882 backend.cpp:75] Failed to create 'aufs' backend: AufsBackend requires
root privileges, but is running as user mesos
W1025 21:42:52.156059 28882 backend.cpp:75] Failed to create 'bind' backend: BindBackend requires
root privileges
I1025 21:42:52.157168 28882 cluster.cpp:435] Creating default 'local' authorizer
I1025 21:42:52.158545 28903 slave.cpp:208] Mesos agent started on (626)@172.17.0.2:54619
I1025 21:42:52.158578 28903 slave.cpp:209] Flags at startup: --acls="" --appc_simple_discovery_uri_prefix="http://"
--appc_store_dir="/tmp/mesos/store/appc" --authenticate_http_readonly="true" --authenticate_http_readwrite="true"
--authenticatee="crammd5" --authentication_backoff_factor="1secs" --authorizer="local" --cgroups_cpu_enable_pids_and_tids_count="false"
--cgroups_enable_cfs="false" --cgroups_hierarchy="/sys/fs/cgroup" --cgroups_limit_swap="false"
--cgroups_root="mesos" --container_disk_watch_interval="15secs" --containerizers="mesos" --credential="/tmp/Endpoint_SlaveEndpointTest_NoAuthorizer_0_uSM85e/credential"
--default_role="*" --disk_watch_interval="1mins" --docker="docker" --docker_kill_orphans="true"
--docker_registry="https://registry-1.docker.io" --docker_remove_delay="6hrs" --docker_socket="/var/run/docker.sock"
--docker_stop_timeout="0ns" --docker_store_dir="/tmp/mesos/store/docker" --docker_volume_checkpoint_dir="/var/run/mesos/isolators/docker/volume"
--enforce_container_disk_quota="false" --executor_registration_timeout="1mins" --executor_shutdown_grace_period="5secs"
--fetcher_cache_dir="/tmp/Endpoint_SlaveEndpointTest_NoAuthorizer_0_uSM85e/fetch" --fetcher_cache_size="2GB"
--frameworks_home="" --gc_delay="1weeks" --gc_disk_headroom="0.1" --hadoop_home="" --help="false"
--hostname_lookup="true" --http_authenticators="basic" --http_command_executor="false" --http_credentials="/tmp/Endpoint_SlaveEndpointTest_NoAuthorizer_0_uSM85e/http_credentials"
--image_provisioner_backend="copy" --initialize_driver_logging="true" --isolation="posix/cpu,posix/mem"
--launcher="posix" --launcher_dir="/mesos/mesos-1.1.0/_build/src" --logbufsecs="0" --logging_level="INFO"
--max_completed_executors_per_framework="150" --oversubscribed_resources_interval="15secs"
--perf_duration="10secs" --perf_interval="1mins" --qos_correction_interval_min="0ns" --quiet="false"
--recover="reconnect" --recovery_timeout="15mins" --registration_backoff_factor="10ms" --resources="cpus:2;gpus:0;mem:1024;disk:1024;ports:[31000-32000]"
--revocable_cpu_low_priority="true" --runtime_dir="/tmp/Endpoint_SlaveEndpointTest_NoAuthorizer_0_uSM85e"
--sandbox_directory="/mnt/mesos/sandbox" --strict="true" --switch_user="true" --systemd_enable_support="true"
--systemd_runtime_directory="/run/systemd/system" --version="false" --work_dir="/tmp/Endpoint_SlaveEndpointTest_NoAuthorizer_0_AULH83"
I1025 21:42:52.158987 28903 credentials.hpp:86] Loading credential for authentication from
'/tmp/Endpoint_SlaveEndpointTest_NoAuthorizer_0_uSM85e/credential'
I1025 21:42:52.159140 28903 slave.cpp:346] Agent using credential for: test-principal
I1025 21:42:52.159164 28903 credentials.hpp:37] Loading credentials for authentication from
'/tmp/Endpoint_SlaveEndpointTest_NoAuthorizer_0_uSM85e/http_credentials'
I1025 21:42:52.159396 28903 http.cpp:887] Using default 'basic' HTTP authenticator for realm
'mesos-agent-readonly'
I1025 21:42:52.159559 28903 http.cpp:887] Using default 'basic' HTTP authenticator for realm
'mesos-agent-readwrite'
I1025 21:42:52.160492 28903 slave.cpp:533] Agent resources: cpus(*):2; mem(*):1024; disk(*):1024;
ports(*):[31000-32000]
I1025 21:42:52.160563 28903 slave.cpp:541] Agent attributes: [  ]
I1025 21:42:52.160578 28903 slave.cpp:546] Agent hostname: f8fcbeec1375
I1025 21:42:52.162113 28905 state.cpp:57] Recovering state from '/tmp/Endpoint_SlaveEndpointTest_NoAuthorizer_0_AULH83/meta'
I1025 21:42:52.162197 28903 process.cpp:3377] Handling HTTP event for process 'slave(626)'
with path: '/slave(626)/monitor/statistics'
I1025 21:42:52.163080 28915 status_update_manager.cpp:203] Recovering status update manager
I1025 21:42:52.163261 28901 containerizer.cpp:555] Recovering containerizer
I1025 21:42:52.163700 28902 http.cpp:839] Authorizing principal 'test-principal' to GET the
'/monitor/statistics' endpoint
I1025 21:42:52.164345 28912 provisioner.cpp:253] Provisioner recovery complete
I1025 21:42:52.164928 28908 slave.cpp:5281] Finished recovery
I1025 21:42:52.165472 28908 slave.cpp:5455] Querying resource estimator for oversubscribable
resources
I1025 21:42:52.165647 28910 slave.cpp:5469] Received oversubscribable resources {} from the
resource estimator
I1025 21:42:52.166694 28914 slave.cpp:787] Agent terminating
[       OK ] Endpoint/SlaveEndpointTest.NoAuthorizer/0 (20 ms)
[ RUN      ] Endpoint/SlaveEndpointTest.NoAuthorizer/1
I1025 21:42:52.176256 28882 containerizer.cpp:200] Using isolation: posix/cpu,posix/mem,filesystem/posix,network/cni
W1025 21:42:52.176898 28882 backend.cpp:75] Failed to create 'aufs' backend: AufsBackend requires
root privileges, but is running as user mesos
W1025 21:42:52.177122 28882 backend.cpp:75] Failed to create 'bind' backend: BindBackend requires
root privileges
I1025 21:42:52.178764 28882 cluster.cpp:435] Creating default 'local' authorizer
I1025 21:42:52.180177 28906 slave.cpp:208] Mesos agent started on (627)@172.17.0.2:54619
I1025 21:42:52.180223 28906 slave.cpp:209] Flags at startup: --acls="" --appc_simple_discovery_uri_prefix="http://"
--appc_store_dir="/tmp/mesos/store/appc" --authenticate_http_readonly="true" --authenticate_http_readwrite="true"
--authenticatee="crammd5" --authentication_backoff_factor="1secs" --authorizer="local" --cgroups_cpu_enable_pids_and_tids_count="false"
--cgroups_enable_cfs="false" --cgroups_hierarchy="/sys/fs/cgroup" --cgroups_limit_swap="false"
--cgroups_root="mesos" --container_disk_watch_interval="15secs" --containerizers="mesos" --credential="/tmp/Endpoint_SlaveEndpointTest_NoAuthorizer_1_E2Bo7W/credential"
--default_role="*" --disk_watch_interval="1mins" --docker="docker" --docker_kill_orphans="true"
--docker_registry="https://registry-1.docker.io" --docker_remove_delay="6hrs" --docker_socket="/var/run/docker.sock"
--docker_stop_timeout="0ns" --docker_store_dir="/tmp/mesos/store/docker" --docker_volume_checkpoint_dir="/var/run/mesos/isolators/docker/volume"
--enforce_container_disk_quota="false" --executor_registration_timeout="1mins" --executor_shutdown_grace_period="5secs"
--fetcher_cache_dir="/tmp/Endpoint_SlaveEndpointTest_NoAuthorizer_1_E2Bo7W/fetch" --fetcher_cache_size="2GB"
--frameworks_home="" --gc_delay="1weeks" --gc_disk_headroom="0.1" --hadoop_home="" --help="false"
--hostname_lookup="true" --http_authenticators="basic" --http_command_executor="false" --http_credentials="/tmp/Endpoint_SlaveEndpointTest_NoAuthorizer_1_E2Bo7W/http_credentials"
--image_provisioner_backend="copy" --initialize_driver_logging="true" --isolation="posix/cpu,posix/mem"
--launcher="posix" --launcher_dir="/mesos/mesos-1.1.0/_build/src" --logbufsecs="0" --logging_level="INFO"
--max_completed_executors_per_framework="150" --oversubscribed_resources_interval="15secs"
--perf_duration="10secs" --perf_interval="1mins" --qos_correction_interval_min="0ns" --quiet="false"
--recover="reconnect" --recovery_timeout="15mins" --registration_backoff_factor="10ms" --resources="cpus:2;gpus:0;mem:1024;disk:1024;ports:[31000-32000]"
--revocable_cpu_low_priority="true" --runtime_dir="/tmp/Endpoint_SlaveEndpointTest_NoAuthorizer_1_E2Bo7W"
--sandbox_directory="/mnt/mesos/sandbox" --strict="true" --switch_user="true" --systemd_enable_support="true"
--systemd_runtime_directory="/run/systemd/system" --version="false" --work_dir="/tmp/Endpoint_SlaveEndpointTest_NoAuthorizer_1_45TF6L"
I1025 21:42:52.180903 28906 credentials.hpp:86] Loading credential for authentication from
'/tmp/Endpoint_SlaveEndpointTest_NoAuthorizer_1_E2Bo7W/credential'
I1025 21:42:52.181084 28906 slave.cpp:346] Agent using credential for: test-principal
I1025 21:42:52.181116 28906 credentials.hpp:37] Loading credentials for authentication from
'/tmp/Endpoint_SlaveEndpointTest_NoAuthorizer_1_E2Bo7W/http_credentials'
I1025 21:42:52.181382 28906 http.cpp:887] Using default 'basic' HTTP authenticator for realm
'mesos-agent-readonly'
I1025 21:42:52.181627 28906 http.cpp:887] Using default 'basic' HTTP authenticator for realm
'mesos-agent-readwrite'
I1025 21:42:52.182850 28906 slave.cpp:533] Agent resources: cpus(*):2; mem(*):1024; disk(*):1024;
ports(*):[31000-32000]
I1025 21:42:52.182950 28906 slave.cpp:541] Agent attributes: [  ]
I1025 21:42:52.182976 28906 slave.cpp:546] Agent hostname: f8fcbeec1375
I1025 21:42:52.184442 28902 state.cpp:57] Recovering state from '/tmp/Endpoint_SlaveEndpointTest_NoAuthorizer_1_45TF6L/meta'
I1025 21:42:52.184504 28906 process.cpp:3377] Handling HTTP event for process 'slave(627)'
with path: '/slave(627)/monitor/statistics.json'
I1025 21:42:52.185026 28909 status_update_manager.cpp:203] Recovering status update manager
I1025 21:42:52.185214 28903 containerizer.cpp:555] Recovering containerizer
I1025 21:42:52.185623 28900 http.cpp:839] Authorizing principal 'test-principal' to GET the
'/monitor/statistics.json' endpoint
I1025 21:42:52.186720 28902 provisioner.cpp:253] Provisioner recovery complete
I1025 21:42:52.187227 28900 slave.cpp:5281] Finished recovery
I1025 21:42:52.187674 28900 slave.cpp:5455] Querying resource estimator for oversubscribable
resources
I1025 21:42:52.188035 28909 slave.cpp:5469] Received oversubscribable resources {} from the
resource estimator
I1025 21:42:52.189045 28903 slave.cpp:787] Agent terminating
[       OK ] Endpoint/SlaveEndpointTest.NoAuthorizer/1 (23 ms)
[ RUN      ] Endpoint/SlaveEndpointTest.NoAuthorizer/2
I1025 21:42:52.199908 28882 containerizer.cpp:200] Using isolation: posix/cpu,posix/mem,filesystem/posix,network/cni
W1025 21:42:52.200608 28882 backend.cpp:75] Failed to create 'aufs' backend: AufsBackend requires
root privileges, but is running as user mesos
W1025 21:42:52.200785 28882 backend.cpp:75] Failed to create 'bind' backend: BindBackend requires
root privileges
I1025 21:42:52.202406 28882 cluster.cpp:435] Creating default 'local' authorizer
I1025 21:42:52.204074 28910 slave.cpp:208] Mesos agent started on (628)@172.17.0.2:54619
I1025 21:42:52.204120 28910 slave.cpp:209] Flags at startup: --acls="" --appc_simple_discovery_uri_prefix="http://"
--appc_store_dir="/tmp/mesos/store/appc" --authenticate_http_readonly="true" --authenticate_http_readwrite="true"
--authenticatee="crammd5" --authentication_backoff_factor="1secs" --authorizer="local" --cgroups_cpu_enable_pids_and_tids_count="false"
--cgroups_enable_cfs="false" --cgroups_hierarchy="/sys/fs/cgroup" --cgroups_limit_swap="false"
--cgroups_root="mesos" --container_disk_watch_interval="15secs" --containerizers="mesos" --credential="/tmp/Endpoint_SlaveEndpointTest_NoAuthorizer_2_UY7NnF/credential"
--default_role="*" --disk_watch_interval="1mins" --docker="docker" --docker_kill_orphans="true"
--docker_registry="https://registry-1.docker.io" --docker_remove_delay="6hrs" --docker_socket="/var/run/docker.sock"
--docker_stop_timeout="0ns" --docker_store_dir="/tmp/mesos/store/docker" --docker_volume_checkpoint_dir="/var/run/mesos/isolators/docker/volume"
--enforce_container_disk_quota="false" --executor_registration_timeout="1mins" --executor_shutdown_grace_period="5secs"
--fetcher_cache_dir="/tmp/Endpoint_SlaveEndpointTest_NoAuthorizer_2_UY7NnF/fetch" --fetcher_cache_size="2GB"
--frameworks_home="" --gc_delay="1weeks" --gc_disk_headroom="0.1" --hadoop_home="" --help="false"
--hostname_lookup="true" --http_authenticators="basic" --http_command_executor="false" --http_credentials="/tmp/Endpoint_SlaveEndpointTest_NoAuthorizer_2_UY7NnF/http_credentials"
--image_provisioner_backend="copy" --initialize_driver_logging="true" --isolation="posix/cpu,posix/mem"
--launcher="posix" --launcher_dir="/mesos/mesos-1.1.0/_build/src" --logbufsecs="0" --logging_level="INFO"
--max_completed_executors_per_framework="150" --oversubscribed_resources_interval="15secs"
--perf_duration="10secs" --perf_interval="1mins" --qos_correction_interval_min="0ns" --quiet="false"
--recover="reconnect" --recovery_timeout="15mins" --registration_backoff_factor="10ms" --resources="cpus:2;gpus:0;mem:1024;disk:1024;ports:[31000-32000]"
--revocable_cpu_low_priority="true" --runtime_dir="/tmp/Endpoint_SlaveEndpointTest_NoAuthorizer_2_UY7NnF"
--sandbox_directory="/mnt/mesos/sandbox" --strict="true" --switch_user="true" --systemd_enable_support="true"
--systemd_runtime_directory="/run/systemd/system" --version="false" --work_dir="/tmp/Endpoint_SlaveEndpointTest_NoAuthorizer_2_0pNeju"
I1025 21:42:52.204632 28910 credentials.hpp:86] Loading credential for authentication from
'/tmp/Endpoint_SlaveEndpointTest_NoAuthorizer_2_UY7NnF/credential'
I1025 21:42:52.204741 28910 slave.cpp:346] Agent using credential for: test-principal
I1025 21:42:52.204761 28910 credentials.hpp:37] Loading credentials for authentication from
'/tmp/Endpoint_SlaveEndpointTest_NoAuthorizer_2_UY7NnF/http_credentials'
I1025 21:42:52.205008 28910 http.cpp:887] Using default 'basic' HTTP authenticator for realm
'mesos-agent-readonly'
I1025 21:42:52.205133 28910 http.cpp:887] Using default 'basic' HTTP authenticator for realm
'mesos-agent-readwrite'
I1025 21:42:52.206444 28910 slave.cpp:533] Agent resources: cpus(*):2; mem(*):1024; disk(*):1024;
ports(*):[31000-32000]
I1025 21:42:52.206539 28910 slave.cpp:541] Agent attributes: [  ]
I1025 21:42:52.206555 28910 slave.cpp:546] Agent hostname: f8fcbeec1375
I1025 21:42:52.208145 28907 state.cpp:57] Recovering state from '/tmp/Endpoint_SlaveEndpointTest_NoAuthorizer_2_0pNeju/meta'
I1025 21:42:52.208178 28910 process.cpp:3377] Handling HTTP event for process 'slave(628)'
with path: '/slave(628)/containers'
I1025 21:42:52.208669 28902 status_update_manager.cpp:203] Recovering status update manager
I1025 21:42:52.209040 28903 containerizer.cpp:555] Recovering containerizer
I1025 21:42:52.209385 28915 http.cpp:839] Authorizing principal 'test-principal' to GET the
'/containers' endpoint
I1025 21:42:52.210505 28912 provisioner.cpp:253] Provisioner recovery complete
I1025 21:42:52.210786 28906 slave.cpp:5281] Finished recovery
I1025 21:42:52.211344 28906 slave.cpp:5455] Querying resource estimator for oversubscribable
resources
I1025 21:42:52.211494 28909 slave.cpp:5469] Received oversubscribable resources {} from the
resource estimator
I1025 21:42:52.212535 28912 slave.cpp:787] Agent terminating
[       OK ] Endpoint/SlaveEndpointTest.NoAuthorizer/2 (23 ms)
[----------] 9 tests from Endpoint/SlaveEndpointTest (203 ms total)

[----------] Global test environment tear-down
[==========] 1356 tests from 154 test cases ran. (505201 ms total)
[  PASSED  ] 1355 tests.
[  FAILED  ] 1 test, listed below:
[  FAILED  ] SlaveRecoveryTest/0.ReconnectExecutor, where TypeParam = mesos::internal::slave::MesosContainerizer

 1 FAILED TEST
  YOU HAVE 5 DISABLED TESTS

make[4]: *** [check-local] Error 1
make[4]: Leaving directory `/mesos/mesos-1.1.0/_build/src'
make[3]: *** [check-am] Error 2
make[3]: Leaving directory `/mesos/mesos-1.1.0/_build/src'
make[2]: *** [check] Error 2
make[2]: Leaving directory `/mesos/mesos-1.1.0/_build/src'
make[1]: *** [check-recursive] Error 1
make[1]: Leaving directory `/mesos/mesos-1.1.0/_build'
make: *** [distcheck] Error 1
+ docker rmi mesos-1477429441-7002
Untagged: mesos-1477429441-7002:latest
Deleted: sha256:27edd712d5d7e25a6edfe81a2dbbc52216b25dee763185c8aba2ea83dfedd4e6
Deleted: sha256:633fa0919e4b894444ce94ad72dc8e0cb97d66c8e513fcaa6e7c983f30ee4368
Deleted: sha256:68b582f5494194c04a14d887afa5f17c82f2a672ddd55355499625940df29c10
Deleted: sha256:f388794d25589073449b8dc0085fe5911519935ac3e53c97c34ae8d015308a42
Deleted: sha256:cfe737643d504d3b68d6f448fb63d5b59faed41e902f3e717ae7fa4f25d3a717
Deleted: sha256:d3d229d0bb6bfba5b216e3120e67b62c847c2145cfc654007a7769afbbce06ab
Deleted: sha256:47410b52601ca3b68dfe024eed6edf0ca880c4cba0c97672152782178571e94d
Deleted: sha256:bfd9f464a3177e79989c93c82066d860ce35d53876e4530eca8ba85d86b389fc
Deleted: sha256:4c1a28de14d689a36968d3338c969a4ea7d36e4e4a8bb378168a867e16e22c38
Deleted: sha256:bc8828b2babd81bbfeec1e261fb92c10ad2351d569608205a966600213f80eb3
Deleted: sha256:65e90bf898bcd2b8a732ed7cd2fd091dce5aba6c9a9526860b6db93e64a91035
Deleted: sha256:8708c65b77b175359116f1b158146fe3bc775ba53f8eef00cb6eb54a92da5efa
Deleted: sha256:ff04af562a0317b6e3badac2ba4adee81cb97e83e910ba624bb8a7f5e7a7cded
Deleted: sha256:c874969e11f804685028e6267fb32959f4c046073674ed171c2e23c5e4f95188
Deleted: sha256:2abdec59a70d4ac0a9bd614f3d338facfe1ce903fa8b6a486711c55453fbe7e0
Deleted: sha256:3acf95805b82e1e45d7d6e26916bc228d667f87e935236b71b36d17ffcdf988b
Deleted: sha256:eb747b1ffca3347e0b1a811cadbfdfb553972bcd869ade7efd47799c18141cf9
Deleted: sha256:1a01ff61415928148f519def0fccdc7dd483bd169574c9cb05a97fedc88618e5
Deleted: sha256:34e7f4032e93986ca40863411b2ead8d0eeed43da12115bb0e2efc970d640d87
Deleted: sha256:608ee81b5f2d468dc295ddd0c52459dac63f08dc22e9d8a4402b3bdb6362f4c7
Deleted: sha256:843c2287b4580d4cecd67f511c1dc72b89e88f5def365807cad660d952cb0267
Deleted: sha256:5f972ecbc336a20e9badbe458788f3e20de5aa2a5202373d048821e302f8c793
Deleted: sha256:c5216f92fb265efc4b6bd2421a72ce2bc9d8425109af443f014d180ce40df02c
Deleted: sha256:aaabe6de3ab50886d785865bce3e420b3adf553dcd1b3d6bc972f44a8d4694b0
Build step 'Execute shell' marked build as failure

Mime
View raw message