mesos-builds mailing list archives

Site index · List index
Message view « Date » · « Thread »
Top « Date » · « Thread »
From Apache Jenkins Server <jenk...@builds.apache.org>
Subject Build failed in Jenkins: Mesos » autotools,clang,--verbose,GLOG_v=1 MESOS_VERBOSE=1,ubuntu:14.04,(docker||Hadoop)&&(!ubuntu-us1)&&(!ubuntu-6) #2845
Date Fri, 28 Oct 2016 21:40:26 GMT
See <https://builds.apache.org/job/Mesos/BUILDTOOL=autotools,COMPILER=clang,CONFIGURATION=--verbose,ENVIRONMENT=GLOG_v=1%20MESOS_VERBOSE=1,OS=ubuntu%3A14.04,label_exp=(docker%7C%7CHadoop)&&(!ubuntu-us1)&&(!ubuntu-6)/2845/changes>

Changes:

[xujyan] Fixed master that leaks empty entries in its hashmaps.

[xujyan] Added MESOS-4975 to CHANGELOG for 1.0.2.

[vinodkone] Fixed duplicate framework ids in "unregistered_frameworks".

[vinodkone] Added MESOS-4973 and MESOS-6461 to 1.0.2 CHANGELOG.

------------------------------------------
[...truncated 118514 lines...]
I1028 21:39:22.598239 26706 resources.cpp:572] Parsing resources as JSON failed: cpus:8;mem:4096
Trying semicolon-delimited string format instead
I1028 21:39:22.598639 26706 slave.cpp:519] Agent resources: cpus(*):8; mem(*):4096; disk(*):3.70122e+06;
ports(*):[31000-32000]
I1028 21:39:22.598723 26706 slave.cpp:527] Agent attributes: [  ]
I1028 21:39:22.598734 26706 slave.cpp:532] Agent hostname: 885c22ee76ba
I1028 21:39:22.599190 26693 sched.cpp:330] New master detected at master@172.17.0.3:58880
I1028 21:39:22.599299 26693 sched.cpp:396] Authenticating with master master@172.17.0.3:58880
I1028 21:39:22.599323 26693 sched.cpp:403] Using default CRAM-MD5 authenticatee
I1028 21:39:22.599436 26705 hierarchical.cpp:1535] No allocations performed
I1028 21:39:22.599504 26705 hierarchical.cpp:1170] Performed allocation for 0 agents in 128728ns
I1028 21:39:22.599540 26707 authenticatee.cpp:121] Creating new client SASL connection
I1028 21:39:22.599815 26704 master.cpp:5909] Authenticating scheduler-c6cdcae8-79c6-4be0-9e2b-359d364c5488@172.17.0.3:58880
I1028 21:39:22.599959 26694 authenticator.cpp:414] Starting authentication session for crammd5_authenticatee(648)@172.17.0.3:58880
I1028 21:39:22.600267 26705 authenticator.cpp:98] Creating new server SASL connection
I1028 21:39:22.600469 26700 state.cpp:57] Recovering state from '/tmp/ReservationTest_IncompatibleCheckpointedResources_MxUf7z/meta'
I1028 21:39:22.600625 26706 authenticatee.cpp:213] Received SASL authentication mechanisms:
CRAM-MD5
I1028 21:39:22.600658 26706 authenticatee.cpp:239] Attempting to authenticate with mechanism
'CRAM-MD5'
I1028 21:39:22.600741 26703 status_update_manager.cpp:200] Recovering status update manager
I1028 21:39:22.600903 26708 authenticator.cpp:204] Received SASL authentication start
I1028 21:39:22.600972 26708 authenticator.cpp:326] Authentication requires more steps
I1028 21:39:22.601096 26694 authenticatee.cpp:259] Received SASL authentication step
I1028 21:39:22.601127 26699 slave.cpp:4810] Finished recovery
I1028 21:39:22.601227 26694 authenticator.cpp:232] Received SASL authentication step
I1028 21:39:22.601261 26694 auxprop.cpp:109] Request to lookup properties for user: 'test-principal'
realm: '885c22ee76ba' server FQDN: '885c22ee76ba' SASL_AUXPROP_VERIFY_AGAINST_HASH: false
SASL_AUXPROP_OVERRIDE: false SASL_AUXPROP_AUTHZID: false 
I1028 21:39:22.601277 26694 auxprop.cpp:181] Looking up auxiliary property '*userPassword'
I1028 21:39:22.601321 26694 auxprop.cpp:181] Looking up auxiliary property '*cmusaslsecretCRAM-MD5'
I1028 21:39:22.601346 26694 auxprop.cpp:109] Request to lookup properties for user: 'test-principal'
realm: '885c22ee76ba' server FQDN: '885c22ee76ba' SASL_AUXPROP_VERIFY_AGAINST_HASH: false
SASL_AUXPROP_OVERRIDE: false SASL_AUXPROP_AUTHZID: true 
I1028 21:39:22.601359 26694 auxprop.cpp:131] Skipping auxiliary property '*userPassword' since
SASL_AUXPROP_AUTHZID == true
I1028 21:39:22.601369 26694 auxprop.cpp:131] Skipping auxiliary property '*cmusaslsecretCRAM-MD5'
since SASL_AUXPROP_AUTHZID == true
I1028 21:39:22.601388 26694 authenticator.cpp:318] Authentication success
I1028 21:39:22.601536 26693 authenticatee.cpp:299] Authentication success
I1028 21:39:22.601574 26704 master.cpp:5939] Successfully authenticated principal 'test-principal'
at scheduler-c6cdcae8-79c6-4be0-9e2b-359d364c5488@172.17.0.3:58880
I1028 21:39:22.601634 26707 authenticator.cpp:432] Authentication session cleanup for crammd5_authenticatee(648)@172.17.0.3:58880
I1028 21:39:22.601814 26699 slave.cpp:4982] Querying resource estimator for oversubscribable
resources
I1028 21:39:22.601953 26694 sched.cpp:502] Successfully authenticated with master master@172.17.0.3:58880
I1028 21:39:22.601984 26694 sched.cpp:820] Sending SUBSCRIBE call to master@172.17.0.3:58880
I1028 21:39:22.602134 26694 sched.cpp:853] Will retry registration in 1.055598001secs if necessary
I1028 21:39:22.602161 26698 slave.cpp:895] New master detected at master@172.17.0.3:58880
I1028 21:39:22.602165 26695 status_update_manager.cpp:174] Pausing sending status updates
I1028 21:39:22.602195 26698 slave.cpp:954] Authenticating with master master@172.17.0.3:58880
I1028 21:39:22.602257 26698 slave.cpp:965] Using default CRAM-MD5 authenticatee
I1028 21:39:22.602267 26706 master.cpp:2429] Received SUBSCRIBE call for framework 'default'
at scheduler-c6cdcae8-79c6-4be0-9e2b-359d364c5488@172.17.0.3:58880
I1028 21:39:22.602288 26706 master.cpp:1886] Authorizing framework principal 'test-principal'
to receive offers for role 'role'
I1028 21:39:22.602423 26698 slave.cpp:927] Detecting new master
W1028 21:39:38.387270 26698 slave.cpp:1068] Authentication timed out
I1028 21:39:22.602458 26696 authenticatee.cpp:121] Creating new client SASL connection
I1028 21:39:22.602785 26697 master.cpp:2505] Subscribing framework default with checkpointing
disabled and capabilities [  ]
I1028 21:39:23.658922 26700 sched.cpp:820] Sending SUBSCRIBE call to master@172.17.0.3:58880
I1028 21:39:38.387719 26700 sched.cpp:853] Will retry registration in 2.268966714secs if necessary
I1028 21:39:22.604964 26708 hierarchical.cpp:1535] No allocations performed
I1028 21:39:38.388030 26708 hierarchical.cpp:1170] Performed allocation for 0 agents in 15.783128446secs
W1028 21:39:38.388310 26696 slave.cpp:1013] Failed to authenticate with master master@172.17.0.3:58880:
Authentication discarded
I1028 21:39:38.388842 26708 hierarchical.cpp:269] Added framework b14d26b9-9944-4a41-9bbf-013ab768821c-0000
I1028 21:39:38.388938 26708 hierarchical.cpp:1535] No allocations performed
I1028 21:39:38.388977 26708 hierarchical.cpp:1630] No inverse offers to send out!
I1028 21:39:38.389056 26708 hierarchical.cpp:1170] Performed allocation for 0 agents in 195995ns
I1028 21:39:38.390779 26697 master.cpp:5909] Authenticating (11943)@172.17.0.3:58880
I1028 21:39:38.390951 26701 authenticator.cpp:414] Starting authentication session for crammd5_authenticatee(649)@172.17.0.3:58880
I1028 21:39:38.391257 26697 master.cpp:2429] Received SUBSCRIBE call for framework 'default'
at scheduler-c6cdcae8-79c6-4be0-9e2b-359d364c5488@172.17.0.3:58880
../../src/tests/reservation_tests.cpp:1263: Failure
Actual function call count doesn't match EXPECT_CALL(sched, resourceOffers(&driver, _))...
         Expected: to be called at least once
           Actual: never called - unsatisfied and active
../../src/tests/reservation_tests.cpp:1261: Failure
Actual function call count doesn't match EXPECT_CALL(sched, registered(&driver, _, _))...
         Expected: to be called once
           Actual: never called - unsatisfied and active
I1028 21:39:38.391295 26697 master.cpp:1886] Authorizing framework principal 'test-principal'
to receive offers for role 'role'
I1028 21:39:38.391486 26693 authenticator.cpp:432] Authentication session cleanup for crammd5_authenticatee(649)@172.17.0.3:58880
I1028 21:39:38.391585 26697 master.cpp:1284] Framework b14d26b9-9944-4a41-9bbf-013ab768821c-0000
(default) at scheduler-c6cdcae8-79c6-4be0-9e2b-359d364c5488@172.17.0.3:58880 disconnected
I1028 21:39:38.391629 26697 master.cpp:2735] Disconnecting framework b14d26b9-9944-4a41-9bbf-013ab768821c-0000
(default) at scheduler-c6cdcae8-79c6-4be0-9e2b-359d364c5488@172.17.0.3:58880
I1028 21:39:38.391680 26697 master.cpp:2759] Deactivating framework b14d26b9-9944-4a41-9bbf-013ab768821c-0000
(default) at scheduler-c6cdcae8-79c6-4be0-9e2b-359d364c5488@172.17.0.3:58880
I1028 21:39:38.391793 26697 master.cpp:1297] Giving framework b14d26b9-9944-4a41-9bbf-013ab768821c-0000
(default) at scheduler-c6cdcae8-79c6-4be0-9e2b-359d364c5488@172.17.0.3:58880 0ns to failover
I1028 21:39:38.391846 26701 hierarchical.cpp:380] Deactivated framework b14d26b9-9944-4a41-9bbf-013ab768821c-0000
W1028 21:39:38.391994 26697 master.cpp:5936] Failed to authenticate (11943)@172.17.0.3:58880:
Failed to communicate with authenticatee
I1028 21:39:38.392096 26697 master.cpp:2499] Dropping SUBSCRIBE call for framework 'default'
at scheduler-c6cdcae8-79c6-4be0-9e2b-359d364c5488@172.17.0.3:58880: Framework at scheduler-c6cdcae8-79c6-4be0-9e2b-359d364c5488@172.17.0.3:58880
is not authenticated
I1028 21:39:38.393244 26706 master.cpp:5590] Framework failover timeout, removing framework
b14d26b9-9944-4a41-9bbf-013ab768821c-0000 (default) at scheduler-c6cdcae8-79c6-4be0-9e2b-359d364c5488@172.17.0.3:58880
I1028 21:39:38.393285 26706 master.cpp:6325] Removing framework b14d26b9-9944-4a41-9bbf-013ab768821c-0000
(default) at scheduler-c6cdcae8-79c6-4be0-9e2b-359d364c5488@172.17.0.3:58880
I1028 21:39:38.396333 26694 hierarchical.cpp:1535] No allocations performed
I1028 21:39:38.396493 26694 hierarchical.cpp:1630] No inverse offers to send out!
I1028 21:39:38.396903 26694 hierarchical.cpp:1170] Performed allocation for 0 agents in 1.666494ms
I1028 21:39:38.397552 26694 hierarchical.cpp:331] Removed framework b14d26b9-9944-4a41-9bbf-013ab768821c-0000
lt-mesos-tests: ../../3rdparty/libprocess/include/process/dispatch.hpp:229: auto process::dispatch(const
PID<mesos::internal::slave::Slave> &, void (mesos::internal::slave::Slave::*)(const
process::Future<Option<mesos::MasterInfo> > &), process::Future<Option<mesos::MasterInfo>
>)::(anonymous class)::operator()(process::ProcessBase *) const: Assertion `t != nullptr'
failed.
*** Aborted at 1477690778 (unix time) try "date -d @1477690778" if you are using GNU date
***
PC: @     0x2ada7ceaec37 (unknown)
*** SIGABRT (@0x3e800006833) received by PID 26675 (TID 0x2ada86c75700) from PID 26675; stack
trace: ***
I1028 21:39:38.399857 26675 master.cpp:1092] Master terminating
    @     0x2ada7cc6a330 (unknown)
    @     0x2ada7ceaec37 (unknown)
    @     0x2ada7ceb2028 (unknown)
    @     0x2ada7cea7bf6 (unknown)
    @     0x2ada7cea7ca2 (unknown)
I1028 21:39:38.402739 26693 hierarchical.cpp:1535] No allocations performed
I1028 21:39:38.402827 26693 hierarchical.cpp:1170] Performed allocation for 0 agents in 227627ns
[  FAILED  ] ReservationTest.IncompatibleCheckpointedResources (15857 ms)
[ RUN      ] ReservationTest.GoodACLReserveThenUnreserve
    @     0x2ada79bd26a6 _ZZN7process8dispatchIN5mesos8internal5slave5SlaveERKNS_6FutureI6OptionINS1_10MasterInfoEEEES9_EEvRKNS_3PIDIT_EEMSD_FvT0_ET1_ENKUlPNS_11ProcessBaseEE_clESM_
I1028 21:39:38.410835 26675 cluster.cpp:155] Creating default 'local' authorizer
I1028 21:39:38.413882 26675 leveldb.cpp:174] Opened db in 2.493745ms
I1028 21:39:38.414728 26675 leveldb.cpp:181] Compacted db in 820781ns
I1028 21:39:38.414774 26675 leveldb.cpp:196] Created db iterator in 31713ns
I1028 21:39:38.414801 26675 leveldb.cpp:202] Seeked to beginning of db in 12617ns
I1028 21:39:38.414821 26675 leveldb.cpp:271] Iterated through 0 keys in the db in 8773ns
I1028 21:39:38.414870 26675 replica.cpp:779] Replica recovered with log positions 0 ->
0 with 1 holes and 0 unlearned
I1028 21:39:38.415534 26701 recover.cpp:451] Starting replica recovery
I1028 21:39:38.415791 26701 recover.cpp:477] Replica is in EMPTY status
I1028 21:39:38.416623 26701 replica.cpp:673] Replica in EMPTY status received a broadcasted
recover request from (11951)@172.17.0.3:58880
I1028 21:39:38.417222 26705 recover.cpp:197] Received a recover response from a replica in
EMPTY status
I1028 21:39:38.417807 26699 recover.cpp:568] Updating replica status to STARTING
I1028 21:39:38.418576 26704 leveldb.cpp:304] Persisting metadata (8 bytes) to leveldb took
558365ns
I1028 21:39:38.418601 26704 replica.cpp:320] Persisted replica status to STARTING
I1028 21:39:38.418773 26704 recover.cpp:477] Replica is in STARTING status
I1028 21:39:38.419119 26695 master.cpp:375] Master 2266123c-c51f-4717-911e-36c0fe697af1 (885c22ee76ba)
started on 172.17.0.3:58880
I1028 21:39:38.419533 26705 replica.cpp:673] Replica in STARTING status received a broadcasted
recover request from (11952)@172.17.0.3:58880
I1028 21:39:38.419157 26695 master.cpp:377] Flags at startup: --acls="reserve_resources {
  principals {
    values: "test-principal"
  }
  roles {
    type: ANY
  }
}
unreserve_resources {
  principals {
    values: "test-principal"
  }
  reserver_principals {
    values: "test-principal"
  }
}
" --agent_ping_timeout="15secs" --agent_reregister_timeout="10mins" --allocation_interval="5ms"
--allocator="HierarchicalDRF" --authenticate_agents="true" --authenticate_frameworks="true"
--authenticate_http_frameworks="true" --authenticate_http_readonly="true" --authenticate_http_readwrite="true"
--authenticators="crammd5" --authorizers="local" --credentials="/tmp/GmjLmS/credentials" --framework_sorter="drf"
--help="false" --hostname_lookup="true" --http_authenticators="basic" --http_framework_authenticators="basic"
--initialize_driver_logging="true" --log_auto_initialize="true" --logbufsecs="0" --logging_level="INFO"
--max_agent_ping_timeouts="5" --max_completed_frameworks="50" --max_completed_tasks_per_framework="1000"
--quiet="false" --recovery_agent_removal_limit="100%" --registry="replicated_log" --registry_fetch_timeout="1mins"
--registry_store_timeout="100secs" --registry_strict="true" --roles="role" --root_submissions="true"
--user_sorter="drf" --version="false" --webui_dir="/mesos/mesos-1.0.2/_inst/share/mesos/webui"
--work_dir="/tmp/GmjLmS/master" --zk_session_timeout="10secs"
I1028 21:39:38.419724 26695 master.cpp:427] Master only allowing authenticated frameworks
to register
I1028 21:39:38.419739 26695 master.cpp:441] Master only allowing authenticated agents to register
I1028 21:39:38.419749 26695 master.cpp:454] Master only allowing authenticated HTTP frameworks
to register
I1028 21:39:38.419759 26695 credentials.hpp:37] Loading credentials for authentication from
'/tmp/GmjLmS/credentials'
I1028 21:39:38.419927 26696 recover.cpp:197] Received a recover response from a replica in
STARTING status
I1028 21:39:38.420081 26695 master.cpp:499] Using default 'crammd5' authenticator
I1028 21:39:38.420207 26695 http.cpp:883] Using default 'basic' HTTP authenticator for realm
'mesos-master-readonly'
I1028 21:39:38.420243 26701 recover.cpp:568] Updating replica status to VOTING
I1028 21:39:38.420393 26695 http.cpp:883] Using default 'basic' HTTP authenticator for realm
'mesos-master-readwrite'
I1028 21:39:38.420521 26695 http.cpp:883] Using default 'basic' HTTP authenticator for realm
'mesos-master-scheduler'
I1028 21:39:38.420539 26706 leveldb.cpp:304] Persisting metadata (8 bytes) to leveldb took
183052ns
I1028 21:39:38.420560 26706 replica.cpp:320] Persisted replica status to VOTING
I1028 21:39:38.420624 26695 master.cpp:579] Authorization enabled
W1028 21:39:38.420640 26695 master.cpp:642] The '--roles' flag is deprecated. This flag will
be removed in the future. See the Mesos 0.27 upgrade notes for more information
I1028 21:39:38.420706 26703 recover.cpp:582] Successfully joined the Paxos group
I1028 21:39:38.420842 26708 hierarchical.cpp:149] Initialized hierarchical allocator process
I1028 21:39:38.420858 26697 whitelist_watcher.cpp:77] No whitelist given
I1028 21:39:38.420892 26703 recover.cpp:466] Recover process terminated
I1028 21:39:38.423411 26699 master.cpp:1847] The newly elected leader is master@172.17.0.3:58880
with id 2266123c-c51f-4717-911e-36c0fe697af1
I1028 21:39:38.423442 26699 master.cpp:1860] Elected as the leading master!
I1028 21:39:38.423454 26699 master.cpp:1547] Recovering from registrar
I1028 21:39:38.423553 26701 registrar.cpp:332] Recovering registrar
I1028 21:39:38.424041 26698 log.cpp:553] Attempting to start the writer
    @     0x2ada79bd2362 _ZNSt17_Function_handlerIFvPN7process11ProcessBaseEEZNS0_8dispatchIN5mesos8internal5slave5SlaveERKNS0_6FutureI6OptionINS5_10MasterInfoEEEESD_EEvRKNS0_3PIDIT_EEMSH_FvT0_ET1_EUlS2_E_E9_M_invokeERKSt9_Any_dataS2_
I1028 21:39:38.425719 26694 replica.cpp:493] Replica received implicit promise request from
(11956)@172.17.0.3:58880 with proposal 1
I1028 21:39:38.426159 26694 leveldb.cpp:304] Persisting metadata (8 bytes) to leveldb took
413373ns
I1028 21:39:38.426190 26694 replica.cpp:342] Persisted promised to 1
I1028 21:39:38.426270 26705 hierarchical.cpp:1535] No allocations performed
I1028 21:39:38.426364 26705 hierarchical.cpp:1170] Performed allocation for 0 agents in 159329ns
I1028 21:39:38.426986 26698 coordinator.cpp:238] Coordinator attempting to fill missing positions
I1028 21:39:38.428338 26699 replica.cpp:388] Replica received explicit promise request from
(11957)@172.17.0.3:58880 for position 0 with proposal 2
I1028 21:39:38.428583 26699 leveldb.cpp:341] Persisting action (8 bytes) to leveldb took 208375ns
I1028 21:39:38.428616 26699 replica.cpp:712] Persisted action at 0
I1028 21:39:38.429906 26708 replica.cpp:537] Replica received write request for position 0
from (11958)@172.17.0.3:58880
I1028 21:39:38.429980 26708 leveldb.cpp:436] Reading position from leveldb took 48294ns
I1028 21:39:38.430358 26708 leveldb.cpp:341] Persisting action (14 bytes) to leveldb took
343296ns
I1028 21:39:38.430390 26708 replica.cpp:712] Persisted action at 0
I1028 21:39:38.431082 26705 replica.cpp:691] Replica received learned notice for position
0 from @0.0.0.0:0
I1028 21:39:38.431269 26705 leveldb.cpp:341] Persisting action (16 bytes) to leveldb took
160689ns
I1028 21:39:38.431305 26705 replica.cpp:712] Persisted action at 0
I1028 21:39:38.431341 26705 replica.cpp:697] Replica learned NOP action at position 0
I1028 21:39:38.432121 26708 log.cpp:569] Writer started with ending position 0
I1028 21:39:38.432181 26703 hierarchical.cpp:1535] No allocations performed
I1028 21:39:38.432262 26703 hierarchical.cpp:1170] Performed allocation for 0 agents in 129905ns
I1028 21:39:38.433327 26704 leveldb.cpp:436] Reading position from leveldb took 66043ns
I1028 21:39:38.434450 26705 registrar.cpp:365] Successfully fetched the registry (0B) in 10.856192ms
I1028 21:39:38.434597 26705 registrar.cpp:464] Applied 1 operations in 41526ns; attempting
to update the 'registry'
    @     0x2ada7aa3e258 std::function<>::operator()()
I1028 21:39:38.435365 26702 log.cpp:577] Attempting to append 168 bytes to the log
I1028 21:39:38.435554 26695 coordinator.cpp:348] Coordinator attempting to write APPEND action
at position 1
I1028 21:39:38.436300 26698 replica.cpp:537] Replica received write request for position 1
from (11959)@172.17.0.3:58880
I1028 21:39:38.436671 26698 leveldb.cpp:341] Persisting action (187 bytes) to leveldb took
336836ns
I1028 21:39:38.436697 26698 replica.cpp:712] Persisted action at 1
I1028 21:39:38.437212 26695 replica.cpp:691] Replica received learned notice for position
1 from @0.0.0.0:0
I1028 21:39:38.437397 26695 leveldb.cpp:341] Persisting action (189 bytes) to leveldb took
165418ns
I1028 21:39:38.437423 26695 replica.cpp:712] Persisted action at 1
I1028 21:39:38.437475 26695 replica.cpp:697] Replica learned APPEND action at position 1
I1028 21:39:38.437719 26700 hierarchical.cpp:1535] No allocations performed
I1028 21:39:38.437789 26700 hierarchical.cpp:1170] Performed allocation for 0 agents in 156568ns
I1028 21:39:38.438483 26708 registrar.cpp:509] Successfully updated the 'registry' in 3.828992ms
I1028 21:39:38.438642 26708 registrar.cpp:395] Successfully recovered registrar
I1028 21:39:38.438688 26698 log.cpp:596] Attempting to truncate the log to 1
I1028 21:39:38.438860 26702 coordinator.cpp:348] Coordinator attempting to write TRUNCATE
action at position 2
I1028 21:39:38.439219 26708 master.cpp:1655] Recovered 0 agents from the Registry (129B) ;
allowing 10mins for agents to re-register
I1028 21:39:38.439251 26704 hierarchical.cpp:176] Skipping recovery of hierarchical allocator:
nothing to recover
I1028 21:39:38.439743 26705 replica.cpp:537] Replica received write request for position 2
from (11960)@172.17.0.3:58880
I1028 21:39:38.440099 26705 leveldb.cpp:341] Persisting action (16 bytes) to leveldb took
334644ns
I1028 21:39:38.440121 26705 replica.cpp:712] Persisted action at 2
I1028 21:39:38.440610 26705 replica.cpp:691] Replica received learned notice for position
2 from @0.0.0.0:0
I1028 21:39:38.440757 26705 leveldb.cpp:341] Persisting action (18 bytes) to leveldb took
131235ns
I1028 21:39:38.440807 26705 leveldb.cpp:399] Deleting ~1 keys from leveldb took 34946ns
I1028 21:39:38.440830 26705 replica.cpp:712] Persisted action at 2
I1028 21:39:38.440856 26705 replica.cpp:697] Replica learned TRUNCATE action at position 2
    @     0x2ada7aa255d4 process::ProcessBase::visit()
    @     0x2ada7aa8344e process::DispatchEvent::visit()
    @           0x8ab4f1 process::ProcessBase::serve()
    @     0x2ada7aa232d4 process::ProcessManager::resume()
    @     0x2ada7aa2e23c process::ProcessManager::init_threads()::$_0::operator()()
    @     0x2ada7aa2e145 _ZNSt12_Bind_simpleIFZN7process14ProcessManager12init_threadsEvE3$_0vEE9_M_invokeIJEEEvSt12_Index_tupleIJXspT_EEE
    @     0x2ada7aa2e115 std::_Bind_simple<>::operator()()
    @     0x2ada7aa2e0ec std::thread::_Impl<>::_M_run()
    @     0x2ada7c4eba60 (unknown)
    @     0x2ada7cc62184 start_thread
    @     0x2ada7cf7237d (unknown)
make[4]: *** [check-local] Aborted
make[4]: Leaving directory `/mesos/mesos-1.0.2/_build/src'
make[3]: *** [check-am] Error 2
make[3]: Leaving directory `/mesos/mesos-1.0.2/_build/src'
make[2]: *** [check] Error 2
make[2]: Leaving directory `/mesos/mesos-1.0.2/_build/src'
make[1]: Leaving directory `/mesos/mesos-1.0.2/_build'
make[1]: *** [check-recursive] Error 1
make: *** [distcheck] Error 1
+ docker rmi mesos-1477688868-1656
Untagged: mesos-1477688868-1656:latest
Deleted: sha256:b0323f7bdaee1621d5b192bfe0dadbce62c170dfa35bc75805c000762b3d803f
Deleted: sha256:02991093fb51b34d00db447a0ca24ca44a8b74f95a8c17980ab0572733d14cdb
Deleted: sha256:75d4583338e8e9a6f9bdfdd9e8b9558fcdb3e00fd115db0aa7a5f7ea87853e11
Deleted: sha256:813c7f9a9b8d0e050ae2cd86571f21181b835c255a819f0cdac43ed5e04aa6b7
Deleted: sha256:69a81c866b33c70e807cd34ef607371fa52d419b0e0a06d843f88c081710876c
Deleted: sha256:f0afe35c12ffce4e7d1f99542b13273517644f15a098dddc4528b68707466dd3
Deleted: sha256:8d321f1597d20c1eab6399590408146eea879f8dcd52162688dd00b917619d3a
Deleted: sha256:26ef2ca2ab5625c9889a369c6bb3931a79ce34b4cd91eacbf483247c7d3d85f6
Deleted: sha256:ff6e94c593dfb0d1503131f3f2b82bd40c02eec046ab28fbd5d0e3bdebbbce11
Deleted: sha256:368446fdc2b8da6a01891ff63ecdcdcb2d68af3d261235750e59a500dea57b80
Deleted: sha256:4dcd818f2f79fdc8fdebc4476d0cac8bf0ba6c0e001c3393ccb5117c3030c6b3
Deleted: sha256:b01c24935b5eae2049d45c29b3df6e72a2e07e9922752b510341cd531c01225b
Deleted: sha256:04cc0eea44269bf51e578c5d737ad9b4aaa61443391d9d7ba0f7609018e05492
Deleted: sha256:be53f5a3ba26be4e7f3de36a47db23b7ee3a33e7571d91d1f52ec1d83e3af8d3
Deleted: sha256:405a4ab1f7d6cb662f666cf8ffa41c2057d4650ae0a5dd3676bff66bcc27fa21
Deleted: sha256:1154600d49d469e8f908a971e892b12e7bc6aa6d4d49b5fcc3deacec98dc1c3d
Deleted: sha256:c521b58f6d00e90c1fb155f6f60b73e07aae44ba107a65959051222921aeba16
Deleted: sha256:acce02c66b8d200143c6244e7cb98db3a07bbe68ff8b3d055cccb481f3be5d3e
Deleted: sha256:2ac00acc2c02a108691358d291b8fdd01cd878291e8dd98e3e084c4e6ee5404a
Deleted: sha256:dfa4cf8ad924c6202e8fbba6fdb7828d322cac34b46bf27cb37f8cdbac46046f
Deleted: sha256:bcd781489071ea7c825905bc848d961a46f4a842b98b80aaef439b1112f82f23
Deleted: sha256:674bb8f422ef033817035b6bd996ff2c5ee7efdccbcdd6473bf37e3415238081
Build step 'Execute shell' marked build as failure

Mime
View raw message