mesos-builds mailing list archives

Site index · List index
Message view « Date » · « Thread »
Top « Date » · « Thread »
From Apache Jenkins Server <jenk...@builds.apache.org>
Subject Build failed in Jenkins: mesos-reviewbot #15778
Date Sat, 22 Oct 2016 15:45:57 GMT
See <https://builds.apache.org/job/mesos-reviewbot/15778/>

------------------------------------------
[...truncated 218828 lines...]
I1022 15:45:41.360702 29403 containerizer.cpp:201] Using isolation: posix/cpu,posix/mem,filesystem/posix,network/cni
W1022 15:45:41.361426 29403 backend.cpp:76] Failed to create 'aufs' backend: AufsBackend requires
root privileges, but is running as user mesos
W1022 15:45:41.361627 29403 backend.cpp:76] Failed to create 'bind' backend: BindBackend requires
root privileges
I1022 15:45:41.364984 29435 slave.cpp:208] Mesos agent started on (633)@172.17.0.2:53385
I1022 15:45:41.365013 29435 slave.cpp:209] Flags at startup: --acls="" --appc_simple_discovery_uri_prefix="http://"
--appc_store_dir="/tmp/mesos/store/appc" --authenticate_http_readonly="true" --authenticate_http_readwrite="true"
--authenticatee="crammd5" --authentication_backoff_factor="1secs" --authorizer="local" --cgroups_cpu_enable_pids_and_tids_count="false"
--cgroups_enable_cfs="false" --cgroups_hierarchy="/sys/fs/cgroup" --cgroups_limit_swap="false"
--cgroups_root="mesos" --container_disk_watch_interval="15secs" --containerizers="mesos" --credential="/tmp/Endpoint_SlaveEndpointTest_AuthorizedRequest_1_GoDLh8/credential"
--default_role="*" --disk_watch_interval="1mins" --docker="docker" --docker_kill_orphans="true"
--docker_registry="https://registry-1.docker.io" --docker_remove_delay="6hrs" --docker_socket="/var/run/docker.sock"
--docker_stop_timeout="0ns" --docker_store_dir="/tmp/mesos/store/docker" --docker_volume_checkpoint_dir="/var/run/mesos/isolators/docker/volume"
--enforce_container_disk_quota="false" --executor_registration_timeout="1mins" --executor_shutdown_grace_period="5secs"
--fetcher_cache_dir="/tmp/Endpoint_SlaveEndpointTest_AuthorizedRequest_1_GoDLh8/fetch" --fetcher_cache_size="2GB"
--frameworks_home="" --gc_delay="1weeks" --gc_disk_headroom="0.1" --hadoop_home="" --help="false"
--hostname_lookup="true" --http_authenticators="basic" --http_command_executor="false" --http_credentials="/tmp/Endpoint_SlaveEndpointTest_AuthorizedRequest_1_GoDLh8/http_credentials"
--image_provisioner_backend="copy" --initialize_driver_logging="true" --isolation="posix/cpu,posix/mem"
--launcher="posix" --launcher_dir="/mesos/mesos-1.2.0/_build/src" --logbufsecs="0" --logging_level="INFO"
--max_completed_executors_per_framework="150" --oversubscribed_resources_interval="15secs"
--perf_duration="10secs" --perf_interval="1mins" --qos_correction_interval_min="0ns" --quiet="false"
--recover="reconnect" --recovery_timeout="15mins" --registration_backoff_factor="10ms" --resources="cpus:2;gpus:0;mem:1024;disk:1024;ports:[31000-32000]"
--revocable_cpu_low_priority="true" --runtime_dir="/tmp/Endpoint_SlaveEndpointTest_AuthorizedRequest_1_GoDLh8"
--sandbox_directory="/mnt/mesos/sandbox" --strict="true" --switch_user="true" --systemd_enable_support="true"
--systemd_runtime_directory="/run/systemd/system" --version="false" --work_dir="/tmp/Endpoint_SlaveEndpointTest_AuthorizedRequest_1_f6MLF1"
I1022 15:45:41.365644 29435 credentials.hpp:86] Loading credential for authentication from
'/tmp/Endpoint_SlaveEndpointTest_AuthorizedRequest_1_GoDLh8/credential'
I1022 15:45:41.365829 29435 slave.cpp:346] Agent using credential for: test-principal
I1022 15:45:41.365855 29435 credentials.hpp:37] Loading credentials for authentication from
'/tmp/Endpoint_SlaveEndpointTest_AuthorizedRequest_1_GoDLh8/http_credentials'
I1022 15:45:41.366127 29435 http.cpp:887] Using default 'basic' HTTP authenticator for realm
'mesos-agent-readonly'
I1022 15:45:41.366266 29435 http.cpp:887] Using default 'basic' HTTP authenticator for realm
'mesos-agent-readwrite'
I1022 15:45:41.367789 29435 slave.cpp:533] Agent resources: cpus(*):2; mem(*):1024; disk(*):1024;
ports(*):[31000-32000]
I1022 15:45:41.367889 29435 slave.cpp:541] Agent attributes: [  ]
I1022 15:45:41.367905 29435 slave.cpp:546] Agent hostname: f039bd36eb05
I1022 15:45:41.369551 29430 state.cpp:57] Recovering state from '/tmp/Endpoint_SlaveEndpointTest_AuthorizedRequest_1_f6MLF1/meta'
I1022 15:45:41.369974 29426 status_update_manager.cpp:203] Recovering status update manager
I1022 15:45:41.370322 29431 containerizer.cpp:557] Recovering containerizer
I1022 15:45:41.371922 29423 provisioner.cpp:253] Provisioner recovery complete
I1022 15:45:41.372375 29437 slave.cpp:5399] Finished recovery
I1022 15:45:41.372967 29437 slave.cpp:5573] Querying resource estimator for oversubscribable
resources
I1022 15:45:41.373240 29429 slave.cpp:5587] Received oversubscribable resources {} from the
resource estimator
I1022 15:45:41.375049 29427 process.cpp:3377] Handling HTTP event for process 'slave(633)'
with path: '/slave(633)/monitor/statistics.json'
I1022 15:45:41.376037 29428 http.cpp:839] Authorizing principal 'test-principal' to GET the
'/monitor/statistics.json' endpoint
I1022 15:45:41.381290 29428 slave.cpp:787] Agent terminating
[       OK ] Endpoint/SlaveEndpointTest.AuthorizedRequest/1 (33 ms)
[ RUN      ] Endpoint/SlaveEndpointTest.AuthorizedRequest/2
I1022 15:45:41.393838 29403 containerizer.cpp:201] Using isolation: posix/cpu,posix/mem,filesystem/posix,network/cni
W1022 15:45:41.394575 29403 backend.cpp:76] Failed to create 'aufs' backend: AufsBackend requires
root privileges, but is running as user mesos
W1022 15:45:41.394747 29403 backend.cpp:76] Failed to create 'bind' backend: BindBackend requires
root privileges
I1022 15:45:41.398416 29430 slave.cpp:208] Mesos agent started on (634)@172.17.0.2:53385
I1022 15:45:41.398447 29430 slave.cpp:209] Flags at startup: --acls="" --appc_simple_discovery_uri_prefix="http://"
--appc_store_dir="/tmp/mesos/store/appc" --authenticate_http_readonly="true" --authenticate_http_readwrite="true"
--authenticatee="crammd5" --authentication_backoff_factor="1secs" --authorizer="local" --cgroups_cpu_enable_pids_and_tids_count="false"
--cgroups_enable_cfs="false" --cgroups_hierarchy="/sys/fs/cgroup" --cgroups_limit_swap="false"
--cgroups_root="mesos" --container_disk_watch_interval="15secs" --containerizers="mesos" --credential="/tmp/Endpoint_SlaveEndpointTest_AuthorizedRequest_2_ABpZ1y/credential"
--default_role="*" --disk_watch_interval="1mins" --docker="docker" --docker_kill_orphans="true"
--docker_registry="https://registry-1.docker.io" --docker_remove_delay="6hrs" --docker_socket="/var/run/docker.sock"
--docker_stop_timeout="0ns" --docker_store_dir="/tmp/mesos/store/docker" --docker_volume_checkpoint_dir="/var/run/mesos/isolators/docker/volume"
--enforce_container_disk_quota="false" --executor_registration_timeout="1mins" --executor_shutdown_grace_period="5secs"
--fetcher_cache_dir="/tmp/Endpoint_SlaveEndpointTest_AuthorizedRequest_2_ABpZ1y/fetch" --fetcher_cache_size="2GB"
--frameworks_home="" --gc_delay="1weeks" --gc_disk_headroom="0.1" --hadoop_home="" --help="false"
--hostname_lookup="true" --http_authenticators="basic" --http_command_executor="false" --http_credentials="/tmp/Endpoint_SlaveEndpointTest_AuthorizedRequest_2_ABpZ1y/http_credentials"
--image_provisioner_backend="copy" --initialize_driver_logging="true" --isolation="posix/cpu,posix/mem"
--launcher="posix" --launcher_dir="/mesos/mesos-1.2.0/_build/src" --logbufsecs="0" --logging_level="INFO"
--max_completed_executors_per_framework="150" --oversubscribed_resources_interval="15secs"
--perf_duration="10secs" --perf_interval="1mins" --qos_correction_interval_min="0ns" --quiet="false"
--recover="reconnect" --recovery_timeout="15mins" --registration_backoff_factor="10ms" --resources="cpus:2;gpus:0;mem:1024;disk:1024;ports:[31000-32000]"
--revocable_cpu_low_priority="true" --runtime_dir="/tmp/Endpoint_SlaveEndpointTest_AuthorizedRequest_2_ABpZ1y"
--sandbox_directory="/mnt/mesos/sandbox" --strict="true" --switch_user="true" --systemd_enable_support="true"
--systemd_runtime_directory="/run/systemd/system" --version="false" --work_dir="/tmp/Endpoint_SlaveEndpointTest_AuthorizedRequest_2_dU1Aks"
I1022 15:45:41.399062 29430 credentials.hpp:86] Loading credential for authentication from
'/tmp/Endpoint_SlaveEndpointTest_AuthorizedRequest_2_ABpZ1y/credential'
I1022 15:45:41.399222 29430 slave.cpp:346] Agent using credential for: test-principal
I1022 15:45:41.399246 29430 credentials.hpp:37] Loading credentials for authentication from
'/tmp/Endpoint_SlaveEndpointTest_AuthorizedRequest_2_ABpZ1y/http_credentials'
I1022 15:45:41.399511 29430 http.cpp:887] Using default 'basic' HTTP authenticator for realm
'mesos-agent-readonly'
I1022 15:45:41.399936 29430 http.cpp:887] Using default 'basic' HTTP authenticator for realm
'mesos-agent-readwrite'
I1022 15:45:41.401247 29430 slave.cpp:533] Agent resources: cpus(*):2; mem(*):1024; disk(*):1024;
ports(*):[31000-32000]
I1022 15:45:41.401343 29430 slave.cpp:541] Agent attributes: [  ]
I1022 15:45:41.401358 29430 slave.cpp:546] Agent hostname: f039bd36eb05
I1022 15:45:41.403014 29432 state.cpp:57] Recovering state from '/tmp/Endpoint_SlaveEndpointTest_AuthorizedRequest_2_dU1Aks/meta'
I1022 15:45:41.403489 29423 status_update_manager.cpp:203] Recovering status update manager
I1022 15:45:41.403743 29423 containerizer.cpp:557] Recovering containerizer
I1022 15:45:41.405496 29423 provisioner.cpp:253] Provisioner recovery complete
I1022 15:45:41.406056 29437 slave.cpp:5399] Finished recovery
I1022 15:45:41.406661 29437 slave.cpp:5573] Querying resource estimator for oversubscribable
resources
I1022 15:45:41.407040 29435 slave.cpp:5587] Received oversubscribable resources {} from the
resource estimator
I1022 15:45:41.409095 29426 process.cpp:3377] Handling HTTP event for process 'slave(634)'
with path: '/slave(634)/containers'
I1022 15:45:41.410104 29436 http.cpp:839] Authorizing principal 'test-principal' to GET the
'/containers' endpoint
I1022 15:45:41.413671 29424 slave.cpp:787] Agent terminating
[       OK ] Endpoint/SlaveEndpointTest.AuthorizedRequest/2 (30 ms)
[ RUN      ] Endpoint/SlaveEndpointTest.UnauthorizedRequest/0
I1022 15:45:41.433254 29403 containerizer.cpp:201] Using isolation: posix/cpu,posix/mem,filesystem/posix,network/cni
W1022 15:45:41.433965 29403 backend.cpp:76] Failed to create 'aufs' backend: AufsBackend requires
root privileges, but is running as user mesos
W1022 15:45:41.434128 29403 backend.cpp:76] Failed to create 'bind' backend: BindBackend requires
root privileges
I1022 15:45:41.437609 29436 slave.cpp:208] Mesos agent started on (635)@172.17.0.2:53385
I1022 15:45:41.437635 29436 slave.cpp:209] Flags at startup: --acls="" --appc_simple_discovery_uri_prefix="http://"
--appc_store_dir="/tmp/mesos/store/appc" --authenticate_http_readonly="true" --authenticate_http_readwrite="true"
--authenticatee="crammd5" --authentication_backoff_factor="1secs" --authorizer="local" --cgroups_cpu_enable_pids_and_tids_count="false"
--cgroups_enable_cfs="false" --cgroups_hierarchy="/sys/fs/cgroup" --cgroups_limit_swap="false"
--cgroups_root="mesos" --container_disk_watch_interval="15secs" --containerizers="mesos" --credential="/tmp/Endpoint_SlaveEndpointTest_UnauthorizedRequest_0_2wpKa0/credential"
--default_role="*" --disk_watch_interval="1mins" --docker="docker" --docker_kill_orphans="true"
--docker_registry="https://registry-1.docker.io" --docker_remove_delay="6hrs" --docker_socket="/var/run/docker.sock"
--docker_stop_timeout="0ns" --docker_store_dir="/tmp/mesos/store/docker" --docker_volume_checkpoint_dir="/var/run/mesos/isolators/docker/volume"
--enforce_container_disk_quota="false" --executor_registration_timeout="1mins" --executor_shutdown_grace_period="5secs"
--fetcher_cache_dir="/tmp/Endpoint_SlaveEndpointTest_UnauthorizedRequest_0_2wpKa0/fetch" --fetcher_cache_size="2GB"
--frameworks_home="" --gc_delay="1weeks" --gc_disk_headroom="0.1" --hadoop_home="" --help="false"
--hostname_lookup="true" --http_authenticators="basic" --http_command_executor="false" --http_credentials="/tmp/Endpoint_SlaveEndpointTest_UnauthorizedRequest_0_2wpKa0/http_credentials"
--image_provisioner_backend="copy" --initialize_driver_logging="true" --isolation="posix/cpu,posix/mem"
--launcher="posix" --launcher_dir="/mesos/mesos-1.2.0/_build/src" --logbufsecs="0" --logging_level="INFO"
--max_completed_executors_per_framework="150" --oversubscribed_resources_interval="15secs"
--perf_duration="10secs" --perf_interval="1mins" --qos_correction_interval_min="0ns" --quiet="false"
--recover="reconnect" --recovery_timeout="15mins" --registration_backoff_factor="10ms" --resources="cpus:2;gpus:0;mem:1024;disk:1024;ports:[31000-32000]"
--revocable_cpu_low_priority="true" --runtime_dir="/tmp/Endpoint_SlaveEndpointTest_UnauthorizedRequest_0_2wpKa0"
--sandbox_directory="/mnt/mesos/sandbox" --strict="true" --switch_user="true" --systemd_enable_support="true"
--systemd_runtime_directory="/run/systemd/system" --version="false" --work_dir="/tmp/Endpoint_SlaveEndpointTest_UnauthorizedRequest_0_VDHZmT"
I1022 15:45:41.438226 29436 credentials.hpp:86] Loading credential for authentication from
'/tmp/Endpoint_SlaveEndpointTest_UnauthorizedRequest_0_2wpKa0/credential'
I1022 15:45:41.438390 29436 slave.cpp:346] Agent using credential for: test-principal
I1022 15:45:41.438413 29436 credentials.hpp:37] Loading credentials for authentication from
'/tmp/Endpoint_SlaveEndpointTest_UnauthorizedRequest_0_2wpKa0/http_credentials'
I1022 15:45:41.438673 29436 http.cpp:887] Using default 'basic' HTTP authenticator for realm
'mesos-agent-readonly'
I1022 15:45:41.438812 29436 http.cpp:887] Using default 'basic' HTTP authenticator for realm
'mesos-agent-readwrite'
I1022 15:45:41.440543 29436 slave.cpp:533] Agent resources: cpus(*):2; mem(*):1024; disk(*):1024;
ports(*):[31000-32000]
I1022 15:45:41.440639 29436 slave.cpp:541] Agent attributes: [  ]
I1022 15:45:41.440652 29436 slave.cpp:546] Agent hostname: f039bd36eb05
I1022 15:45:41.442049 29433 state.cpp:57] Recovering state from '/tmp/Endpoint_SlaveEndpointTest_UnauthorizedRequest_0_VDHZmT/meta'
I1022 15:45:41.442569 29428 status_update_manager.cpp:203] Recovering status update manager
I1022 15:45:41.442883 29436 containerizer.cpp:557] Recovering containerizer
I1022 15:45:41.444424 29436 provisioner.cpp:253] Provisioner recovery complete
I1022 15:45:41.445046 29437 slave.cpp:5399] Finished recovery
I1022 15:45:41.445597 29437 slave.cpp:5573] Querying resource estimator for oversubscribable
resources
I1022 15:45:41.445951 29429 slave.cpp:5587] Received oversubscribable resources {} from the
resource estimator
I1022 15:45:41.447827 29427 process.cpp:3377] Handling HTTP event for process 'slave(635)'
with path: '/slave(635)/monitor/statistics'
I1022 15:45:41.449101 29430 http.cpp:839] Authorizing principal 'test-principal' to GET the
'/monitor/statistics' endpoint
I1022 15:45:41.452973 29437 slave.cpp:787] Agent terminating
[       OK ] Endpoint/SlaveEndpointTest.UnauthorizedRequest/0 (32 ms)
[ RUN      ] Endpoint/SlaveEndpointTest.UnauthorizedRequest/1
I1022 15:45:41.464860 29403 containerizer.cpp:201] Using isolation: posix/cpu,posix/mem,filesystem/posix,network/cni
W1022 15:45:41.465392 29403 backend.cpp:76] Failed to create 'aufs' backend: AufsBackend requires
root privileges, but is running as user mesos
W1022 15:45:41.465518 29403 backend.cpp:76] Failed to create 'bind' backend: BindBackend requires
root privileges
I1022 15:45:41.468957 29431 slave.cpp:208] Mesos agent started on (636)@172.17.0.2:53385
I1022 15:45:41.468993 29431 slave.cpp:209] Flags at startup: --acls="" --appc_simple_discovery_uri_prefix="http://"
--appc_store_dir="/tmp/mesos/store/appc" --authenticate_http_readonly="true" --authenticate_http_readwrite="true"
--authenticatee="crammd5" --authentication_backoff_factor="1secs" --authorizer="local" --cgroups_cpu_enable_pids_and_tids_count="false"
--cgroups_enable_cfs="false" --cgroups_hierarchy="/sys/fs/cgroup" --cgroups_limit_swap="false"
--cgroups_root="mesos" --container_disk_watch_interval="15secs" --containerizers="mesos" --credential="/tmp/Endpoint_SlaveEndpointTest_UnauthorizedRequest_1_GumyFr/credential"
--default_role="*" --disk_watch_interval="1mins" --docker="docker" --docker_kill_orphans="true"
--docker_registry="https://registry-1.docker.io" --docker_remove_delay="6hrs" --docker_socket="/var/run/docker.sock"
--docker_stop_timeout="0ns" --docker_store_dir="/tmp/mesos/store/docker" --docker_volume_checkpoint_dir="/var/run/mesos/isolators/docker/volume"
--enforce_container_disk_quota="false" --executor_registration_timeout="1mins" --executor_shutdown_grace_period="5secs"
--fetcher_cache_dir="/tmp/Endpoint_SlaveEndpointTest_UnauthorizedRequest_1_GumyFr/fetch" --fetcher_cache_size="2GB"
--frameworks_home="" --gc_delay="1weeks" --gc_disk_headroom="0.1" --hadoop_home="" --help="false"
--hostname_lookup="true" --http_authenticators="basic" --http_command_executor="false" --http_credentials="/tmp/Endpoint_SlaveEndpointTest_UnauthorizedRequest_1_GumyFr/http_credentials"
--image_provisioner_backend="copy" --initialize_driver_logging="true" --isolation="posix/cpu,posix/mem"
--launcher="posix" --launcher_dir="/mesos/mesos-1.2.0/_build/src" --logbufsecs="0" --logging_level="INFO"
--max_completed_executors_per_framework="150" --oversubscribed_resources_interval="15secs"
--perf_duration="10secs" --perf_interval="1mins" --qos_correction_interval_min="0ns" --quiet="false"
--recover="reconnect" --recovery_timeout="15mins" --registration_backoff_factor="10ms" --resources="cpus:2;gpus:0;mem:1024;disk:1024;ports:[31000-32000]"
--revocable_cpu_low_priority="true" --runtime_dir="/tmp/Endpoint_SlaveEndpointTest_UnauthorizedRequest_1_GumyFr"
--sandbox_directory="/mnt/mesos/sandbox" --strict="true" --switch_user="true" --systemd_enable_support="true"
--systemd_runtime_directory="/run/systemd/system" --version="false" --work_dir="/tmp/Endpoint_SlaveEndpointTest_UnauthorizedRequest_1_jpezMk"
I1022 15:45:41.469982 29431 credentials.hpp:86] Loading credential for authentication from
'/tmp/Endpoint_SlaveEndpointTest_UnauthorizedRequest_1_GumyFr/credential'
I1022 15:45:41.470216 29431 slave.cpp:346] Agent using credential for: test-principal
I1022 15:45:41.470252 29431 credentials.hpp:37] Loading credentials for authentication from
'/tmp/Endpoint_SlaveEndpointTest_UnauthorizedRequest_1_GumyFr/http_credentials'
I1022 15:45:41.470641 29431 http.cpp:887] Using default 'basic' HTTP authenticator for realm
'mesos-agent-readonly'
I1022 15:45:41.470813 29431 http.cpp:887] Using default 'basic' HTTP authenticator for realm
'mesos-agent-readwrite'
I1022 15:45:41.472430 29431 slave.cpp:533] Agent resources: cpus(*):2; mem(*):1024; disk(*):1024;
ports(*):[31000-32000]
I1022 15:45:41.472532 29431 slave.cpp:541] Agent attributes: [  ]
I1022 15:45:41.472546 29431 slave.cpp:546] Agent hostname: f039bd36eb05
I1022 15:45:41.474349 29427 state.cpp:57] Recovering state from '/tmp/Endpoint_SlaveEndpointTest_UnauthorizedRequest_1_jpezMk/meta'
I1022 15:45:41.474758 29424 status_update_manager.cpp:203] Recovering status update manager
I1022 15:45:41.475054 29426 containerizer.cpp:557] Recovering containerizer
I1022 15:45:41.476748 29423 provisioner.cpp:253] Provisioner recovery complete
I1022 15:45:41.477262 29431 slave.cpp:5399] Finished recovery
I1022 15:45:41.477879 29431 slave.cpp:5573] Querying resource estimator for oversubscribable
resources
I1022 15:45:41.478163 29436 slave.cpp:5587] Received oversubscribable resources {} from the
resource estimator
I1022 15:45:41.479718 29426 process.cpp:3377] Handling HTTP event for process 'slave(636)'
with path: '/slave(636)/monitor/statistics.json'
I1022 15:45:41.480824 29427 http.cpp:839] Authorizing principal 'test-principal' to GET the
'/monitor/statistics.json' endpoint
I1022 15:45:41.483921 29423 slave.cpp:787] Agent terminating
[       OK ] Endpoint/SlaveEndpointTest.UnauthorizedRequest/1 (28 ms)
[ RUN      ] Endpoint/SlaveEndpointTest.UnauthorizedRequest/2
I1022 15:45:41.495753 29403 containerizer.cpp:201] Using isolation: posix/cpu,posix/mem,filesystem/posix,network/cni
W1022 15:45:41.496510 29403 backend.cpp:76] Failed to create 'aufs' backend: AufsBackend requires
root privileges, but is running as user mesos
W1022 15:45:41.496700 29403 backend.cpp:76] Failed to create 'bind' backend: BindBackend requires
root privileges
I1022 15:45:41.500741 29431 slave.cpp:208] Mesos agent started on (637)@172.17.0.2:53385
I1022 15:45:41.500768 29431 slave.cpp:209] Flags at startup: --acls="" --appc_simple_discovery_uri_prefix="http://"
--appc_store_dir="/tmp/mesos/store/appc" --authenticate_http_readonly="true" --authenticate_http_readwrite="true"
--authenticatee="crammd5" --authentication_backoff_factor="1secs" --authorizer="local" --cgroups_cpu_enable_pids_and_tids_count="false"
--cgroups_enable_cfs="false" --cgroups_hierarchy="/sys/fs/cgroup" --cgroups_limit_swap="false"
--cgroups_root="mesos" --container_disk_watch_interval="15secs" --containerizers="mesos" --credential="/tmp/Endpoint_SlaveEndpointTest_UnauthorizedRequest_2_StApuT/credential"
--default_role="*" --disk_watch_interval="1mins" --docker="docker" --docker_kill_orphans="true"
--docker_registry="https://registry-1.docker.io" --docker_remove_delay="6hrs" --docker_socket="/var/run/docker.sock"
--docker_stop_timeout="0ns" --docker_store_dir="/tmp/mesos/store/docker" --docker_volume_checkpoint_dir="/var/run/mesos/isolators/docker/volume"
--enforce_container_disk_quota="false" --executor_registration_timeout="1mins" --executor_shutdown_grace_period="5secs"
--fetcher_cache_dir="/tmp/Endpoint_SlaveEndpointTest_UnauthorizedRequest_2_StApuT/fetch" --fetcher_cache_size="2GB"
--frameworks_home="" --gc_delay="1weeks" --gc_disk_headroom="0.1" --hadoop_home="" --help="false"
--hostname_lookup="true" --http_authenticators="basic" --http_command_executor="false" --http_credentials="/tmp/Endpoint_SlaveEndpointTest_UnauthorizedRequest_2_StApuT/http_credentials"
--image_provisioner_backend="copy" --initialize_driver_logging="true" --isolation="posix/cpu,posix/mem"
--launcher="posix" --launcher_dir="/mesos/mesos-1.2.0/_build/src" --logbufsecs="0" --logging_level="INFO"
--max_completed_executors_per_framework="150" --oversubscribed_resources_interval="15secs"
--perf_duration="10secs" --perf_interval="1mins" --qos_correction_interval_min="0ns" --quiet="false"
--recover="reconnect" --recovery_timeout="15mins" --registration_backoff_factor="10ms" --resources="cpus:2;gpus:0;mem:1024;disk:1024;ports:[31000-32000]"
--revocable_cpu_low_priority="true" --runtime_dir="/tmp/Endpoint_SlaveEndpointTest_UnauthorizedRequest_2_StApuT"
--sandbox_directory="/mnt/mesos/sandbox" --strict="true" --switch_user="true" --systemd_enable_support="true"
--systemd_runtime_directory="/run/systemd/system" --version="false" --work_dir="/tmp/Endpoint_SlaveEndpointTest_UnauthorizedRequest_2_dYQtwM"
I1022 15:45:41.501332 29431 credentials.hpp:86] Loading credential for authentication from
'/tmp/Endpoint_SlaveEndpointTest_UnauthorizedRequest_2_StApuT/credential'
I1022 15:45:41.501494 29431 slave.cpp:346] Agent using credential for: test-principal
I1022 15:45:41.501520 29431 credentials.hpp:37] Loading credentials for authentication from
'/tmp/Endpoint_SlaveEndpointTest_UnauthorizedRequest_2_StApuT/http_credentials'
I1022 15:45:41.501716 29431 http.cpp:887] Using default 'basic' HTTP authenticator for realm
'mesos-agent-readonly'
I1022 15:45:41.501888 29431 http.cpp:887] Using default 'basic' HTTP authenticator for realm
'mesos-agent-readwrite'
I1022 15:45:41.503094 29431 slave.cpp:533] Agent resources: cpus(*):2; mem(*):1024; disk(*):1024;
ports(*):[31000-32000]
I1022 15:45:41.503165 29431 slave.cpp:541] Agent attributes: [  ]
I1022 15:45:41.503176 29431 slave.cpp:546] Agent hostname: f039bd36eb05
I1022 15:45:41.504818 29427 state.cpp:57] Recovering state from '/tmp/Endpoint_SlaveEndpointTest_UnauthorizedRequest_2_dYQtwM/meta'
I1022 15:45:41.505285 29432 status_update_manager.cpp:203] Recovering status update manager
I1022 15:45:41.505738 29431 containerizer.cpp:557] Recovering containerizer
I1022 15:45:41.507369 29429 provisioner.cpp:253] Provisioner recovery complete
I1022 15:45:41.508342 29434 slave.cpp:5399] Finished recovery
I1022 15:45:41.509093 29434 slave.cpp:5573] Querying resource estimator for oversubscribable
resources
I1022 15:45:41.509563 29428 slave.cpp:5587] Received oversubscribable resources {} from the
resource estimator
I1022 15:45:41.511531 29426 process.cpp:3377] Handling HTTP event for process 'slave(637)'
with path: '/slave(637)/containers'
I1022 15:45:41.512702 29436 http.cpp:839] Authorizing principal 'test-principal' to GET the
'/containers' endpoint
I1022 15:45:41.515982 29425 slave.cpp:787] Agent terminating
[       OK ] Endpoint/SlaveEndpointTest.UnauthorizedRequest/2 (31 ms)
[ RUN      ] Endpoint/SlaveEndpointTest.NoAuthorizer/0
I1022 15:45:41.527420 29403 containerizer.cpp:201] Using isolation: posix/cpu,posix/mem,filesystem/posix,network/cni
W1022 15:45:41.528185 29403 backend.cpp:76] Failed to create 'aufs' backend: AufsBackend requires
root privileges, but is running as user mesos
W1022 15:45:41.528348 29403 backend.cpp:76] Failed to create 'bind' backend: BindBackend requires
root privileges
I1022 15:45:41.529857 29403 cluster.cpp:435] Creating default 'local' authorizer
I1022 15:45:41.532253 29429 slave.cpp:208] Mesos agent started on (638)@172.17.0.2:53385
I1022 15:45:41.532280 29429 slave.cpp:209] Flags at startup: --acls="" --appc_simple_discovery_uri_prefix="http://"
--appc_store_dir="/tmp/mesos/store/appc" --authenticate_http_readonly="true" --authenticate_http_readwrite="true"
--authenticatee="crammd5" --authentication_backoff_factor="1secs" --authorizer="local" --cgroups_cpu_enable_pids_and_tids_count="false"
--cgroups_enable_cfs="false" --cgroups_hierarchy="/sys/fs/cgroup" --cgroups_limit_swap="false"
--cgroups_root="mesos" --container_disk_watch_interval="15secs" --containerizers="mesos" --credential="/tmp/Endpoint_SlaveEndpointTest_NoAuthorizer_0_8aAIDl/credential"
--default_role="*" --disk_watch_interval="1mins" --docker="docker" --docker_kill_orphans="true"
--docker_registry="https://registry-1.docker.io" --docker_remove_delay="6hrs" --docker_socket="/var/run/docker.sock"
--docker_stop_timeout="0ns" --docker_store_dir="/tmp/mesos/store/docker" --docker_volume_checkpoint_dir="/var/run/mesos/isolators/docker/volume"
--enforce_container_disk_quota="false" --executor_registration_timeout="1mins" --executor_shutdown_grace_period="5secs"
--fetcher_cache_dir="/tmp/Endpoint_SlaveEndpointTest_NoAuthorizer_0_8aAIDl/fetch" --fetcher_cache_size="2GB"
--frameworks_home="" --gc_delay="1weeks" --gc_disk_headroom="0.1" --hadoop_home="" --help="false"
--hostname_lookup="true" --http_authenticators="basic" --http_command_executor="false" --http_credentials="/tmp/Endpoint_SlaveEndpointTest_NoAuthorizer_0_8aAIDl/http_credentials"
--image_provisioner_backend="copy" --initialize_driver_logging="true" --isolation="posix/cpu,posix/mem"
--launcher="posix" --launcher_dir="/mesos/mesos-1.2.0/_build/src" --logbufsecs="0" --logging_level="INFO"
--max_completed_executors_per_framework="150" --oversubscribed_resources_interval="15secs"
--perf_duration="10secs" --perf_interval="1mins" --qos_correction_interval_min="0ns" --quiet="false"
--recover="reconnect" --recovery_timeout="15mins" --registration_backoff_factor="10ms" --resources="cpus:2;gpus:0;mem:1024;disk:1024;ports:[31000-32000]"
--revocable_cpu_low_priority="true" --runtime_dir="/tmp/Endpoint_SlaveEndpointTest_NoAuthorizer_0_8aAIDl"
--sandbox_directory="/mnt/mesos/sandbox" --strict="true" --switch_user="true" --systemd_enable_support="true"
--systemd_runtime_directory="/run/systemd/system" --version="false" --work_dir="/tmp/Endpoint_SlaveEndpointTest_NoAuthorizer_0_nU1EAe"
I1022 15:45:41.532943 29429 credentials.hpp:86] Loading credential for authentication from
'/tmp/Endpoint_SlaveEndpointTest_NoAuthorizer_0_8aAIDl/credential'
I1022 15:45:41.533108 29429 slave.cpp:346] Agent using credential for: test-principal
I1022 15:45:41.533144 29429 credentials.hpp:37] Loading credentials for authentication from
'/tmp/Endpoint_SlaveEndpointTest_NoAuthorizer_0_8aAIDl/http_credentials'
I1022 15:45:41.533455 29429 http.cpp:887] Using default 'basic' HTTP authenticator for realm
'mesos-agent-readonly'
I1022 15:45:41.533591 29429 http.cpp:887] Using default 'basic' HTTP authenticator for realm
'mesos-agent-readwrite'
I1022 15:45:41.535145 29429 slave.cpp:533] Agent resources: cpus(*):2; mem(*):1024; disk(*):1024;
ports(*):[31000-32000]
I1022 15:45:41.535243 29429 slave.cpp:541] Agent attributes: [  ]
I1022 15:45:41.535257 29429 slave.cpp:546] Agent hostname: f039bd36eb05
I1022 15:45:41.536854 29431 state.cpp:57] Recovering state from '/tmp/Endpoint_SlaveEndpointTest_NoAuthorizer_0_nU1EAe/meta'
I1022 15:45:41.537195 29429 status_update_manager.cpp:203] Recovering status update manager
I1022 15:45:41.537817 29426 containerizer.cpp:557] Recovering containerizer
I1022 15:45:41.539371 29437 provisioner.cpp:253] Provisioner recovery complete
I1022 15:45:41.539726 29433 slave.cpp:5399] Finished recovery
I1022 15:45:41.540156 29433 slave.cpp:5573] Querying resource estimator for oversubscribable
resources
I1022 15:45:41.540457 29430 slave.cpp:5587] Received oversubscribable resources {} from the
resource estimator
I1022 15:45:41.542270 29434 process.cpp:3377] Handling HTTP event for process 'slave(638)'
with path: '/slave(638)/monitor/statistics'
I1022 15:45:41.543133 29426 http.cpp:839] Authorizing principal 'test-principal' to GET the
'/monitor/statistics' endpoint
I1022 15:45:41.547065 29437 slave.cpp:787] Agent terminating
[       OK ] Endpoint/SlaveEndpointTest.NoAuthorizer/0 (31 ms)
[ RUN      ] Endpoint/SlaveEndpointTest.NoAuthorizer/1
I1022 15:45:41.558253 29403 containerizer.cpp:201] Using isolation: posix/cpu,posix/mem,filesystem/posix,network/cni
W1022 15:45:41.558778 29403 backend.cpp:76] Failed to create 'aufs' backend: AufsBackend requires
root privileges, but is running as user mesos
W1022 15:45:41.558902 29403 backend.cpp:76] Failed to create 'bind' backend: BindBackend requires
root privileges
I1022 15:45:41.560180 29403 cluster.cpp:435] Creating default 'local' authorizer
I1022 15:45:41.561686 29422 slave.cpp:208] Mesos agent started on (639)@172.17.0.2:53385
I1022 15:45:41.561709 29422 slave.cpp:209] Flags at startup: --acls="" --appc_simple_discovery_uri_prefix="http://"
--appc_store_dir="/tmp/mesos/store/appc" --authenticate_http_readonly="true" --authenticate_http_readwrite="true"
--authenticatee="crammd5" --authentication_backoff_factor="1secs" --authorizer="local" --cgroups_cpu_enable_pids_and_tids_count="false"
--cgroups_enable_cfs="false" --cgroups_hierarchy="/sys/fs/cgroup" --cgroups_limit_swap="false"
--cgroups_root="mesos" --container_disk_watch_interval="15secs" --containerizers="mesos" --credential="/tmp/Endpoint_SlaveEndpointTest_NoAuthorizer_1_aBSx7N/credential"
--default_role="*" --disk_watch_interval="1mins" --docker="docker" --docker_kill_orphans="true"
--docker_registry="https://registry-1.docker.io" --docker_remove_delay="6hrs" --docker_socket="/var/run/docker.sock"
--docker_stop_timeout="0ns" --docker_store_dir="/tmp/mesos/store/docker" --docker_volume_checkpoint_dir="/var/run/mesos/isolators/docker/volume"
--enforce_container_disk_quota="false" --executor_registration_timeout="1mins" --executor_shutdown_grace_period="5secs"
--fetcher_cache_dir="/tmp/Endpoint_SlaveEndpointTest_NoAuthorizer_1_aBSx7N/fetch" --fetcher_cache_size="2GB"
--frameworks_home="" --gc_delay="1weeks" --gc_disk_headroom="0.1" --hadoop_home="" --help="false"
--hostname_lookup="true" --http_authenticators="basic" --http_command_executor="false" --http_credentials="/tmp/Endpoint_SlaveEndpointTest_NoAuthorizer_1_aBSx7N/http_credentials"
--image_provisioner_backend="copy" --initialize_driver_logging="true" --isolation="posix/cpu,posix/mem"
--launcher="posix" --launcher_dir="/mesos/mesos-1.2.0/_build/src" --logbufsecs="0" --logging_level="INFO"
--max_completed_executors_per_framework="150" --oversubscribed_resources_interval="15secs"
--perf_duration="10secs" --perf_interval="1mins" --qos_correction_interval_min="0ns" --quiet="false"
--recover="reconnect" --recovery_timeout="15mins" --registration_backoff_factor="10ms" --resources="cpus:2;gpus:0;mem:1024;disk:1024;ports:[31000-32000]"
--revocable_cpu_low_priority="true" --runtime_dir="/tmp/Endpoint_SlaveEndpointTest_NoAuthorizer_1_aBSx7N"
--sandbox_directory="/mnt/mesos/sandbox" --strict="true" --switch_user="true" --systemd_enable_support="true"
--systemd_runtime_directory="/run/systemd/system" --version="false" --work_dir="/tmp/Endpoint_SlaveEndpointTest_NoAuthorizer_1_ZqflZG"
I1022 15:45:41.562180 29422 credentials.hpp:86] Loading credential for authentication from
'/tmp/Endpoint_SlaveEndpointTest_NoAuthorizer_1_aBSx7N/credential'
I1022 15:45:41.562307 29422 slave.cpp:346] Agent using credential for: test-principal
I1022 15:45:41.562330 29422 credentials.hpp:37] Loading credentials for authentication from
'/tmp/Endpoint_SlaveEndpointTest_NoAuthorizer_1_aBSx7N/http_credentials'
I1022 15:45:41.562530 29422 http.cpp:887] Using default 'basic' HTTP authenticator for realm
'mesos-agent-readonly'
I1022 15:45:41.562662 29422 http.cpp:887] Using default 'basic' HTTP authenticator for realm
'mesos-agent-readwrite'
I1022 15:45:41.564373 29422 slave.cpp:533] Agent resources: cpus(*):2; mem(*):1024; disk(*):1024;
ports(*):[31000-32000]
I1022 15:45:41.564476 29422 slave.cpp:541] Agent attributes: [  ]
I1022 15:45:41.564492 29422 slave.cpp:546] Agent hostname: f039bd36eb05
I1022 15:45:41.566042 29427 state.cpp:57] Recovering state from '/tmp/Endpoint_SlaveEndpointTest_NoAuthorizer_1_ZqflZG/meta'
I1022 15:45:41.566301 29424 status_update_manager.cpp:203] Recovering status update manager
I1022 15:45:41.566612 29423 containerizer.cpp:557] Recovering containerizer
I1022 15:45:41.568135 29437 provisioner.cpp:253] Provisioner recovery complete
I1022 15:45:41.568640 29430 slave.cpp:5399] Finished recovery
I1022 15:45:41.569169 29430 slave.cpp:5573] Querying resource estimator for oversubscribable
resources
I1022 15:45:41.569699 29425 slave.cpp:5587] Received oversubscribable resources {} from the
resource estimator
I1022 15:45:41.571367 29434 process.cpp:3377] Handling HTTP event for process 'slave(639)'
with path: '/slave(639)/monitor/statistics.json'
I1022 15:45:41.572338 29432 http.cpp:839] Authorizing principal 'test-principal' to GET the
'/monitor/statistics.json' endpoint
I1022 15:45:41.575438 29430 slave.cpp:787] Agent terminating
[       OK ] Endpoint/SlaveEndpointTest.NoAuthorizer/1 (27 ms)
[ RUN      ] Endpoint/SlaveEndpointTest.NoAuthorizer/2
I1022 15:45:41.586536 29403 containerizer.cpp:201] Using isolation: posix/cpu,posix/mem,filesystem/posix,network/cni
W1022 15:45:41.587271 29403 backend.cpp:76] Failed to create 'aufs' backend: AufsBackend requires
root privileges, but is running as user mesos
W1022 15:45:41.587442 29403 backend.cpp:76] Failed to create 'bind' backend: BindBackend requires
root privileges
I1022 15:45:41.589025 29403 cluster.cpp:435] Creating default 'local' authorizer
I1022 15:45:41.590991 29423 slave.cpp:208] Mesos agent started on (640)@172.17.0.2:53385
I1022 15:45:41.591051 29423 slave.cpp:209] Flags at startup: --acls="" --appc_simple_discovery_uri_prefix="http://"
--appc_store_dir="/tmp/mesos/store/appc" --authenticate_http_readonly="true" --authenticate_http_readwrite="true"
--authenticatee="crammd5" --authentication_backoff_factor="1secs" --authorizer="local" --cgroups_cpu_enable_pids_and_tids_count="false"
--cgroups_enable_cfs="false" --cgroups_hierarchy="/sys/fs/cgroup" --cgroups_limit_swap="false"
--cgroups_root="mesos" --container_disk_watch_interval="15secs" --containerizers="mesos" --credential="/tmp/Endpoint_SlaveEndpointTest_NoAuthorizer_2_kybmTg/credential"
--default_role="*" --disk_watch_interval="1mins" --docker="docker" --docker_kill_orphans="true"
--docker_registry="https://registry-1.docker.io" --docker_remove_delay="6hrs" --docker_socket="/var/run/docker.sock"
--docker_stop_timeout="0ns" --docker_store_dir="/tmp/mesos/store/docker" --docker_volume_checkpoint_dir="/var/run/mesos/isolators/docker/volume"
--enforce_container_disk_quota="false" --executor_registration_timeout="1mins" --executor_shutdown_grace_period="5secs"
--fetcher_cache_dir="/tmp/Endpoint_SlaveEndpointTest_NoAuthorizer_2_kybmTg/fetch" --fetcher_cache_size="2GB"
--frameworks_home="" --gc_delay="1weeks" --gc_disk_headroom="0.1" --hadoop_home="" --help="false"
--hostname_lookup="true" --http_authenticators="basic" --http_command_executor="false" --http_credentials="/tmp/Endpoint_SlaveEndpointTest_NoAuthorizer_2_kybmTg/http_credentials"
--image_provisioner_backend="copy" --initialize_driver_logging="true" --isolation="posix/cpu,posix/mem"
--launcher="posix" --launcher_dir="/mesos/mesos-1.2.0/_build/src" --logbufsecs="0" --logging_level="INFO"
--max_completed_executors_per_framework="150" --oversubscribed_resources_interval="15secs"
--perf_duration="10secs" --perf_interval="1mins" --qos_correction_interval_min="0ns" --quiet="false"
--recover="reconnect" --recovery_timeout="15mins" --registration_backoff_factor="10ms" --resources="cpus:2;gpus:0;mem:1024;disk:1024;ports:[31000-32000]"
--revocable_cpu_low_priority="true" --runtime_dir="/tmp/Endpoint_SlaveEndpointTest_NoAuthorizer_2_kybmTg"
--sandbox_directory="/mnt/mesos/sandbox" --strict="true" --switch_user="true" --systemd_enable_support="true"
--systemd_runtime_directory="/run/systemd/system" --version="false" --work_dir="/tmp/Endpoint_SlaveEndpointTest_NoAuthorizer_2_RjKIG9"
I1022 15:45:41.591665 29423 credentials.hpp:86] Loading credential for authentication from
'/tmp/Endpoint_SlaveEndpointTest_NoAuthorizer_2_kybmTg/credential'
I1022 15:45:41.591904 29423 slave.cpp:346] Agent using credential for: test-principal
I1022 15:45:41.591935 29423 credentials.hpp:37] Loading credentials for authentication from
'/tmp/Endpoint_SlaveEndpointTest_NoAuthorizer_2_kybmTg/http_credentials'
I1022 15:45:41.592219 29423 http.cpp:887] Using default 'basic' HTTP authenticator for realm
'mesos-agent-readonly'
I1022 15:45:41.592367 29423 http.cpp:887] Using default 'basic' HTTP authenticator for realm
'mesos-agent-readwrite'
I1022 15:45:41.593837 29423 slave.cpp:533] Agent resources: cpus(*):2; mem(*):1024; disk(*):1024;
ports(*):[31000-32000]
I1022 15:45:41.593938 29423 slave.cpp:541] Agent attributes: [  ]
I1022 15:45:41.593953 29423 slave.cpp:546] Agent hostname: f039bd36eb05
I1022 15:45:41.595738 29426 state.cpp:57] Recovering state from '/tmp/Endpoint_SlaveEndpointTest_NoAuthorizer_2_RjKIG9/meta'
I1022 15:45:41.596171 29437 status_update_manager.cpp:203] Recovering status update manager
I1022 15:45:41.596449 29422 containerizer.cpp:557] Recovering containerizer
I1022 15:45:41.598186 29422 provisioner.cpp:253] Provisioner recovery complete
I1022 15:45:41.598785 29428 slave.cpp:5399] Finished recovery
I1022 15:45:41.599453 29428 slave.cpp:5573] Querying resource estimator for oversubscribable
resources
I1022 15:45:41.599805 29429 slave.cpp:5587] Received oversubscribable resources {} from the
resource estimator
I1022 15:45:41.601651 29431 process.cpp:3377] Handling HTTP event for process 'slave(640)'
with path: '/slave(640)/containers'
I1022 15:45:41.602643 29430 http.cpp:839] Authorizing principal 'test-principal' to GET the
'/containers' endpoint
I1022 15:45:41.606149 29430 slave.cpp:787] Agent terminating
[       OK ] Endpoint/SlaveEndpointTest.NoAuthorizer/2 (29 ms)
[----------] 9 tests from Endpoint/SlaveEndpointTest (291 ms total)

[----------] Global test environment tear-down
[==========] 1367 tests from 155 test cases ran. (926774 ms total)
[  PASSED  ] 1366 tests.
[  FAILED  ] 1 test, listed below:
[  FAILED  ] MasterTest.UnreachableTaskAfterFailover

 1 FAILED TEST
  YOU HAVE 5 DISABLED TESTS

make[4]: *** [check-local] Error 1
make[4]: Leaving directory `/mesos/mesos-1.2.0/_build/src'
make[3]: *** [check-am] Error 2
make[3]: Leaving directory `/mesos/mesos-1.2.0/_build/src'
make[2]: *** [check] Error 2
make[2]: Leaving directory `/mesos/mesos-1.2.0/_build/src'
make[1]: *** [check-recursive] Error 1
make[1]: Leaving directory `/mesos/mesos-1.2.0/_build'
make: *** [distcheck] Error 1
+ docker rmi mesos-1477147373-26667
Untagged: mesos-1477147373-26667:latest
Deleted: sha256:0e46c6c453d3d57e80297008bc2c0cc562f26fd17187a59776cd5e75205d15f7
Deleted: sha256:bb940ec2cfcdfb41a9f38eb35610744efda5c18b3bc53517e972740ee16ab67a
Deleted: sha256:18010f35529e02e24eb676b41b7a8f262ea8d1dacadf5d110e556c0e58933c08
Deleted: sha256:da34b455a845071f64d3dcc7f95f65194149baf66f689b2a51b0783e274aa5ac
Deleted: sha256:f828dcdb08589d63c7d0424db8cb467291351e64a0cbb6dbf4434271bfe4e5c9
Deleted: sha256:ae451e70d55086341197494f74db797073720bc1c182dda3d51d8ba09bab66cc
Deleted: sha256:772200b6d218288ce87e6dbcf852c92f7fce08748d4d1e5d6127639686624379
Deleted: sha256:8a3b26c71dee181053af9c05a7ca1a280af3109f26fe7d5a0be2f2374cfee439
Deleted: sha256:ed41e8445866f415501b382b33501154cfd2eb7f09514f07512b4508b1badb5f
Deleted: sha256:d69c08a0ea4d19d79734b25a1eb880f321a9ba97d6ec9d650e49f778e4bd69ff
Deleted: sha256:f71e18a57aff6482b76076ca01c1bb7108a4f91c682d30699bfc936eb7c1416f
Deleted: sha256:8132a4d7bb52d9e9fbdf2c1cebe107c59ba3c856a67d7fb31c7519482a27ceb7
Deleted: sha256:0a6f6dee413a7b5ec6144891a01ddbd79ce3b6cafb68e43cb204aeeaa44ed596
Deleted: sha256:3ac0a8fc421bca1382ee7d1205e51c911dcc1afd2f31e1d0e73159c3c0f2e17c
Deleted: sha256:d2376795a64d9d6d93a100ab0d80b7428327e8fd840a797d30119060794ee137
Deleted: sha256:bb3f7dc91ccf1651cbf4fb69811eaaf61437f533ffab0557007cec90c7fb15a0
Deleted: sha256:f93dbf4c358e4bc2425dbb31ef930e6e680758189f5b1589cdc7205ff8da834c
Deleted: sha256:631757235f8d99dac02a005737773e8ec2e996708c7f51f2dcf6d50253827ddc
Deleted: sha256:d657a025a251d33e5b15c7b47b4aa20438abe5201495fa7a7f41277df9367e21
Deleted: sha256:1d64e5ee3717c068eb83a680a15a530e388a4d4d6b47ac10a3abea8f1edfed27
Deleted: sha256:d6ab44e405e48223a922047228c683c362827d66b72af766488690b0028752dc
Deleted: sha256:d4ae9b1700a2ccffda2b5019ff7b64fa146881a09dbb1fb3f928498532fafa48
Deleted: sha256:b14ae10fa899e83d9ab70ac2359c9a9cb1a4d33bbfcbeb680aa810e72a5a4307
Deleted: sha256:b88d32774ce0acdb44b9c1ea9ccdd34c2a5574f86796a6e9460b6c3ab6006b40
Build step 'Execute shell' marked build as failure

Mime
View raw message