mesos-builds mailing list archives

Site index · List index
Message view « Date » · « Thread »
Top « Date » · « Thread »
From Anand Mazumdar <an...@mesosphere.io>
Subject Re: Build failed in Jenkins: Mesos » autotools,clang,--verbose --enable-libevent --enable-ssl,GLOG_v=1 MESOS_VERBOSE=1,ubuntu:14.04,(docker||Hadoop)&&(!ubuntu-us1)&&(!ubuntu-6) #2696
Date Thu, 29 Sep 2016 04:35:13 GMT
All the slave recovery tests have been flaky for a while now. The failures became more frequent
after the unified cgroups isolator changes were committed.

AFAIK, Greg/Haosdent were looking into this.

-anand

> On Sep 28, 2016, at 9:31 PM, Vinod Kone <vinodkone@apache.org> wrote:
> 
> anand, is this a known issue?
> 
> On Tue, Sep 27, 2016 at 1:27 PM, Apache Jenkins Server <
> jenkins@builds.apache.org> wrote:
> 
>> See <https://builds.apache.org/job/Mesos/BUILDTOOL=autotools,COM
>> PILER=clang,CONFIGURATION=--verbose%20--enable-libevent%20
>> --enable-ssl,ENVIRONMENT=GLOG_v=1%20MESOS_VERBOSE=1,OS=ubunt
>> u%3A14.04,label_exp=(docker%7C%7CHadoop)&&(!ubuntu-us1)&&(
>> !ubuntu-6)/2696/changes>
>> 
>> Changes:
>> 
>> [yujie.jay] Removed `CHECK` for no-existent resolv.conf for root
>> containers.
>> 
>> ------------------------------------------
>> [...truncated 209007 lines...]
>> [       OK ] Endpoint/SlaveEndpointTest.AuthorizedRequest/0 (31 ms)
>> [ RUN      ] Endpoint/SlaveEndpointTest.AuthorizedRequest/1
>> I0927 20:25:36.723181 28664 containerizer.cpp:224] Using isolation:
>> posix/cpu,posix/mem,filesystem/posix,network/cni
>> W0927 20:25:36.723701 28664 backend.cpp:75] Failed to create 'aufs'
>> backend: AufsBackend requires root privileges, but is running as user mesos
>> W0927 20:25:36.723850 28664 backend.cpp:75] Failed to create 'bind'
>> backend: BindBackend requires root privileges
>> I0927 20:25:36.726480 28687 slave.cpp:208] Mesos agent started on (606)@
>> 172.17.0.1:46389
>> I0927 20:25:36.726546 28687 slave.cpp:209] Flags at startup: --acls=""
>> --appc_simple_discovery_uri_prefix="http://"
>> --appc_store_dir="/tmp/mesos/store/appc" --authenticate_http_readonly="true"
>> --authenticate_http_readwrite="true" --authenticatee="crammd5"
>> --authentication_backoff_factor="1secs" --authorizer="local"
>> --cgroups_cpu_enable_pids_and_tids_count="false"
>> --cgroups_enable_cfs="false" --cgroups_hierarchy="/sys/fs/cgroup"
>> --cgroups_limit_swap="false" --cgroups_root="mesos"
>> --container_disk_watch_interval="15secs" --containerizers="mesos"
>> --credential="/tmp/Endpoint_SlaveEndpointTest_AuthorizedRequest_1_oygK6g/credential"
>> --default_role="*" --disk_watch_interval="1mins" --docker="docker"
>> --docker_kill_orphans="true" --docker_registry="https://reg
>> istry-1.docker.io" --docker_remove_delay="6hrs"
>> --docker_socket="/var/run/docker.sock" --docker_stop_timeout="0ns"
>> --docker_store_dir="/tmp/mesos/store/docker"
>> --docker_volume_checkpoint_dir="/var/run/mesos/isolators/docker/volume"
>> --enforce_container_disk_quota="false" --executor_registration_timeout="1mins"
>> --executor_shutdown_grace_period="5secs" --fetcher_cache_dir="/tmp/Endp
>> oint_SlaveEndpointTest_AuthorizedRequest_1_oygK6g/fetch"
>> --fetcher_cache_size="2GB" --frameworks_home="" --gc_delay="1weeks"
>> --gc_disk_headroom="0.1" --hadoop_home="" --help="false"
>> --hostname_lookup="true" --http_authenticators="basic"
>> --http_command_executor="false" --http_credentials="/tmp/Endpo
>> int_SlaveEndpointTest_AuthorizedRequest_1_oygK6g/http_credentials"
>> --image_provisioner_backend="copy" --initialize_driver_logging="true"
>> --isolation="posix/cpu,posix/mem" --launcher="posix"
>> --launcher_dir="/mesos/mesos-1.1.0/_build/src" --logbufsecs="0"
>> --logging_level="INFO" --oversubscribed_resources_interval="15secs"
>> --perf_duration="10secs" --perf_interval="1mins"
>> --qos_correction_interval_min="0ns" --quiet="false" --recover="reconnect"
>> --recovery_timeout="15mins" --registration_backoff_factor="10ms"
>> --resources="cpus:2;gpus:0;mem:1024;disk:1024;ports:[31000-32000]"
>> --revocable_cpu_low_priority="true" --runtime_dir="/tmp/Endpoint_S
>> laveEndpointTest_AuthorizedRequest_1_oygK6g"
>> --sandbox_directory="/mnt/mesos/sandbox" --strict="true"
>> --switch_user="true" --systemd_enable_support="true"
>> --systemd_runtime_directory="/run/systemd/system" --version="false"
>> --work_dir="/tmp/Endpoint_SlaveEndpointTest_AuthorizedRequest_1_PxWLxQ"
>> I0927 20:25:36.727224 28687 credentials.hpp:86] Loading credential for
>> authentication from '/tmp/Endpoint_SlaveEndpointTe
>> st_AuthorizedRequest_1_oygK6g/credential'
>> I0927 20:25:36.727396 28687 slave.cpp:346] Agent using credential for:
>> test-principal
>> I0927 20:25:36.727421 28687 credentials.hpp:37] Loading credentials for
>> authentication from '/tmp/Endpoint_SlaveEndpointTe
>> st_AuthorizedRequest_1_oygK6g/http_credentials'
>> I0927 20:25:36.727661 28687 http.cpp:883] Using default 'basic' HTTP
>> authenticator for realm 'mesos-agent-readonly'
>> I0927 20:25:36.727792 28687 http.cpp:883] Using default 'basic' HTTP
>> authenticator for realm 'mesos-agent-readwrite'
>> I0927 20:25:36.729074 28687 slave.cpp:533] Agent resources: cpus(*):2;
>> mem(*):1024; disk(*):1024; ports(*):[31000-32000]
>> I0927 20:25:36.729208 28687 slave.cpp:541] Agent attributes: [  ]
>> I0927 20:25:36.729228 28687 slave.cpp:546] Agent hostname: 67ecb3fe2a7a
>> I0927 20:25:36.731178 28690 state.cpp:57] Recovering state from
>> '/tmp/Endpoint_SlaveEndpointTest_AuthorizedRequest_1_PxWLxQ/meta'
>> I0927 20:25:36.731241 28687 process.cpp:3336] Handling HTTP event for
>> process 'slave(606)' with path: '/slave(606)/monitor/statistics.json'
>> I0927 20:25:36.731807 28693 status_update_manager.cpp:203] Recovering
>> status update manager
>> I0927 20:25:36.732007 28697 containerizer.cpp:579] Recovering containerizer
>> I0927 20:25:36.732328 28687 http.cpp:835] Authorizing principal
>> 'test-principal' to GET the '/monitor/statistics.json' endpoint
>> I0927 20:25:36.733836 28682 provisioner.cpp:253] Provisioner recovery
>> complete
>> I0927 20:25:36.734483 28687 slave.cpp:5252] Finished recovery
>> I0927 20:25:36.735404 28687 slave.cpp:5424] Querying resource estimator
>> for oversubscribable resources
>> I0927 20:25:36.735905 28694 slave.cpp:5438] Received oversubscribable
>> resources {} from the resource estimator
>> I0927 20:25:36.736884 28691 slave.cpp:787] Agent terminating
>> [       OK ] Endpoint/SlaveEndpointTest.AuthorizedRequest/1 (23 ms)
>> [ RUN      ] Endpoint/SlaveEndpointTest.AuthorizedRequest/2
>> I0927 20:25:36.745683 28664 containerizer.cpp:224] Using isolation:
>> posix/cpu,posix/mem,filesystem/posix,network/cni
>> W0927 20:25:36.746232 28664 backend.cpp:75] Failed to create 'aufs'
>> backend: AufsBackend requires root privileges, but is running as user mesos
>> W0927 20:25:36.746390 28664 backend.cpp:75] Failed to create 'bind'
>> backend: BindBackend requires root privileges
>> I0927 20:25:36.749389 28689 slave.cpp:208] Mesos agent started on (607)@
>> 172.17.0.1:46389
>> I0927 20:25:36.749460 28689 slave.cpp:209] Flags at startup: --acls=""
>> --appc_simple_discovery_uri_prefix="http://"
>> --appc_store_dir="/tmp/mesos/store/appc" --authenticate_http_readonly="true"
>> --authenticate_http_readwrite="true" --authenticatee="crammd5"
>> --authentication_backoff_factor="1secs" --authorizer="local"
>> --cgroups_cpu_enable_pids_and_tids_count="false"
>> --cgroups_enable_cfs="false" --cgroups_hierarchy="/sys/fs/cgroup"
>> --cgroups_limit_swap="false" --cgroups_root="mesos"
>> --container_disk_watch_interval="15secs" --containerizers="mesos"
>> --credential="/tmp/Endpoint_SlaveEndpointTest_AuthorizedRequest_2_9bRrtY/credential"
>> --default_role="*" --disk_watch_interval="1mins" --docker="docker"
>> --docker_kill_orphans="true" --docker_registry="https://reg
>> istry-1.docker.io" --docker_remove_delay="6hrs"
>> --docker_socket="/var/run/docker.sock" --docker_stop_timeout="0ns"
>> --docker_store_dir="/tmp/mesos/store/docker"
>> --docker_volume_checkpoint_dir="/var/run/mesos/isolators/docker/volume"
>> --enforce_container_disk_quota="false" --executor_registration_timeout="1mins"
>> --executor_shutdown_grace_period="5secs" --fetcher_cache_dir="/tmp/Endp
>> oint_SlaveEndpointTest_AuthorizedRequest_2_9bRrtY/fetch"
>> --fetcher_cache_size="2GB" --frameworks_home="" --gc_delay="1weeks"
>> --gc_disk_headroom="0.1" --hadoop_home="" --help="false"
>> --hostname_lookup="true" --http_authenticators="basic"
>> --http_command_executor="false" --http_credentials="/tmp/Endpo
>> int_SlaveEndpointTest_AuthorizedRequest_2_9bRrtY/http_credentials"
>> --image_provisioner_backend="copy" --initialize_driver_logging="true"
>> --isolation="posix/cpu,posix/mem" --launcher="posix"
>> --launcher_dir="/mesos/mesos-1.1.0/_build/src" --logbufsecs="0"
>> --logging_level="INFO" --oversubscribed_resources_interval="15secs"
>> --perf_duration="10secs" --perf_interval="1mins"
>> --qos_correction_interval_min="0ns" --quiet="false" --recover="reconnect"
>> --recovery_timeout="15mins" --registration_backoff_factor="10ms"
>> --resources="cpus:2;gpus:0;mem:1024;disk:1024;ports:[31000-32000]"
>> --revocable_cpu_low_priority="true" --runtime_dir="/tmp/Endpoint_S
>> laveEndpointTest_AuthorizedRequest_2_9bRrtY"
>> --sandbox_directory="/mnt/mesos/sandbox" --strict="true"
>> --switch_user="true" --systemd_enable_support="true"
>> --systemd_runtime_directory="/run/systemd/system" --version="false"
>> --work_dir="/tmp/Endpoint_SlaveEndpointTest_AuthorizedRequest_2_CYgYWy"
>> I0927 20:25:36.750027 28689 credentials.hpp:86] Loading credential for
>> authentication from '/tmp/Endpoint_SlaveEndpointTe
>> st_AuthorizedRequest_2_9bRrtY/credential'
>> I0927 20:25:36.750224 28689 slave.cpp:346] Agent using credential for:
>> test-principal
>> I0927 20:25:36.750244 28689 credentials.hpp:37] Loading credentials for
>> authentication from '/tmp/Endpoint_SlaveEndpointTe
>> st_AuthorizedRequest_2_9bRrtY/http_credentials'
>> I0927 20:25:36.750473 28689 http.cpp:883] Using default 'basic' HTTP
>> authenticator for realm 'mesos-agent-readonly'
>> I0927 20:25:36.750655 28689 http.cpp:883] Using default 'basic' HTTP
>> authenticator for realm 'mesos-agent-readwrite'
>> I0927 20:25:36.751963 28689 slave.cpp:533] Agent resources: cpus(*):2;
>> mem(*):1024; disk(*):1024; ports(*):[31000-32000]
>> I0927 20:25:36.752074 28689 slave.cpp:541] Agent attributes: [  ]
>> I0927 20:25:36.752087 28689 slave.cpp:546] Agent hostname: 67ecb3fe2a7a
>> I0927 20:25:36.754294 28682 state.cpp:57] Recovering state from
>> '/tmp/Endpoint_SlaveEndpointTest_AuthorizedRequest_2_CYgYWy/meta'
>> I0927 20:25:36.754488 28689 process.cpp:3336] Handling HTTP event for
>> process 'slave(607)' with path: '/slave(607)/containers'
>> I0927 20:25:36.755136 28682 status_update_manager.cpp:203] Recovering
>> status update manager
>> I0927 20:25:36.755334 28696 containerizer.cpp:579] Recovering containerizer
>> I0927 20:25:36.756008 28691 http.cpp:835] Authorizing principal
>> 'test-principal' to GET the '/containers' endpoint
>> I0927 20:25:36.756503 28686 provisioner.cpp:253] Provisioner recovery
>> complete
>> I0927 20:25:36.757453 28693 slave.cpp:5252] Finished recovery
>> I0927 20:25:36.757973 28693 slave.cpp:5424] Querying resource estimator
>> for oversubscribable resources
>> I0927 20:25:36.758422 28695 slave.cpp:5438] Received oversubscribable
>> resources {} from the resource estimator
>> I0927 20:25:36.759142 28691 slave.cpp:787] Agent terminating
>> [       OK ] Endpoint/SlaveEndpointTest.AuthorizedRequest/2 (23 ms)
>> [ RUN      ] Endpoint/SlaveEndpointTest.UnauthorizedRequest/0
>> I0927 20:25:36.769356 28664 containerizer.cpp:224] Using isolation:
>> posix/cpu,posix/mem,filesystem/posix,network/cni
>> W0927 20:25:36.769973 28664 backend.cpp:75] Failed to create 'aufs'
>> backend: AufsBackend requires root privileges, but is running as user mesos
>> W0927 20:25:36.770117 28664 backend.cpp:75] Failed to create 'bind'
>> backend: BindBackend requires root privileges
>> I0927 20:25:36.773274 28685 slave.cpp:208] Mesos agent started on (608)@
>> 172.17.0.1:46389
>> I0927 20:25:36.773311 28685 slave.cpp:209] Flags at startup: --acls=""
>> --appc_simple_discovery_uri_prefix="http://"
>> --appc_store_dir="/tmp/mesos/store/appc" --authenticate_http_readonly="true"
>> --authenticate_http_readwrite="true" --authenticatee="crammd5"
>> --authentication_backoff_factor="1secs" --authorizer="local"
>> --cgroups_cpu_enable_pids_and_tids_count="false"
>> --cgroups_enable_cfs="false" --cgroups_hierarchy="/sys/fs/cgroup"
>> --cgroups_limit_swap="false" --cgroups_root="mesos"
>> --container_disk_watch_interval="15secs" --containerizers="mesos"
>> --credential="/tmp/Endpoint_SlaveEndpointTest_UnauthorizedRequest_0_oFSsbH/credential"
>> --default_role="*" --disk_watch_interval="1mins" --docker="docker"
>> --docker_kill_orphans="true" --docker_registry="https://reg
>> istry-1.docker.io" --docker_remove_delay="6hrs"
>> --docker_socket="/var/run/docker.sock" --docker_stop_timeout="0ns"
>> --docker_store_dir="/tmp/mesos/store/docker"
>> --docker_volume_checkpoint_dir="/var/run/mesos/isolators/docker/volume"
>> --enforce_container_disk_quota="false" --executor_registration_timeout="1mins"
>> --executor_shutdown_grace_period="5secs" --fetcher_cache_dir="/tmp/Endp
>> oint_SlaveEndpointTest_UnauthorizedRequest_0_oFSsbH/fetch"
>> --fetcher_cache_size="2GB" --frameworks_home="" --gc_delay="1weeks"
>> --gc_disk_headroom="0.1" --hadoop_home="" --help="false"
>> --hostname_lookup="true" --http_authenticators="basic"
>> --http_command_executor="false" --http_credentials="/tmp/Endpo
>> int_SlaveEndpointTest_UnauthorizedRequest_0_oFSsbH/http_credentials"
>> --image_provisioner_backend="copy" --initialize_driver_logging="true"
>> --isolation="posix/cpu,posix/mem" --launcher="posix"
>> --launcher_dir="/mesos/mesos-1.1.0/_build/src" --logbufsecs="0"
>> --logging_level="INFO" --oversubscribed_resources_interval="15secs"
>> --perf_duration="10secs" --perf_interval="1mins"
>> --qos_correction_interval_min="0ns" --quiet="false" --recover="reconnect"
>> --recovery_timeout="15mins" --registration_backoff_factor="10ms"
>> --resources="cpus:2;gpus:0;mem:1024;disk:1024;ports:[31000-32000]"
>> --revocable_cpu_low_priority="true" --runtime_dir="/tmp/Endpoint_S
>> laveEndpointTest_UnauthorizedRequest_0_oFSsbH"
>> --sandbox_directory="/mnt/mesos/sandbox" --strict="true"
>> --switch_user="true" --systemd_enable_support="true"
>> --systemd_runtime_directory="/run/systemd/system" --version="false"
>> --work_dir="/tmp/Endpoint_SlaveEndpointTest_UnauthorizedRequest_0_mNNZug"
>> I0927 20:25:36.773874 28685 credentials.hpp:86] Loading credential for
>> authentication from '/tmp/Endpoint_SlaveEndpointTe
>> st_UnauthorizedRequest_0_oFSsbH/credential'
>> I0927 20:25:36.774050 28685 slave.cpp:346] Agent using credential for:
>> test-principal
>> I0927 20:25:36.774071 28685 credentials.hpp:37] Loading credentials for
>> authentication from '/tmp/Endpoint_SlaveEndpointTe
>> st_UnauthorizedRequest_0_oFSsbH/http_credentials'
>> I0927 20:25:36.774312 28685 http.cpp:883] Using default 'basic' HTTP
>> authenticator for realm 'mesos-agent-readonly'
>> I0927 20:25:36.774457 28685 http.cpp:883] Using default 'basic' HTTP
>> authenticator for realm 'mesos-agent-readwrite'
>> I0927 20:25:36.775478 28685 slave.cpp:533] Agent resources: cpus(*):2;
>> mem(*):1024; disk(*):1024; ports(*):[31000-32000]
>> I0927 20:25:36.775548 28685 slave.cpp:541] Agent attributes: [  ]
>> I0927 20:25:36.775562 28685 slave.cpp:546] Agent hostname: 67ecb3fe2a7a
>> I0927 20:25:36.777245 28696 state.cpp:57] Recovering state from
>> '/tmp/Endpoint_SlaveEndpointTest_UnauthorizedRequest_0_mNNZug/meta'
>> I0927 20:25:36.777312 28685 process.cpp:3336] Handling HTTP event for
>> process 'slave(608)' with path: '/slave(608)/monitor/statistics'
>> I0927 20:25:36.777753 28684 status_update_manager.cpp:203] Recovering
>> status update manager
>> I0927 20:25:36.778131 28692 containerizer.cpp:579] Recovering containerizer
>> I0927 20:25:36.779031 28687 http.cpp:835] Authorizing principal
>> 'test-principal' to GET the '/monitor/statistics' endpoint
>> I0927 20:25:36.779261 28692 provisioner.cpp:253] Provisioner recovery
>> complete
>> I0927 20:25:36.779469 28694 slave.cpp:5252] Finished recovery
>> I0927 20:25:36.779933 28694 slave.cpp:5424] Querying resource estimator
>> for oversubscribable resources
>> I0927 20:25:36.780187 28685 slave.cpp:5438] Received oversubscribable
>> resources {} from the resource estimator
>> I0927 20:25:36.781406 28694 slave.cpp:787] Agent terminating
>> [       OK ] Endpoint/SlaveEndpointTest.UnauthorizedRequest/0 (20 ms)
>> [ RUN      ] Endpoint/SlaveEndpointTest.UnauthorizedRequest/1
>> I0927 20:25:36.789695 28664 containerizer.cpp:224] Using isolation:
>> posix/cpu,posix/mem,filesystem/posix,network/cni
>> W0927 20:25:36.790288 28664 backend.cpp:75] Failed to create 'aufs'
>> backend: AufsBackend requires root privileges, but is running as user mesos
>> W0927 20:25:36.790429 28664 backend.cpp:75] Failed to create 'bind'
>> backend: BindBackend requires root privileges
>> I0927 20:25:36.792964 28686 slave.cpp:208] Mesos agent started on (609)@
>> 172.17.0.1:46389
>> I0927 20:25:36.793007 28686 slave.cpp:209] Flags at startup: --acls=""
>> --appc_simple_discovery_uri_prefix="http://"
>> --appc_store_dir="/tmp/mesos/store/appc" --authenticate_http_readonly="true"
>> --authenticate_http_readwrite="true" --authenticatee="crammd5"
>> --authentication_backoff_factor="1secs" --authorizer="local"
>> --cgroups_cpu_enable_pids_and_tids_count="false"
>> --cgroups_enable_cfs="false" --cgroups_hierarchy="/sys/fs/cgroup"
>> --cgroups_limit_swap="false" --cgroups_root="mesos"
>> --container_disk_watch_interval="15secs" --containerizers="mesos"
>> --credential="/tmp/Endpoint_SlaveEndpointTest_UnauthorizedRequest_1_jNM46p/credential"
>> --default_role="*" --disk_watch_interval="1mins" --docker="docker"
>> --docker_kill_orphans="true" --docker_registry="https://reg
>> istry-1.docker.io" --docker_remove_delay="6hrs"
>> --docker_socket="/var/run/docker.sock" --docker_stop_timeout="0ns"
>> --docker_store_dir="/tmp/mesos/store/docker"
>> --docker_volume_checkpoint_dir="/var/run/mesos/isolators/docker/volume"
>> --enforce_container_disk_quota="false" --executor_registration_timeout="1mins"
>> --executor_shutdown_grace_period="5secs" --fetcher_cache_dir="/tmp/Endp
>> oint_SlaveEndpointTest_UnauthorizedRequest_1_jNM46p/fetch"
>> --fetcher_cache_size="2GB" --frameworks_home="" --gc_delay="1weeks"
>> --gc_disk_headroom="0.1" --hadoop_home="" --help="false"
>> --hostname_lookup="true" --http_authenticators="basic"
>> --http_command_executor="false" --http_credentials="/tmp/Endpo
>> int_SlaveEndpointTest_UnauthorizedRequest_1_jNM46p/http_credentials"
>> --image_provisioner_backend="copy" --initialize_driver_logging="true"
>> --isolation="posix/cpu,posix/mem" --launcher="posix"
>> --launcher_dir="/mesos/mesos-1.1.0/_build/src" --logbufsecs="0"
>> --logging_level="INFO" --oversubscribed_resources_interval="15secs"
>> --perf_duration="10secs" --perf_interval="1mins"
>> --qos_correction_interval_min="0ns" --quiet="false" --recover="reconnect"
>> --recovery_timeout="15mins" --registration_backoff_factor="10ms"
>> --resources="cpus:2;gpus:0;mem:1024;disk:1024;ports:[31000-32000]"
>> --revocable_cpu_low_priority="true" --runtime_dir="/tmp/Endpoint_S
>> laveEndpointTest_UnauthorizedRequest_1_jNM46p"
>> --sandbox_directory="/mnt/mesos/sandbox" --strict="true"
>> --switch_user="true" --systemd_enable_support="true"
>> --systemd_runtime_directory="/run/systemd/system" --version="false"
>> --work_dir="/tmp/Endpoint_SlaveEndpointTest_UnauthorizedRequest_1_iYdinZ"
>> I0927 20:25:36.793371 28686 credentials.hpp:86] Loading credential for
>> authentication from '/tmp/Endpoint_SlaveEndpointTe
>> st_UnauthorizedRequest_1_jNM46p/credential'
>> I0927 20:25:36.793500 28686 slave.cpp:346] Agent using credential for:
>> test-principal
>> I0927 20:25:36.793516 28686 credentials.hpp:37] Loading credentials for
>> authentication from '/tmp/Endpoint_SlaveEndpointTe
>> st_UnauthorizedRequest_1_jNM46p/http_credentials'
>> I0927 20:25:36.793736 28686 http.cpp:883] Using default 'basic' HTTP
>> authenticator for realm 'mesos-agent-readonly'
>> I0927 20:25:36.793890 28686 http.cpp:883] Using default 'basic' HTTP
>> authenticator for realm 'mesos-agent-readwrite'
>> I0927 20:25:36.794945 28686 slave.cpp:533] Agent resources: cpus(*):2;
>> mem(*):1024; disk(*):1024; ports(*):[31000-32000]
>> I0927 20:25:36.795017 28686 slave.cpp:541] Agent attributes: [  ]
>> I0927 20:25:36.795029 28686 slave.cpp:546] Agent hostname: 67ecb3fe2a7a
>> I0927 20:25:36.796252 28692 state.cpp:57] Recovering state from
>> '/tmp/Endpoint_SlaveEndpointTest_UnauthorizedRequest_1_iYdinZ/meta'
>> I0927 20:25:36.796339 28686 process.cpp:3336] Handling HTTP event for
>> process 'slave(609)' with path: '/slave(609)/monitor/statistics.json'
>> I0927 20:25:36.796711 28694 status_update_manager.cpp:203] Recovering
>> status update manager
>> I0927 20:25:36.796964 28694 containerizer.cpp:579] Recovering containerizer
>> I0927 20:25:36.797061 28690 http.cpp:835] Authorizing principal
>> 'test-principal' to GET the '/monitor/statistics.json' endpoint
>> I0927 20:25:36.798485 28697 provisioner.cpp:253] Provisioner recovery
>> complete
>> I0927 20:25:36.798712 28683 slave.cpp:5252] Finished recovery
>> I0927 20:25:36.799266 28683 slave.cpp:5424] Querying resource estimator
>> for oversubscribable resources
>> I0927 20:25:36.799366 28683 slave.cpp:787] Agent terminating
>> [       OK ] Endpoint/SlaveEndpointTest.UnauthorizedRequest/1 (17 ms)
>> [ RUN      ] Endpoint/SlaveEndpointTest.UnauthorizedRequest/2
>> I0927 20:25:36.807145 28664 containerizer.cpp:224] Using isolation:
>> posix/cpu,posix/mem,filesystem/posix,network/cni
>> W0927 20:25:36.807708 28664 backend.cpp:75] Failed to create 'aufs'
>> backend: AufsBackend requires root privileges, but is running as user mesos
>> W0927 20:25:36.807852 28664 backend.cpp:75] Failed to create 'bind'
>> backend: BindBackend requires root privileges
>> I0927 20:25:36.810735 28695 slave.cpp:208] Mesos agent started on (610)@
>> 172.17.0.1:46389
>> I0927 20:25:36.810777 28695 slave.cpp:209] Flags at startup: --acls=""
>> --appc_simple_discovery_uri_prefix="http://"
>> --appc_store_dir="/tmp/mesos/store/appc" --authenticate_http_readonly="true"
>> --authenticate_http_readwrite="true" --authenticatee="crammd5"
>> --authentication_backoff_factor="1secs" --authorizer="local"
>> --cgroups_cpu_enable_pids_and_tids_count="false"
>> --cgroups_enable_cfs="false" --cgroups_hierarchy="/sys/fs/cgroup"
>> --cgroups_limit_swap="false" --cgroups_root="mesos"
>> --container_disk_watch_interval="15secs" --containerizers="mesos"
>> --credential="/tmp/Endpoint_SlaveEndpointTest_UnauthorizedRequest_2_zYrne9/credential"
>> --default_role="*" --disk_watch_interval="1mins" --docker="docker"
>> --docker_kill_orphans="true" --docker_registry="https://reg
>> istry-1.docker.io" --docker_remove_delay="6hrs"
>> --docker_socket="/var/run/docker.sock" --docker_stop_timeout="0ns"
>> --docker_store_dir="/tmp/mesos/store/docker"
>> --docker_volume_checkpoint_dir="/var/run/mesos/isolators/docker/volume"
>> --enforce_container_disk_quota="false" --executor_registration_timeout="1mins"
>> --executor_shutdown_grace_period="5secs" --fetcher_cache_dir="/tmp/Endp
>> oint_SlaveEndpointTest_UnauthorizedRequest_2_zYrne9/fetch"
>> --fetcher_cache_size="2GB" --frameworks_home="" --gc_delay="1weeks"
>> --gc_disk_headroom="0.1" --hadoop_home="" --help="false"
>> --hostname_lookup="true" --http_authenticators="basic"
>> --http_command_executor="false" --http_credentials="/tmp/Endpo
>> int_SlaveEndpointTest_UnauthorizedRequest_2_zYrne9/http_credentials"
>> --image_provisioner_backend="copy" --initialize_driver_logging="true"
>> --isolation="posix/cpu,posix/mem" --launcher="posix"
>> --launcher_dir="/mesos/mesos-1.1.0/_build/src" --logbufsecs="0"
>> --logging_level="INFO" --oversubscribed_resources_interval="15secs"
>> --perf_duration="10secs" --perf_interval="1mins"
>> --qos_correction_interval_min="0ns" --quiet="false" --recover="reconnect"
>> --recovery_timeout="15mins" --registration_backoff_factor="10ms"
>> --resources="cpus:2;gpus:0;mem:1024;disk:1024;ports:[31000-32000]"
>> --revocable_cpu_low_priority="true" --runtime_dir="/tmp/Endpoint_S
>> laveEndpointTest_UnauthorizedRequest_2_zYrne9"
>> --sandbox_directory="/mnt/mesos/sandbox" --strict="true"
>> --switch_user="true" --systemd_enable_support="true"
>> --systemd_runtime_directory="/run/systemd/system" --version="false"
>> --work_dir="/tmp/Endpoint_SlaveEndpointTest_UnauthorizedRequest_2_LgTJrI"
>> I0927 20:25:36.811512 28695 credentials.hpp:86] Loading credential for
>> authentication from '/tmp/Endpoint_SlaveEndpointTe
>> st_UnauthorizedRequest_2_zYrne9/credential'
>> I0927 20:25:36.811712 28695 slave.cpp:346] Agent using credential for:
>> test-principal
>> I0927 20:25:36.811733 28695 credentials.hpp:37] Loading credentials for
>> authentication from '/tmp/Endpoint_SlaveEndpointTe
>> st_UnauthorizedRequest_2_zYrne9/http_credentials'
>> I0927 20:25:36.811997 28695 http.cpp:883] Using default 'basic' HTTP
>> authenticator for realm 'mesos-agent-readonly'
>> I0927 20:25:36.812131 28695 http.cpp:883] Using default 'basic' HTTP
>> authenticator for realm 'mesos-agent-readwrite'
>> I0927 20:25:36.813241 28695 slave.cpp:533] Agent resources: cpus(*):2;
>> mem(*):1024; disk(*):1024; ports(*):[31000-32000]
>> I0927 20:25:36.813313 28695 slave.cpp:541] Agent attributes: [  ]
>> I0927 20:25:36.813325 28695 slave.cpp:546] Agent hostname: 67ecb3fe2a7a
>> I0927 20:25:36.814754 28683 state.cpp:57] Recovering state from
>> '/tmp/Endpoint_SlaveEndpointTest_UnauthorizedRequest_2_LgTJrI/meta'
>> I0927 20:25:36.814867 28695 process.cpp:3336] Handling HTTP event for
>> process 'slave(610)' with path: '/slave(610)/containers'
>> I0927 20:25:36.815330 28692 status_update_manager.cpp:203] Recovering
>> status update manager
>> I0927 20:25:36.815557 28695 containerizer.cpp:579] Recovering containerizer
>> I0927 20:25:36.815795 28692 http.cpp:835] Authorizing principal
>> 'test-principal' to GET the '/containers' endpoint
>> I0927 20:25:36.817735 28695 provisioner.cpp:253] Provisioner recovery
>> complete
>> I0927 20:25:36.818361 28695 slave.cpp:5252] Finished recovery
>> I0927 20:25:36.820197 28695 slave.cpp:5424] Querying resource estimator
>> for oversubscribable resources
>> I0927 20:25:36.820320 28695 slave.cpp:787] Agent terminating
>> [       OK ] Endpoint/SlaveEndpointTest.UnauthorizedRequest/2 (23 ms)
>> [ RUN      ] Endpoint/SlaveEndpointTest.NoAuthorizer/0
>> I0927 20:25:36.830476 28664 containerizer.cpp:224] Using isolation:
>> posix/cpu,posix/mem,filesystem/posix,network/cni
>> W0927 20:25:36.831151 28664 backend.cpp:75] Failed to create 'aufs'
>> backend: AufsBackend requires root privileges, but is running as user mesos
>> W0927 20:25:36.831300 28664 backend.cpp:75] Failed to create 'bind'
>> backend: BindBackend requires root privileges
>> I0927 20:25:36.832577 28664 cluster.cpp:435] Creating default 'local'
>> authorizer
>> I0927 20:25:36.834317 28691 slave.cpp:208] Mesos agent started on (611)@
>> 172.17.0.1:46389
>> I0927 20:25:36.834359 28691 slave.cpp:209] Flags at startup: --acls=""
>> --appc_simple_discovery_uri_prefix="http://"
>> --appc_store_dir="/tmp/mesos/store/appc" --authenticate_http_readonly="true"
>> --authenticate_http_readwrite="true" --authenticatee="crammd5"
>> --authentication_backoff_factor="1secs" --authorizer="local"
>> --cgroups_cpu_enable_pids_and_tids_count="false"
>> --cgroups_enable_cfs="false" --cgroups_hierarchy="/sys/fs/cgroup"
>> --cgroups_limit_swap="false" --cgroups_root="mesos"
>> --container_disk_watch_interval="15secs" --containerizers="mesos"
>> --credential="/tmp/Endpoint_SlaveEndpointTest_NoAuthorizer_0_44n6zS/credential"
>> --default_role="*" --disk_watch_interval="1mins" --docker="docker"
>> --docker_kill_orphans="true" --docker_registry="https://reg
>> istry-1.docker.io" --docker_remove_delay="6hrs"
>> --docker_socket="/var/run/docker.sock" --docker_stop_timeout="0ns"
>> --docker_store_dir="/tmp/mesos/store/docker"
>> --docker_volume_checkpoint_dir="/var/run/mesos/isolators/docker/volume"
>> --enforce_container_disk_quota="false" --executor_registration_timeout="1mins"
>> --executor_shutdown_grace_period="5secs" --fetcher_cache_dir="/tmp/Endp
>> oint_SlaveEndpointTest_NoAuthorizer_0_44n6zS/fetch"
>> --fetcher_cache_size="2GB" --frameworks_home="" --gc_delay="1weeks"
>> --gc_disk_headroom="0.1" --hadoop_home="" --help="false"
>> --hostname_lookup="true" --http_authenticators="basic"
>> --http_command_executor="false" --http_credentials="/tmp/Endpo
>> int_SlaveEndpointTest_NoAuthorizer_0_44n6zS/http_credentials"
>> --image_provisioner_backend="copy" --initialize_driver_logging="true"
>> --isolation="posix/cpu,posix/mem" --launcher="posix"
>> --launcher_dir="/mesos/mesos-1.1.0/_build/src" --logbufsecs="0"
>> --logging_level="INFO" --oversubscribed_resources_interval="15secs"
>> --perf_duration="10secs" --perf_interval="1mins"
>> --qos_correction_interval_min="0ns" --quiet="false" --recover="reconnect"
>> --recovery_timeout="15mins" --registration_backoff_factor="10ms"
>> --resources="cpus:2;gpus:0;mem:1024;disk:1024;ports:[31000-32000]"
>> --revocable_cpu_low_priority="true" --runtime_dir="/tmp/Endpoint_S
>> laveEndpointTest_NoAuthorizer_0_44n6zS" --sandbox_directory="/mnt/mesos/sandbox"
>> --strict="true" --switch_user="true" --systemd_enable_support="true"
>> --systemd_runtime_directory="/run/systemd/system" --version="false"
>> --work_dir="/tmp/Endpoint_SlaveEndpointTest_NoAuthorizer_0_YioIJr"
>> I0927 20:25:36.834960 28691 credentials.hpp:86] Loading credential for
>> authentication from '/tmp/Endpoint_SlaveEndpointTe
>> st_NoAuthorizer_0_44n6zS/credential'
>> I0927 20:25:36.835147 28691 slave.cpp:346] Agent using credential for:
>> test-principal
>> I0927 20:25:36.835170 28691 credentials.hpp:37] Loading credentials for
>> authentication from '/tmp/Endpoint_SlaveEndpointTe
>> st_NoAuthorizer_0_44n6zS/http_credentials'
>> I0927 20:25:36.835418 28691 http.cpp:883] Using default 'basic' HTTP
>> authenticator for realm 'mesos-agent-readonly'
>> I0927 20:25:36.835575 28691 http.cpp:883] Using default 'basic' HTTP
>> authenticator for realm 'mesos-agent-readwrite'
>> I0927 20:25:36.837025 28691 slave.cpp:533] Agent resources: cpus(*):2;
>> mem(*):1024; disk(*):1024; ports(*):[31000-32000]
>> I0927 20:25:36.837100 28691 slave.cpp:541] Agent attributes: [  ]
>> I0927 20:25:36.837111 28691 slave.cpp:546] Agent hostname: 67ecb3fe2a7a
>> I0927 20:25:36.838589 28697 state.cpp:57] Recovering state from
>> '/tmp/Endpoint_SlaveEndpointTest_NoAuthorizer_0_YioIJr/meta'
>> I0927 20:25:36.838676 28691 process.cpp:3336] Handling HTTP event for
>> process 'slave(611)' with path: '/slave(611)/monitor/statistics'
>> I0927 20:25:36.839231 28686 status_update_manager.cpp:203] Recovering
>> status update manager
>> I0927 20:25:36.839613 28687 containerizer.cpp:579] Recovering containerizer
>> I0927 20:25:36.839898 28684 http.cpp:835] Authorizing principal
>> 'test-principal' to GET the '/monitor/statistics' endpoint
>> I0927 20:25:36.840672 28696 provisioner.cpp:253] Provisioner recovery
>> complete
>> I0927 20:25:36.841761 28686 slave.cpp:5252] Finished recovery
>> I0927 20:25:36.842855 28686 slave.cpp:5424] Querying resource estimator
>> for oversubscribable resources
>> I0927 20:25:36.843529 28697 slave.cpp:5438] Received oversubscribable
>> resources {} from the resource estimator
>> I0927 20:25:36.843952 28688 slave.cpp:787] Agent terminating
>> [       OK ] Endpoint/SlaveEndpointTest.NoAuthorizer/0 (22 ms)
>> [ RUN      ] Endpoint/SlaveEndpointTest.NoAuthorizer/1
>> I0927 20:25:36.853266 28664 containerizer.cpp:224] Using isolation:
>> posix/cpu,posix/mem,filesystem/posix,network/cni
>> W0927 20:25:36.853807 28664 backend.cpp:75] Failed to create 'aufs'
>> backend: AufsBackend requires root privileges, but is running as user mesos
>> W0927 20:25:36.853960 28664 backend.cpp:75] Failed to create 'bind'
>> backend: BindBackend requires root privileges
>> I0927 20:25:36.855195 28664 cluster.cpp:435] Creating default 'local'
>> authorizer
>> I0927 20:25:36.857189 28683 slave.cpp:208] Mesos agent started on (612)@
>> 172.17.0.1:46389
>> I0927 20:25:36.857221 28683 slave.cpp:209] Flags at startup: --acls=""
>> --appc_simple_discovery_uri_prefix="http://"
>> --appc_store_dir="/tmp/mesos/store/appc" --authenticate_http_readonly="true"
>> --authenticate_http_readwrite="true" --authenticatee="crammd5"
>> --authentication_backoff_factor="1secs" --authorizer="local"
>> --cgroups_cpu_enable_pids_and_tids_count="false"
>> --cgroups_enable_cfs="false" --cgroups_hierarchy="/sys/fs/cgroup"
>> --cgroups_limit_swap="false" --cgroups_root="mesos"
>> --container_disk_watch_interval="15secs" --containerizers="mesos"
>> --credential="/tmp/Endpoint_SlaveEndpointTest_NoAuthorizer_1_CIALaC/credential"
>> --default_role="*" --disk_watch_interval="1mins" --docker="docker"
>> --docker_kill_orphans="true" --docker_registry="https://reg
>> istry-1.docker.io" --docker_remove_delay="6hrs"
>> --docker_socket="/var/run/docker.sock" --docker_stop_timeout="0ns"
>> --docker_store_dir="/tmp/mesos/store/docker"
>> --docker_volume_checkpoint_dir="/var/run/mesos/isolators/docker/volume"
>> --enforce_container_disk_quota="false" --executor_registration_timeout="1mins"
>> --executor_shutdown_grace_period="5secs" --fetcher_cache_dir="/tmp/Endp
>> oint_SlaveEndpointTest_NoAuthorizer_1_CIALaC/fetch"
>> --fetcher_cache_size="2GB" --frameworks_home="" --gc_delay="1weeks"
>> --gc_disk_headroom="0.1" --hadoop_home="" --help="false"
>> --hostname_lookup="true" --http_authenticators="basic"
>> --http_command_executor="false" --http_credentials="/tmp/Endpo
>> int_SlaveEndpointTest_NoAuthorizer_1_CIALaC/http_credentials"
>> --image_provisioner_backend="copy" --initialize_driver_logging="true"
>> --isolation="posix/cpu,posix/mem" --launcher="posix"
>> --launcher_dir="/mesos/mesos-1.1.0/_build/src" --logbufsecs="0"
>> --logging_level="INFO" --oversubscribed_resources_interval="15secs"
>> --perf_duration="10secs" --perf_interval="1mins"
>> --qos_correction_interval_min="0ns" --quiet="false" --recover="reconnect"
>> --recovery_timeout="15mins" --registration_backoff_factor="10ms"
>> --resources="cpus:2;gpus:0;mem:1024;disk:1024;ports:[31000-32000]"
>> --revocable_cpu_low_priority="true" --runtime_dir="/tmp/Endpoint_S
>> laveEndpointTest_NoAuthorizer_1_CIALaC" --sandbox_directory="/mnt/mesos/sandbox"
>> --strict="true" --switch_user="true" --systemd_enable_support="true"
>> --systemd_runtime_directory="/run/systemd/system" --version="false"
>> --work_dir="/tmp/Endpoint_SlaveEndpointTest_NoAuthorizer_1_yZVGgb"
>> I0927 20:25:36.857691 28683 credentials.hpp:86] Loading credential for
>> authentication from '/tmp/Endpoint_SlaveEndpointTe
>> st_NoAuthorizer_1_CIALaC/credential'
>> I0927 20:25:36.857900 28683 slave.cpp:346] Agent using credential for:
>> test-principal
>> I0927 20:25:36.857925 28683 credentials.hpp:37] Loading credentials for
>> authentication from '/tmp/Endpoint_SlaveEndpointTe
>> st_NoAuthorizer_1_CIALaC/http_credentials'
>> I0927 20:25:36.858178 28683 http.cpp:883] Using default 'basic' HTTP
>> authenticator for realm 'mesos-agent-readonly'
>> I0927 20:25:36.858328 28683 http.cpp:883] Using default 'basic' HTTP
>> authenticator for realm 'mesos-agent-readwrite'
>> I0927 20:25:36.859449 28683 slave.cpp:533] Agent resources: cpus(*):2;
>> mem(*):1024; disk(*):1024; ports(*):[31000-32000]
>> I0927 20:25:36.859520 28683 slave.cpp:541] Agent attributes: [  ]
>> I0927 20:25:36.859534 28683 slave.cpp:546] Agent hostname: 67ecb3fe2a7a
>> I0927 20:25:36.862382 28687 state.cpp:57] Recovering state from
>> '/tmp/Endpoint_SlaveEndpointTest_NoAuthorizer_1_yZVGgb/meta'
>> I0927 20:25:36.862438 28683 process.cpp:3336] Handling HTTP event for
>> process 'slave(612)' with path: '/slave(612)/monitor/statistics.json'
>> I0927 20:25:36.862886 28683 status_update_manager.cpp:203] Recovering
>> status update manager
>> I0927 20:25:36.863003 28683 containerizer.cpp:579] Recovering containerizer
>> I0927 20:25:36.863384 28690 http.cpp:835] Authorizing principal
>> 'test-principal' to GET the '/monitor/statistics.json' endpoint
>> I0927 20:25:36.864186 28683 provisioner.cpp:253] Provisioner recovery
>> complete
>> I0927 20:25:36.864966 28689 slave.cpp:5252] Finished recovery
>> I0927 20:25:36.865604 28689 slave.cpp:5424] Querying resource estimator
>> for oversubscribable resources
>> I0927 20:25:36.866415 28686 slave.cpp:5438] Received oversubscribable
>> resources {} from the resource estimator
>> I0927 20:25:36.867571 28696 slave.cpp:787] Agent terminating
>> [       OK ] Endpoint/SlaveEndpointTest.NoAuthorizer/1 (22 ms)
>> [ RUN      ] Endpoint/SlaveEndpointTest.NoAuthorizer/2
>> I0927 20:25:36.876497 28664 containerizer.cpp:224] Using isolation:
>> posix/cpu,posix/mem,filesystem/posix,network/cni
>> W0927 20:25:36.877132 28664 backend.cpp:75] Failed to create 'aufs'
>> backend: AufsBackend requires root privileges, but is running as user mesos
>> W0927 20:25:36.877279 28664 backend.cpp:75] Failed to create 'bind'
>> backend: BindBackend requires root privileges
>> I0927 20:25:36.878484 28664 cluster.cpp:435] Creating default 'local'
>> authorizer
>> I0927 20:25:36.879966 28692 slave.cpp:208] Mesos agent started on (613)@
>> 172.17.0.1:46389
>> I0927 20:25:36.880003 28692 slave.cpp:209] Flags at startup: --acls=""
>> --appc_simple_discovery_uri_prefix="http://"
>> --appc_store_dir="/tmp/mesos/store/appc" --authenticate_http_readonly="true"
>> --authenticate_http_readwrite="true" --authenticatee="crammd5"
>> --authentication_backoff_factor="1secs" --authorizer="local"
>> --cgroups_cpu_enable_pids_and_tids_count="false"
>> --cgroups_enable_cfs="false" --cgroups_hierarchy="/sys/fs/cgroup"
>> --cgroups_limit_swap="false" --cgroups_root="mesos"
>> --container_disk_watch_interval="15secs" --containerizers="mesos"
>> --credential="/tmp/Endpoint_SlaveEndpointTest_NoAuthorizer_2_YEVi0l/credential"
>> --default_role="*" --disk_watch_interval="1mins" --docker="docker"
>> --docker_kill_orphans="true" --docker_registry="https://reg
>> istry-1.docker.io" --docker_remove_delay="6hrs"
>> --docker_socket="/var/run/docker.sock" --docker_stop_timeout="0ns"
>> --docker_store_dir="/tmp/mesos/store/docker"
>> --docker_volume_checkpoint_dir="/var/run/mesos/isolators/docker/volume"
>> --enforce_container_disk_quota="false" --executor_registration_timeout="1mins"
>> --executor_shutdown_grace_period="5secs" --fetcher_cache_dir="/tmp/Endp
>> oint_SlaveEndpointTest_NoAuthorizer_2_YEVi0l/fetch"
>> --fetcher_cache_size="2GB" --frameworks_home="" --gc_delay="1weeks"
>> --gc_disk_headroom="0.1" --hadoop_home="" --help="false"
>> --hostname_lookup="true" --http_authenticators="basic"
>> --http_command_executor="false" --http_credentials="/tmp/Endpo
>> int_SlaveEndpointTest_NoAuthorizer_2_YEVi0l/http_credentials"
>> --image_provisioner_backend="copy" --initialize_driver_logging="true"
>> --isolation="posix/cpu,posix/mem" --launcher="posix"
>> --launcher_dir="/mesos/mesos-1.1.0/_build/src" --logbufsecs="0"
>> --logging_level="INFO" --oversubscribed_resources_interval="15secs"
>> --perf_duration="10secs" --perf_interval="1mins"
>> --qos_correction_interval_min="0ns" --quiet="false" --recover="reconnect"
>> --recovery_timeout="15mins" --registration_backoff_factor="10ms"
>> --resources="cpus:2;gpus:0;mem:1024;disk:1024;ports:[31000-32000]"
>> --revocable_cpu_low_priority="true" --runtime_dir="/tmp/Endpoint_S
>> laveEndpointTest_NoAuthorizer_2_YEVi0l" --sandbox_directory="/mnt/mesos/sandbox"
>> --strict="true" --switch_user="true" --systemd_enable_support="true"
>> --systemd_runtime_directory="/run/systemd/system" --version="false"
>> --work_dir="/tmp/Endpoint_SlaveEndpointTest_NoAuthorizer_2_Disv2U"
>> I0927 20:25:36.880590 28692 credentials.hpp:86] Loading credential for
>> authentication from '/tmp/Endpoint_SlaveEndpointTe
>> st_NoAuthorizer_2_YEVi0l/credential'
>> I0927 20:25:36.880761 28692 slave.cpp:346] Agent using credential for:
>> test-principal
>> I0927 20:25:36.880785 28692 credentials.hpp:37] Loading credentials for
>> authentication from '/tmp/Endpoint_SlaveEndpointTe
>> st_NoAuthorizer_2_YEVi0l/http_credentials'
>> I0927 20:25:36.881160 28692 http.cpp:883] Using default 'basic' HTTP
>> authenticator for realm 'mesos-agent-readonly'
>> I0927 20:25:36.881307 28692 http.cpp:883] Using default 'basic' HTTP
>> authenticator for realm 'mesos-agent-readwrite'
>> I0927 20:25:36.882387 28692 slave.cpp:533] Agent resources: cpus(*):2;
>> mem(*):1024; disk(*):1024; ports(*):[31000-32000]
>> I0927 20:25:36.882457 28692 slave.cpp:541] Agent attributes: [  ]
>> I0927 20:25:36.882469 28692 slave.cpp:546] Agent hostname: 67ecb3fe2a7a
>> I0927 20:25:36.885056 28692 process.cpp:3336] Handling HTTP event for
>> process 'slave(613)' with path: '/slave(613)/containers'
>> I0927 20:25:36.885552 28685 state.cpp:57] Recovering state from
>> '/tmp/Endpoint_SlaveEndpointTest_NoAuthorizer_2_Disv2U/meta'
>> I0927 20:25:36.885934 28686 status_update_manager.cpp:203] Recovering
>> status update manager
>> I0927 20:25:36.886068 28684 containerizer.cpp:579] Recovering containerizer
>> I0927 20:25:36.886106 28696 http.cpp:835] Authorizing principal
>> 'test-principal' to GET the '/containers' endpoint
>> I0927 20:25:36.887257 28684 provisioner.cpp:253] Provisioner recovery
>> complete
>> I0927 20:25:36.888099 28693 slave.cpp:5252] Finished recovery
>> I0927 20:25:36.888777 28693 slave.cpp:5424] Querying resource estimator
>> for oversubscribable resources
>> I0927 20:25:36.889047 28686 slave.cpp:5438] Received oversubscribable
>> resources {} from the resource estimator
>> I0927 20:25:36.890768 28664 slave.cpp:787] Agent terminating
>> [       OK ] Endpoint/SlaveEndpointTest.NoAuthorizer/2 (24 ms)
>> [----------] 9 tests from Endpoint/SlaveEndpointTest (211 ms total)
>> 
>> [----------] Global test environment tear-down
>> [==========] 1333 tests from 151 test cases ran. (475750 ms total)
>> [  PASSED  ] 1332 tests.
>> [  FAILED  ] 1 test, listed below:
>> [  FAILED  ] SlaveRecoveryTest/0.KillTaskWithHTTPExecutor, where
>> TypeParam = mesos::internal::slave::MesosContainerizer
>> 
>> 1 FAILED TEST
>>  YOU HAVE 5 DISABLED TESTS
>> 
>> make[4]: Leaving directory `/mesos/mesos-1.1.0/_build/src'
>> make[4]: *** [check-local] Error 1
>> make[3]: *** [check-am] Error 2
>> make[3]: Leaving directory `/mesos/mesos-1.1.0/_build/src'
>> make[2]: *** [check] Error 2
>> make[2]: Leaving directory `/mesos/mesos-1.1.0/_build/src'
>> make[1]: *** [check-recursive] Error 1
>> make[1]: Leaving directory `/mesos/mesos-1.1.0/_build'
>> make: *** [distcheck] Error 1
>> + docker rmi mesos-1475005402-3376
>> Untagged: mesos-1475005402-3376:latest
>> Deleted: sha256:1d3a7636a04c83feb27e441c38e460e6bd3462ba060a3396bdd03
>> 78aae6f5d01
>> Deleted: sha256:1d064ee07571f6f4143b3152665d402cb2e5c641bcc3e839d9386
>> 5b09f2b09f5
>> Deleted: sha256:4c38a02b77334d745405be6c475f2e1fb4b5c6f6b10b5e13d8211
>> 51e9d738ddd
>> Deleted: sha256:d69474db2075151da7b453b50266b8120bf16ffc6b7bcc7e1bef0
>> 7bfe2c2392d
>> Deleted: sha256:5cce6371f71d77af343dfd7cb1590db30ec023f45fd8c2f3ac8dc
>> 42925a5f38a
>> Deleted: sha256:106a4e840248c60095f3ac4fcff9f990a720badc181132862e68b
>> 609527f461b
>> Deleted: sha256:438bf412803374ccb952d0f47d413e4a47acf8ce96e9defdef027
>> 2fa6a101b08
>> Deleted: sha256:1840b01cb2985894e605c9b8783d5b44092964c7e1e75c42d0853
>> 2388e61cf29
>> Deleted: sha256:92fe5c9a965ab85b9db888542130b2e313520f61409566e151622
>> 7b2b85604b3
>> Deleted: sha256:22e66052465e92bb8856c294b1ab4f682cc0e32c02ac1d6f12369
>> c00d7114db6
>> Deleted: sha256:4ed2e8fc9315b7c9f115c44d16db1f13aa59dcb0c8f625c06d2ea
>> 482081e9e11
>> Deleted: sha256:ad2d7eb7696767b08f313d8bbf774ba5f9c9ef0ba002c1dfbcfad
>> d7195ed9573
>> Deleted: sha256:d9d8d1a325131caa369ed215f729f80405e9fc72ed7117013ecf5
>> faf50074538
>> Deleted: sha256:d957fd7dfbdeabdc21a32e52c7a7b93e3b829c2ad6403ff355d9f
>> e9f67385b4a
>> Deleted: sha256:25dc96c2924c71dc22b3655640f2587283e0828a31875fa6024b1
>> 320eacdc9f9
>> Deleted: sha256:08044cb69dca0645e64951de769a4b3baf043e4ec6bb4384db76d
>> c70105f065d
>> Deleted: sha256:0ad75178aca41e0581f9b10100e37bec45be788a209e7ea69727e
>> 0f8205eb128
>> Deleted: sha256:d839b9cfa6f3abdacc5c482a7b497da5bee6687f6f75094f5b5d5
>> 2dd06a0dd48
>> Deleted: sha256:5b765f08b2cd8394baceda1ff251de24d522d017c51847b685c42
>> 2682a6fb77d
>> Deleted: sha256:88c4a4e2d6f51d6cdd3f793b7bb5ab7f0761b964034e8685fa215
>> 4bc7d13bc08
>> Deleted: sha256:c9c951d6e05226ab45aba8d6df804b989f5b8d08b1f335c107aa0
>> cd3a7099867
>> Deleted: sha256:63124192a3126f523daa84358b75069601922f3f5477fd48ce833
>> 75aba19d4e3
>> Deleted: sha256:776f3c325762045ba1d4ffc6d38fda40678e1c1d7665cede56804
>> e425dd0cb23
>> Deleted: sha256:37e66cf9dbba506da7a57f3d78b1df290a781c288bfa62201eebe
>> 1ad8ef42038
>> Build step 'Execute shell' marked build as failure
>> 



Mime
View raw message