mesos-builds mailing list archives

Site index · List index
Message view « Date » · « Thread »
Top « Date » · « Thread »
From Apache Jenkins Server <jenk...@builds.apache.org>
Subject Build failed in Jenkins: Mesos-Windows #548
Date Wed, 21 Sep 2016 17:05:18 GMT
See <https://builds.apache.org/job/Mesos-Windows/548/changes>

Changes:

[yujie.jay] Refactored subprocess options [1/2].

[yujie.jay] Used ChildHooks in Mesos [2/2].

[yujie.jay] Used {} instead of Hook::None() in libprocess [1/2].

[yujie.jay] Replaces Hook::None() by {} in Mesos [2/2].

[yujie.jay] Renamed Hook to parent Hook in libprocess [1/2].

[yujie.jay] Renamed Hook to ParentHook in Mesos [2/2].

[yujie.jay] Converted watchdog option into a childhook in libprocess [1/2].

[yujie.jay] Converted watchdog option into childhook in Mesos [2/2].

------------------------------------------
[...truncated 5726 lines...]
         F:\jenkins\jenkins-slave\workspace\Mesos-Windows\3rdparty\stout\include\stout/os/windows/read.hpp(36): warning C4267: 'argument': conversion from 'size_t' to 'unsigned int', possible loss of data (compiling source file F:\jenkins\jenkins-slave\workspace\Mesos-Windows\3rdparty\libprocess\src\io.cpp) [<https://builds.apache.org/job/Mesos-Windows/ws/build\3rdparty\libprocess\src\process-0.0.1.vcxproj]>
         F:\jenkins\jenkins-slave\workspace\Mesos-Windows\3rdparty\stout\include\stout/windows/os.hpp(48): warning C4996: 'GetVersionExA': was declared deprecated (compiling source file F:\jenkins\jenkins-slave\workspace\Mesos-Windows\3rdparty\libprocess\src\io.cpp) [<https://builds.apache.org/job/Mesos-Windows/ws/build\3rdparty\libprocess\src\process-0.0.1.vcxproj]>
         F:\jenkins\jenkins-slave\workspace\Mesos-Windows\3rdparty\stout\include\stout/windows/os.hpp(155): warning C4267: 'argument': conversion from 'size_t' to 'DWORD', possible loss of data (compiling source file F:\jenkins\jenkins-slave\workspace\Mesos-Windows\3rdparty\libprocess\src\io.cpp) [<https://builds.apache.org/job/Mesos-Windows/ws/build\3rdparty\libprocess\src\process-0.0.1.vcxproj]>
         F:\jenkins\jenkins-slave\workspace\Mesos-Windows\3rdparty\stout\include\stout/windows/os.hpp(458): warning C4996: 'GetVersionExA': was declared deprecated (compiling source file F:\jenkins\jenkins-slave\workspace\Mesos-Windows\3rdparty\libprocess\src\io.cpp) [<https://builds.apache.org/job/Mesos-Windows/ws/build\3rdparty\libprocess\src\process-0.0.1.vcxproj]>
         F:\jenkins\jenkins-slave\workspace\Mesos-Windows\3rdparty\stout\include\stout/os/windows/write.hpp(34): warning C4267: 'argument': conversion from 'size_t' to 'int', possible loss of data (compiling source file F:\jenkins\jenkins-slave\workspace\Mesos-Windows\3rdparty\libprocess\src\io.cpp) [<https://builds.apache.org/job/Mesos-Windows/ws/build\3rdparty\libprocess\src\process-0.0.1.vcxproj]>
         F:\jenkins\jenkins-slave\workspace\Mesos-Windows\3rdparty\stout\include\stout/os/windows/write.hpp(37): warning C4267: 'argument': conversion from 'size_t' to 'unsigned int', possible loss of data (compiling source file F:\jenkins\jenkins-slave\workspace\Mesos-Windows\3rdparty\libprocess\src\io.cpp) [<https://builds.apache.org/job/Mesos-Windows/ws/build\3rdparty\libprocess\src\process-0.0.1.vcxproj]>
         F:\jenkins\jenkins-slave\workspace\Mesos-Windows\3rdparty\libprocess\src\io.cpp(76): warning C4267: 'argument': conversion from 'size_t' to 'int', possible loss of data [<https://builds.apache.org/job/Mesos-Windows/ws/build\3rdparty\libprocess\src\process-0.0.1.vcxproj]>
         F:\jenkins\jenkins-slave\workspace\Mesos-Windows\3rdparty\stout\include\stout/numify.hpp(53): warning C4146: unary minus operator applied to unsigned type, result still unsigned (compiling source file F:\jenkins\jenkins-slave\workspace\Mesos-Windows\3rdparty\libprocess\src\http.cpp) [<https://builds.apache.org/job/Mesos-Windows/ws/build\3rdparty\libprocess\src\process-0.0.1.vcxproj]>
         f:\jenkins\jenkins-slave\workspace\mesos-windows\3rdparty\stout\include\stout\numify.hpp(53): warning C4146: unary minus operator applied to unsigned type, result still unsigned (compiling source file F:\jenkins\jenkins-slave\workspace\Mesos-Windows\3rdparty\libprocess\src\io.cpp) [<https://builds.apache.org/job/Mesos-Windows/ws/build\3rdparty\libprocess\src\process-0.0.1.vcxproj]>
         F:\jenkins\jenkins-slave\workspace\Mesos-Windows\3rdparty\stout\include\stout/windows.hpp(333): warning C4267: 'argument': conversion from 'size_t' to 'unsigned int', possible loss of data (compiling source file F:\jenkins\jenkins-slave\workspace\Mesos-Windows\3rdparty\libprocess\src\latch.cpp) [<https://builds.apache.org/job/Mesos-Windows/ws/build\3rdparty\libprocess\src\process-0.0.1.vcxproj]>
         F:\jenkins\jenkins-slave\workspace\Mesos-Windows\3rdparty\stout\include\stout/windows.hpp(335): warning C4267: 'argument': conversion from 'size_t' to 'unsigned int', possible loss of data (compiling source file F:\jenkins\jenkins-slave\workspace\Mesos-Windows\3rdparty\libprocess\src\latch.cpp) [<https://builds.apache.org/job/Mesos-Windows/ws/build\3rdparty\libprocess\src\process-0.0.1.vcxproj]>
         F:\jenkins\jenkins-slave\workspace\Mesos-Windows\3rdparty\stout\include\stout/bytes.hpp(107): warning C4244: '*=': conversion from 'double' to 'uint64_t', possible loss of data (compiling source file F:\jenkins\jenkins-slave\workspace\Mesos-Windows\3rdparty\libprocess\src\latch.cpp) [<https://builds.apache.org/job/Mesos-Windows/ws/build\3rdparty\libprocess\src\process-0.0.1.vcxproj]>
         F:\jenkins\jenkins-slave\workspace\Mesos-Windows\3rdparty\stout\include\stout/bytes.hpp(118): warning C4244: '/=': conversion from 'double' to 'uint64_t', possible loss of data (compiling source file F:\jenkins\jenkins-slave\workspace\Mesos-Windows\3rdparty\libprocess\src\latch.cpp) [<https://builds.apache.org/job/Mesos-Windows/ws/build\3rdparty\libprocess\src\process-0.0.1.vcxproj]>
         F:\jenkins\jenkins-slave\workspace\Mesos-Windows\3rdparty\stout\include\stout/os/socket.hpp(34): warning C4244: '=': conversion from 'SOCKET' to 'int', possible loss of data (compiling source file F:\jenkins\jenkins-slave\workspace\Mesos-Windows\3rdparty\libprocess\src\latch.cpp) [<https://builds.apache.org/job/Mesos-Windows/ws/build\3rdparty\libprocess\src\process-0.0.1.vcxproj]>
         F:\jenkins\jenkins-slave\workspace\Mesos-Windows\3rdparty\stout\include\stout/os/windows/close.hpp(51): warning C4800: 'BOOL': forcing value to bool 'true' or 'false' (performance warning) (compiling source file F:\jenkins\jenkins-slave\workspace\Mesos-Windows\3rdparty\libprocess\src\latch.cpp) [<https://builds.apache.org/job/Mesos-Windows/ws/build\3rdparty\libprocess\src\process-0.0.1.vcxproj]>
         F:\jenkins\jenkins-slave\workspace\Mesos-Windows\3rdparty\stout\include\stout/duration.hpp(99): warning C4244: '=': conversion from 'double' to 'long', possible loss of data (compiling source file F:\jenkins\jenkins-slave\workspace\Mesos-Windows\3rdparty\libprocess\src\latch.cpp) [<https://builds.apache.org/job/Mesos-Windows/ws/build\3rdparty\libprocess\src\process-0.0.1.vcxproj]>
         F:\jenkins\jenkins-slave\workspace\Mesos-Windows\3rdparty\stout\include\stout/duration.hpp(100): warning C4244: '=': conversion from 'double' to 'long', possible loss of data (compiling source file F:\jenkins\jenkins-slave\workspace\Mesos-Windows\3rdparty\libprocess\src\latch.cpp) [<https://builds.apache.org/job/Mesos-Windows/ws/build\3rdparty\libprocess\src\process-0.0.1.vcxproj]>
         F:\jenkins\jenkins-slave\workspace\Mesos-Windows\3rdparty\stout\include\stout/windows.hpp(333): warning C4267: 'argument': conversion from 'size_t' to 'unsigned int', possible loss of data (compiling source file F:\jenkins\jenkins-slave\workspace\Mesos-Windows\3rdparty\libprocess\src\logging.cpp) [<https://builds.apache.org/job/Mesos-Windows/ws/build\3rdparty\libprocess\src\process-0.0.1.vcxproj]>
         F:\jenkins\jenkins-slave\workspace\Mesos-Windows\3rdparty\stout\include\stout/windows.hpp(335): warning C4267: 'argument': conversion from 'size_t' to 'unsigned int', possible loss of data (compiling source file F:\jenkins\jenkins-slave\workspace\Mesos-Windows\3rdparty\libprocess\src\logging.cpp) [<https://builds.apache.org/job/Mesos-Windows/ws/build\3rdparty\libprocess\src\process-0.0.1.vcxproj]>
         F:\jenkins\jenkins-slave\workspace\Mesos-Windows\3rdparty\stout\include\stout/duration.hpp(99): warning C4244: '=': conversion from 'double' to 'long', possible loss of data (compiling source file F:\jenkins\jenkins-slave\workspace\Mesos-Windows\3rdparty\libprocess\src\logging.cpp) [<https://builds.apache.org/job/Mesos-Windows/ws/build\3rdparty\libprocess\src\process-0.0.1.vcxproj]>
         F:\jenkins\jenkins-slave\workspace\Mesos-Windows\3rdparty\stout\include\stout/duration.hpp(100): warning C4244: '=': conversion from 'double' to 'long', possible loss of data (compiling source file F:\jenkins\jenkins-slave\workspace\Mesos-Windows\3rdparty\libprocess\src\logging.cpp) [<https://builds.apache.org/job/Mesos-Windows/ws/build\3rdparty\libprocess\src\process-0.0.1.vcxproj]>
         F:\jenkins\jenkins-slave\workspace\Mesos-Windows\3rdparty\stout\include\stout/bytes.hpp(107): warning C4244: '*=': conversion from 'double' to 'uint64_t', possible loss of data (compiling source file F:\jenkins\jenkins-slave\workspace\Mesos-Windows\3rdparty\libprocess\src\logging.cpp) [<https://builds.apache.org/job/Mesos-Windows/ws/build\3rdparty\libprocess\src\process-0.0.1.vcxproj]>
         F:\jenkins\jenkins-slave\workspace\Mesos-Windows\3rdparty\stout\include\stout/bytes.hpp(118): warning C4244: '/=': conversion from 'double' to 'uint64_t', possible loss of data (compiling source file F:\jenkins\jenkins-slave\workspace\Mesos-Windows\3rdparty\libprocess\src\logging.cpp) [<https://builds.apache.org/job/Mesos-Windows/ws/build\3rdparty\libprocess\src\process-0.0.1.vcxproj]>
         F:\jenkins\jenkins-slave\workspace\Mesos-Windows\3rdparty\stout\include\stout/os/socket.hpp(34): warning C4244: '=': conversion from 'SOCKET' to 'int', possible loss of data (compiling source file F:\jenkins\jenkins-slave\workspace\Mesos-Windows\3rdparty\libprocess\src\logging.cpp) [<https://builds.apache.org/job/Mesos-Windows/ws/build\3rdparty\libprocess\src\process-0.0.1.vcxproj]>
         F:\jenkins\jenkins-slave\workspace\Mesos-Windows\3rdparty\stout\include\stout/os/windows/close.hpp(51): warning C4800: 'BOOL': forcing value to bool 'true' or 'false' (performance warning) (compiling source file F:\jenkins\jenkins-slave\workspace\Mesos-Windows\3rdparty\libprocess\src\logging.cpp) [<https://builds.apache.org/job/Mesos-Windows/ws/build\3rdparty\libprocess\src\process-0.0.1.vcxproj]>
         F:\jenkins\jenkins-slave\workspace\Mesos-Windows\3rdparty\stout\include\stout/numify.hpp(53): warning C4146: unary minus operator applied to unsigned type, result still unsigned (compiling source file F:\jenkins\jenkins-slave\workspace\Mesos-Windows\3rdparty\libprocess\src\latch.cpp) [<https://builds.apache.org/job/Mesos-Windows/ws/build\3rdparty\libprocess\src\process-0.0.1.vcxproj]>
         f:\jenkins\jenkins-slave\workspace\mesos-windows\3rdparty\stout\include\stout\numify.hpp(53): warning C4146: unary minus operator applied to unsigned type, result still unsigned (compiling source file F:\jenkins\jenkins-slave\workspace\Mesos-Windows\3rdparty\libprocess\src\logging.cpp) [<https://builds.apache.org/job/Mesos-Windows/ws/build\3rdparty\libprocess\src\process-0.0.1.vcxproj]>
         F:\jenkins\jenkins-slave\workspace\Mesos-Windows\3rdparty\stout\include\stout/windows.hpp(333): warning C4267: 'argument': conversion from 'size_t' to 'unsigned int', possible loss of data (compiling source file F:\jenkins\jenkins-slave\workspace\Mesos-Windows\3rdparty\libprocess\src\metrics\metrics.cpp) [<https://builds.apache.org/job/Mesos-Windows/ws/build\3rdparty\libprocess\src\process-0.0.1.vcxproj]>
         F:\jenkins\jenkins-slave\workspace\Mesos-Windows\3rdparty\stout\include\stout/windows.hpp(335): warning C4267: 'argument': conversion from 'size_t' to 'unsigned int', possible loss of data (compiling source file F:\jenkins\jenkins-slave\workspace\Mesos-Windows\3rdparty\libprocess\src\metrics\metrics.cpp) [<https://builds.apache.org/job/Mesos-Windows/ws/build\3rdparty\libprocess\src\process-0.0.1.vcxproj]>
         F:\jenkins\jenkins-slave\workspace\Mesos-Windows\3rdparty\stout\include\stout/duration.hpp(99): warning C4244: '=': conversion from 'double' to 'long', possible loss of data (compiling source file F:\jenkins\jenkins-slave\workspace\Mesos-Windows\3rdparty\libprocess\src\metrics\metrics.cpp) [<https://builds.apache.org/job/Mesos-Windows/ws/build\3rdparty\libprocess\src\process-0.0.1.vcxproj]>
         F:\jenkins\jenkins-slave\workspace\Mesos-Windows\3rdparty\stout\include\stout/duration.hpp(100): warning C4244: '=': conversion from 'double' to 'long', possible loss of data (compiling source file F:\jenkins\jenkins-slave\workspace\Mesos-Windows\3rdparty\libprocess\src\metrics\metrics.cpp) [<https://builds.apache.org/job/Mesos-Windows/ws/build\3rdparty\libprocess\src\process-0.0.1.vcxproj]>
         F:\jenkins\jenkins-slave\workspace\Mesos-Windows\3rdparty\stout\include\stout/bytes.hpp(107): warning C4244: '*=': conversion from 'double' to 'uint64_t', possible loss of data (compiling source file F:\jenkins\jenkins-slave\workspace\Mesos-Windows\3rdparty\libprocess\src\metrics\metrics.cpp) [<https://builds.apache.org/job/Mesos-Windows/ws/build\3rdparty\libprocess\src\process-0.0.1.vcxproj]>
         F:\jenkins\jenkins-slave\workspace\Mesos-Windows\3rdparty\stout\include\stout/bytes.hpp(118): warning C4244: '/=': conversion from 'double' to 'uint64_t', possible loss of data (compiling source file F:\jenkins\jenkins-slave\workspace\Mesos-Windows\3rdparty\libprocess\src\metrics\metrics.cpp) [<https://builds.apache.org/job/Mesos-Windows/ws/build\3rdparty\libprocess\src\process-0.0.1.vcxproj]>
         F:\jenkins\jenkins-slave\workspace\Mesos-Windows\3rdparty\stout\include\stout/os/socket.hpp(34): warning C4244: '=': conversion from 'SOCKET' to 'int', possible loss of data (compiling source file F:\jenkins\jenkins-slave\workspace\Mesos-Windows\3rdparty\libprocess\src\metrics\metrics.cpp) [<https://builds.apache.org/job/Mesos-Windows/ws/build\3rdparty\libprocess\src\process-0.0.1.vcxproj]>
         F:\jenkins\jenkins-slave\workspace\Mesos-Windows\3rdparty\stout\include\stout/os/windows/close.hpp(51): warning C4800: 'BOOL': forcing value to bool 'true' or 'false' (performance warning) (compiling source file F:\jenkins\jenkins-slave\workspace\Mesos-Windows\3rdparty\libprocess\src\metrics\metrics.cpp) [<https://builds.apache.org/job/Mesos-Windows/ws/build\3rdparty\libprocess\src\process-0.0.1.vcxproj]>
         F:\jenkins\jenkins-slave\workspace\Mesos-Windows\3rdparty\stout\include\stout/internal/windows/dirent.hpp(197): warning C4267: '=': conversion from 'size_t' to 'unsigned short', possible loss of data (compiling source file F:\jenkins\jenkins-slave\workspace\Mesos-Windows\3rdparty\libprocess\src\metrics\metrics.cpp) [<https://builds.apache.org/job/Mesos-Windows/ws/build\3rdparty\libprocess\src\process-0.0.1.vcxproj]>
         F:\jenkins\jenkins-slave\workspace\Mesos-Windows\3rdparty\stout\include\stout/internal/windows/dirent.hpp(217): warning C4267: '=': conversion from 'size_t' to 'unsigned short', possible loss of data (compiling source file F:\jenkins\jenkins-slave\workspace\Mesos-Windows\3rdparty\libprocess\src\metrics\metrics.cpp) [<https://builds.apache.org/job/Mesos-Windows/ws/build\3rdparty\libprocess\src\process-0.0.1.vcxproj]>
         F:\jenkins\jenkins-slave\workspace\Mesos-Windows\3rdparty\stout\include\stout/os/windows/shell.hpp(103): warning C4244: 'return': conversion from 'intptr_t' to 'int', possible loss of data (compiling source file F:\jenkins\jenkins-slave\workspace\Mesos-Windows\3rdparty\libprocess\src\metrics\metrics.cpp) [<https://builds.apache.org/job/Mesos-Windows/ws/build\3rdparty\libprocess\src\process-0.0.1.vcxproj]>
         F:\jenkins\jenkins-slave\workspace\Mesos-Windows\3rdparty\stout\include\stout/os/windows/shell.hpp(124): warning C4244: 'argument': conversion from 'intptr_t' to 'int', possible loss of data (compiling source file F:\jenkins\jenkins-slave\workspace\Mesos-Windows\3rdparty\libprocess\src\metrics\metrics.cpp) [<https://builds.apache.org/job/Mesos-Windows/ws/build\3rdparty\libprocess\src\process-0.0.1.vcxproj]>
         F:\jenkins\jenkins-slave\workspace\Mesos-Windows\3rdparty\stout\include\stout/os/windows/read.hpp(33): warning C4267: 'argument': conversion from 'size_t' to 'int', possible loss of data (compiling source file F:\jenkins\jenkins-slave\workspace\Mesos-Windows\3rdparty\libprocess\src\metrics\metrics.cpp) [<https://builds.apache.org/job/Mesos-Windows/ws/build\3rdparty\libprocess\src\process-0.0.1.vcxproj]>
         F:\jenkins\jenkins-slave\workspace\Mesos-Windows\3rdparty\stout\include\stout/os/windows/read.hpp(36): warning C4267: 'argument': conversion from 'size_t' to 'unsigned int', possible loss of data (compiling source file F:\jenkins\jenkins-slave\workspace\Mesos-Windows\3rdparty\libprocess\src\metrics\metrics.cpp) [<https://builds.apache.org/job/Mesos-Windows/ws/build\3rdparty\libprocess\src\process-0.0.1.vcxproj]>
         F:\jenkins\jenkins-slave\workspace\Mesos-Windows\3rdparty\stout\include\stout/windows/os.hpp(48): warning C4996: 'GetVersionExA': was declared deprecated (compiling source file F:\jenkins\jenkins-slave\workspace\Mesos-Windows\3rdparty\libprocess\src\metrics\metrics.cpp) [<https://builds.apache.org/job/Mesos-Windows/ws/build\3rdparty\libprocess\src\process-0.0.1.vcxproj]>
         F:\jenkins\jenkins-slave\workspace\Mesos-Windows\3rdparty\stout\include\stout/windows/os.hpp(155): warning C4267: 'argument': conversion from 'size_t' to 'DWORD', possible loss of data (compiling source file F:\jenkins\jenkins-slave\workspace\Mesos-Windows\3rdparty\libprocess\src\metrics\metrics.cpp) [<https://builds.apache.org/job/Mesos-Windows/ws/build\3rdparty\libprocess\src\process-0.0.1.vcxproj]>
         F:\jenkins\jenkins-slave\workspace\Mesos-Windows\3rdparty\stout\include\stout/windows/os.hpp(458): warning C4996: 'GetVersionExA': was declared deprecated (compiling source file F:\jenkins\jenkins-slave\workspace\Mesos-Windows\3rdparty\libprocess\src\metrics\metrics.cpp) [<https://builds.apache.org/job/Mesos-Windows/ws/build\3rdparty\libprocess\src\process-0.0.1.vcxproj]>
         F:\jenkins\jenkins-slave\workspace\Mesos-Windows\3rdparty\libprocess\src\metrics\metrics.cpp(269): warning C4244: '=': conversion from 'std::size_t' to 'double', possible loss of data [<https://builds.apache.org/job/Mesos-Windows/ws/build\3rdparty\libprocess\src\process-0.0.1.vcxproj]>
         F:\jenkins\jenkins-slave\workspace\Mesos-Windows\3rdparty\stout\include\stout/windows.hpp(333): warning C4267: 'argument': conversion from 'size_t' to 'unsigned int', possible loss of data (compiling source file F:\jenkins\jenkins-slave\workspace\Mesos-Windows\3rdparty\libprocess\src\pid.cpp) [<https://builds.apache.org/job/Mesos-Windows/ws/build\3rdparty\libprocess\src\process-0.0.1.vcxproj]>
         F:\jenkins\jenkins-slave\workspace\Mesos-Windows\3rdparty\stout\include\stout/windows.hpp(335): warning C4267: 'argument': conversion from 'size_t' to 'unsigned int', possible loss of data (compiling source file F:\jenkins\jenkins-slave\workspace\Mesos-Windows\3rdparty\libprocess\src\pid.cpp) [<https://builds.apache.org/job/Mesos-Windows/ws/build\3rdparty\libprocess\src\process-0.0.1.vcxproj]>
         F:\jenkins\jenkins-slave\workspace\Mesos-Windows\3rdparty\stout\include\stout/bytes.hpp(107): warning C4244: '*=': conversion from 'double' to 'uint64_t', possible loss of data (compiling source file F:\jenkins\jenkins-slave\workspace\Mesos-Windows\3rdparty\libprocess\src\pid.cpp) [<https://builds.apache.org/job/Mesos-Windows/ws/build\3rdparty\libprocess\src\process-0.0.1.vcxproj]>
         F:\jenkins\jenkins-slave\workspace\Mesos-Windows\3rdparty\stout\include\stout/bytes.hpp(118): warning C4244: '/=': conversion from 'double' to 'uint64_t', possible loss of data (compiling source file F:\jenkins\jenkins-slave\workspace\Mesos-Windows\3rdparty\libprocess\src\pid.cpp) [<https://builds.apache.org/job/Mesos-Windows/ws/build\3rdparty\libprocess\src\process-0.0.1.vcxproj]>
         F:\jenkins\jenkins-slave\workspace\Mesos-Windows\3rdparty\stout\include\stout/os/socket.hpp(34): warning C4244: '=': conversion from 'SOCKET' to 'int', possible loss of data (compiling source file F:\jenkins\jenkins-slave\workspace\Mesos-Windows\3rdparty\libprocess\src\pid.cpp) [<https://builds.apache.org/job/Mesos-Windows/ws/build\3rdparty\libprocess\src\process-0.0.1.vcxproj]>
         F:\jenkins\jenkins-slave\workspace\Mesos-Windows\3rdparty\stout\include\stout/os/windows/close.hpp(51): warning C4800: 'BOOL': forcing value to bool 'true' or 'false' (performance warning) (compiling source file F:\jenkins\jenkins-slave\workspace\Mesos-Windows\3rdparty\libprocess\src\pid.cpp) [<https://builds.apache.org/job/Mesos-Windows/ws/build\3rdparty\libprocess\src\process-0.0.1.vcxproj]>
         F:\jenkins\jenkins-slave\workspace\Mesos-Windows\3rdparty\stout\include\stout/duration.hpp(99): warning C4244: '=': conversion from 'double' to 'long', possible loss of data (compiling source file F:\jenkins\jenkins-slave\workspace\Mesos-Windows\3rdparty\libprocess\src\pid.cpp) [<https://builds.apache.org/job/Mesos-Windows/ws/build\3rdparty\libprocess\src\process-0.0.1.vcxproj]>
         F:\jenkins\jenkins-slave\workspace\Mesos-Windows\3rdparty\stout\include\stout/duration.hpp(100): warning C4244: '=': conversion from 'double' to 'long', possible loss of data (compiling source file F:\jenkins\jenkins-slave\workspace\Mesos-Windows\3rdparty\libprocess\src\pid.cpp) [<https://builds.apache.org/job/Mesos-Windows/ws/build\3rdparty\libprocess\src\process-0.0.1.vcxproj]>
         f:\jenkins\jenkins-slave\workspace\mesos-windows\3rdparty\stout\include\stout\numify.hpp(53): warning C4146: unary minus operator applied to unsigned type, result still unsigned (compiling source file F:\jenkins\jenkins-slave\workspace\Mesos-Windows\3rdparty\libprocess\src\metrics\metrics.cpp) [<https://builds.apache.org/job/Mesos-Windows/ws/build\3rdparty\libprocess\src\process-0.0.1.vcxproj]>
         F:\jenkins\jenkins-slave\workspace\Mesos-Windows\3rdparty\stout\include\stout/internal/windows/dirent.hpp(197): warning C4267: '=': conversion from 'size_t' to 'unsigned short', possible loss of data (compiling source file F:\jenkins\jenkins-slave\workspace\Mesos-Windows\3rdparty\libprocess\src\pid.cpp) [<https://builds.apache.org/job/Mesos-Windows/ws/build\3rdparty\libprocess\src\process-0.0.1.vcxproj]>
         F:\jenkins\jenkins-slave\workspace\Mesos-Windows\3rdparty\stout\include\stout/internal/windows/dirent.hpp(217): warning C4267: '=': conversion from 'size_t' to 'unsigned short', possible loss of data (compiling source file F:\jenkins\jenkins-slave\workspace\Mesos-Windows\3rdparty\libprocess\src\pid.cpp) [<https://builds.apache.org/job/Mesos-Windows/ws/build\3rdparty\libprocess\src\process-0.0.1.vcxproj]>
         F:\jenkins\jenkins-slave\workspace\Mesos-Windows\3rdparty\stout\include\stout/os/windows/shell.hpp(103): warning C4244: 'return': conversion from 'intptr_t' to 'int', possible loss of data (compiling source file F:\jenkins\jenkins-slave\workspace\Mesos-Windows\3rdparty\libprocess\src\pid.cpp) [<https://builds.apache.org/job/Mesos-Windows/ws/build\3rdparty\libprocess\src\process-0.0.1.vcxproj]>
         F:\jenkins\jenkins-slave\workspace\Mesos-Windows\3rdparty\stout\include\stout/os/windows/shell.hpp(124): warning C4244: 'argument': conversion from 'intptr_t' to 'int', possible loss of data (compiling source file F:\jenkins\jenkins-slave\workspace\Mesos-Windows\3rdparty\libprocess\src\pid.cpp) [<https://builds.apache.org/job/Mesos-Windows/ws/build\3rdparty\libprocess\src\process-0.0.1.vcxproj]>
         F:\jenkins\jenkins-slave\workspace\Mesos-Windows\3rdparty\stout\include\stout/os/windows/read.hpp(33): warning C4267: 'argument': conversion from 'size_t' to 'int', possible loss of data (compiling source file F:\jenkins\jenkins-slave\workspace\Mesos-Windows\3rdparty\libprocess\src\pid.cpp) [<https://builds.apache.org/job/Mesos-Windows/ws/build\3rdparty\libprocess\src\process-0.0.1.vcxproj]>
         F:\jenkins\jenkins-slave\workspace\Mesos-Windows\3rdparty\stout\include\stout/os/windows/read.hpp(36): warning C4267: 'argument': conversion from 'size_t' to 'unsigned int', possible loss of data (compiling source file F:\jenkins\jenkins-slave\workspace\Mesos-Windows\3rdparty\libprocess\src\pid.cpp) [<https://builds.apache.org/job/Mesos-Windows/ws/build\3rdparty\libprocess\src\process-0.0.1.vcxproj]>
         F:\jenkins\jenkins-slave\workspace\Mesos-Windows\3rdparty\stout\include\stout/windows/os.hpp(48): warning C4996: 'GetVersionExA': was declared deprecated (compiling source file F:\jenkins\jenkins-slave\workspace\Mesos-Windows\3rdparty\libprocess\src\pid.cpp) [<https://builds.apache.org/job/Mesos-Windows/ws/build\3rdparty\libprocess\src\process-0.0.1.vcxproj]>
         F:\jenkins\jenkins-slave\workspace\Mesos-Windows\3rdparty\stout\include\stout/windows/os.hpp(155): warning C4267: 'argument': conversion from 'size_t' to 'DWORD', possible loss of data (compiling source file F:\jenkins\jenkins-slave\workspace\Mesos-Windows\3rdparty\libprocess\src\pid.cpp) [<https://builds.apache.org/job/Mesos-Windows/ws/build\3rdparty\libprocess\src\process-0.0.1.vcxproj]>
         F:\jenkins\jenkins-slave\workspace\Mesos-Windows\3rdparty\stout\include\stout/windows/os.hpp(458): warning C4996: 'GetVersionExA': was declared deprecated (compiling source file F:\jenkins\jenkins-slave\workspace\Mesos-Windows\3rdparty\libprocess\src\pid.cpp) [<https://builds.apache.org/job/Mesos-Windows/ws/build\3rdparty\libprocess\src\process-0.0.1.vcxproj]>
         F:\jenkins\jenkins-slave\workspace\Mesos-Windows\3rdparty\stout\include\stout/numify.hpp(53): warning C4146: unary minus operator applied to unsigned type, result still unsigned (compiling source file F:\jenkins\jenkins-slave\workspace\Mesos-Windows\3rdparty\libprocess\src\pid.cpp) [<https://builds.apache.org/job/Mesos-Windows/ws/build\3rdparty\libprocess\src\process-0.0.1.vcxproj]>
         F:\jenkins\jenkins-slave\workspace\Mesos-Windows\3rdparty\stout\include\stout/windows.hpp(333): warning C4267: 'argument': conversion from 'size_t' to 'unsigned int', possible loss of data (compiling source file F:\jenkins\jenkins-slave\workspace\Mesos-Windows\3rdparty\libprocess\src\poll_socket.cpp) [<https://builds.apache.org/job/Mesos-Windows/ws/build\3rdparty\libprocess\src\process-0.0.1.vcxproj]>
         F:\jenkins\jenkins-slave\workspace\Mesos-Windows\3rdparty\stout\include\stout/windows.hpp(335): warning C4267: 'argument': conversion from 'size_t' to 'unsigned int', possible loss of data (compiling source file F:\jenkins\jenkins-slave\workspace\Mesos-Windows\3rdparty\libprocess\src\poll_socket.cpp) [<https://builds.apache.org/job/Mesos-Windows/ws/build\3rdparty\libprocess\src\process-0.0.1.vcxproj]>
         F:\jenkins\jenkins-slave\workspace\Mesos-Windows\3rdparty\stout\include\stout/duration.hpp(99): warning C4244: '=': conversion from 'double' to 'long', possible loss of data (compiling source file F:\jenkins\jenkins-slave\workspace\Mesos-Windows\3rdparty\libprocess\src\poll_socket.cpp) [<https://builds.apache.org/job/Mesos-Windows/ws/build\3rdparty\libprocess\src\process-0.0.1.vcxproj]>
         F:\jenkins\jenkins-slave\workspace\Mesos-Windows\3rdparty\stout\include\stout/duration.hpp(100): warning C4244: '=': conversion from 'double' to 'long', possible loss of data (compiling source file F:\jenkins\jenkins-slave\workspace\Mesos-Windows\3rdparty\libprocess\src\poll_socket.cpp) [<https://builds.apache.org/job/Mesos-Windows/ws/build\3rdparty\libprocess\src\process-0.0.1.vcxproj]>
         F:\jenkins\jenkins-slave\workspace\Mesos-Windows\3rdparty\stout\include\stout/bytes.hpp(107): warning C4244: '*=': conversion from 'double' to 'uint64_t', possible loss of data (compiling source file F:\jenkins\jenkins-slave\workspace\Mesos-Windows\3rdparty\libprocess\src\poll_socket.cpp) [<https://builds.apache.org/job/Mesos-Windows/ws/build\3rdparty\libprocess\src\process-0.0.1.vcxproj]>
         F:\jenkins\jenkins-slave\workspace\Mesos-Windows\3rdparty\stout\include\stout/bytes.hpp(118): warning C4244: '/=': conversion from 'double' to 'uint64_t', possible loss of data (compiling source file F:\jenkins\jenkins-slave\workspace\Mesos-Windows\3rdparty\libprocess\src\poll_socket.cpp) [<https://builds.apache.org/job/Mesos-Windows/ws/build\3rdparty\libprocess\src\process-0.0.1.vcxproj]>
         F:\jenkins\jenkins-slave\workspace\Mesos-Windows\3rdparty\stout\include\stout/os/socket.hpp(34): warning C4244: '=': conversion from 'SOCKET' to 'int', possible loss of data (compiling source file F:\jenkins\jenkins-slave\workspace\Mesos-Windows\3rdparty\libprocess\src\poll_socket.cpp) [<https://builds.apache.org/job/Mesos-Windows/ws/build\3rdparty\libprocess\src\process-0.0.1.vcxproj]>
         F:\jenkins\jenkins-slave\workspace\Mesos-Windows\3rdparty\stout\include\stout/os/windows/close.hpp(51): warning C4800: 'BOOL': forcing value to bool 'true' or 'false' (performance warning) (compiling source file F:\jenkins\jenkins-slave\workspace\Mesos-Windows\3rdparty\libprocess\src\poll_socket.cpp) [<https://builds.apache.org/job/Mesos-Windows/ws/build\3rdparty\libprocess\src\process-0.0.1.vcxproj]>
         F:\jenkins\jenkins-slave\workspace\Mesos-Windows\3rdparty\libprocess\include\process/network.hpp(36): warning C4244: 'initializing': conversion from 'SOCKET' to 'int', possible loss of data (compiling source file F:\jenkins\jenkins-slave\workspace\Mesos-Windows\3rdparty\libprocess\src\poll_socket.cpp) [<https://builds.apache.org/job/Mesos-Windows/ws/build\3rdparty\libprocess\src\process-0.0.1.vcxproj]>
         F:\jenkins\jenkins-slave\workspace\Mesos-Windows\3rdparty\libprocess\include\process/network.hpp(51): warning C4267: 'argument': conversion from 'size_t' to 'int', possible loss of data (compiling source file F:\jenkins\jenkins-slave\workspace\Mesos-Windows\3rdparty\libprocess\src\poll_socket.cpp) [<https://builds.apache.org/job/Mesos-Windows/ws/build\3rdparty\libprocess\src\process-0.0.1.vcxproj]>
         F:\jenkins\jenkins-slave\workspace\Mesos-Windows\3rdparty\libprocess\include\process/network.hpp(65): warning C4267: 'argument': conversion from 'size_t' to 'int', possible loss of data (compiling source file F:\jenkins\jenkins-slave\workspace\Mesos-Windows\3rdparty\libprocess\src\poll_socket.cpp) [<https://builds.apache.org/job/Mesos-Windows/ws/build\3rdparty\libprocess\src\process-0.0.1.vcxproj]>
         F:\jenkins\jenkins-slave\workspace\Mesos-Windows\3rdparty\stout\include\stout/os/windows/sendfile.hpp(37): warning C4293: '>>': shift count negative or too big, undefined behavior (compiling source file F:\jenkins\jenkins-slave\workspace\Mesos-Windows\3rdparty\libprocess\src\poll_socket.cpp) [<https://builds.apache.org/job/Mesos-Windows/ws/build\3rdparty\libprocess\src\process-0.0.1.vcxproj]>
         F:\jenkins\jenkins-slave\workspace\Mesos-Windows\3rdparty\stout\include\stout/os/windows/sendfile.hpp(40): warning C4267: 'argument': conversion from 'size_t' to 'DWORD', possible loss of data (compiling source file F:\jenkins\jenkins-slave\workspace\Mesos-Windows\3rdparty\libprocess\src\poll_socket.cpp) [<https://builds.apache.org/job/Mesos-Windows/ws/build\3rdparty\libprocess\src\process-0.0.1.vcxproj]>
         F:\jenkins\jenkins-slave\workspace\Mesos-Windows\3rdparty\stout\include\stout/internal/windows/dirent.hpp(197): warning C4267: '=': conversion from 'size_t' to 'unsigned short', possible loss of data (compiling source file F:\jenkins\jenkins-slave\workspace\Mesos-Windows\3rdparty\libprocess\src\poll_socket.cpp) [<https://builds.apache.org/job/Mesos-Windows/ws/build\3rdparty\libprocess\src\process-0.0.1.vcxproj]>
         F:\jenkins\jenkins-slave\workspace\Mesos-Windows\3rdparty\stout\include\stout/internal/windows/dirent.hpp(217): warning C4267: '=': conversion from 'size_t' to 'unsigned short', possible loss of data (compiling source file F:\jenkins\jenkins-slave\workspace\Mesos-Windows\3rdparty\libprocess\src\poll_socket.cpp) [<https://builds.apache.org/job/Mesos-Windows/ws/build\3rdparty\libprocess\src\process-0.0.1.vcxproj]>
         F:\jenkins\jenkins-slave\workspace\Mesos-Windows\3rdparty\stout\include\stout/os/windows/shell.hpp(103): warning C4244: 'return': conversion from 'intptr_t' to 'int', possible loss of data (compiling source file F:\jenkins\jenkins-slave\workspace\Mesos-Windows\3rdparty\libprocess\src\poll_socket.cpp) [<https://builds.apache.org/job/Mesos-Windows/ws/build\3rdparty\libprocess\src\process-0.0.1.vcxproj]>
         F:\jenkins\jenkins-slave\workspace\Mesos-Windows\3rdparty\stout\include\stout/os/windows/shell.hpp(124): warning C4244: 'argument': conversion from 'intptr_t' to 'int', possible loss of data (compiling source file F:\jenkins\jenkins-slave\workspace\Mesos-Windows\3rdparty\libprocess\src\poll_socket.cpp) [<https://builds.apache.org/job/Mesos-Windows/ws/build\3rdparty\libprocess\src\process-0.0.1.vcxproj]>
         F:\jenkins\jenkins-slave\workspace\Mesos-Windows\3rdparty\stout\include\stout/os/windows/read.hpp(33): warning C4267: 'argument': conversion from 'size_t' to 'int', possible loss of data (compiling source file F:\jenkins\jenkins-slave\workspace\Mesos-Windows\3rdparty\libprocess\src\poll_socket.cpp) [<https://builds.apache.org/job/Mesos-Windows/ws/build\3rdparty\libprocess\src\process-0.0.1.vcxproj]>
         F:\jenkins\jenkins-slave\workspace\Mesos-Windows\3rdparty\stout\include\stout/os/windows/read.hpp(36): warning C4267: 'argument': conversion from 'size_t' to 'unsigned int', possible loss of data (compiling source file F:\jenkins\jenkins-slave\workspace\Mesos-Windows\3rdparty\libprocess\src\poll_socket.cpp) [<https://builds.apache.org/job/Mesos-Windows/ws/build\3rdparty\libprocess\src\process-0.0.1.vcxproj]>
         F:\jenkins\jenkins-slave\workspace\Mesos-Windows\3rdparty\stout\include\stout/windows/os.hpp(48): warning C4996: 'GetVersionExA': was declared deprecated (compiling source file F:\jenkins\jenkins-slave\workspace\Mesos-Windows\3rdparty\libprocess\src\poll_socket.cpp) [<https://builds.apache.org/job/Mesos-Windows/ws/build\3rdparty\libprocess\src\process-0.0.1.vcxproj]>
         F:\jenkins\jenkins-slave\workspace\Mesos-Windows\3rdparty\stout\include\stout/windows/os.hpp(155): warning C4267: 'argument': conversion from 'size_t' to 'DWORD', possible loss of data (compiling source file F:\jenkins\jenkins-slave\workspace\Mesos-Windows\3rdparty\libprocess\src\poll_socket.cpp) [<https://builds.apache.org/job/Mesos-Windows/ws/build\3rdparty\libprocess\src\process-0.0.1.vcxproj]>
         F:\jenkins\jenkins-slave\workspace\Mesos-Windows\3rdparty\stout\include\stout/windows/os.hpp(458): warning C4996: 'GetVersionExA': was declared deprecated (compiling source file F:\jenkins\jenkins-slave\workspace\Mesos-Windows\3rdparty\libprocess\src\poll_socket.cpp) [<https://builds.apache.org/job/Mesos-Windows/ws/build\3rdparty\libprocess\src\process-0.0.1.vcxproj]>
         F:\jenkins\jenkins-slave\workspace\Mesos-Windows\3rdparty\libprocess\src\poll_socket.cpp(170): warning C4267: 'argument': conversion from 'size_t' to 'int', possible loss of data [<https://builds.apache.org/job/Mesos-Windows/ws/build\3rdparty\libprocess\src\process-0.0.1.vcxproj]>
         f:\jenkins\jenkins-slave\workspace\mesos-windows\3rdparty\stout\include\stout\numify.hpp(53): warning C4146: unary minus operator applied to unsigned type, result still unsigned (compiling source file F:\jenkins\jenkins-slave\workspace\Mesos-Windows\3rdparty\libprocess\src\poll_socket.cpp) [<https://builds.apache.org/job/Mesos-Windows/ws/build\3rdparty\libprocess\src\process-0.0.1.vcxproj]>
         F:\jenkins\jenkins-slave\workspace\Mesos-Windows\3rdparty\stout\include\stout/windows.hpp(333): warning C4267: 'argument': conversion from 'size_t' to 'unsigned int', possible loss of data (compiling source file F:\jenkins\jenkins-slave\workspace\Mesos-Windows\3rdparty\libprocess\src\profiler.cpp) [<https://builds.apache.org/job/Mesos-Windows/ws/build\3rdparty\libprocess\src\process-0.0.1.vcxproj]>
         F:\jenkins\jenkins-slave\workspace\Mesos-Windows\3rdparty\stout\include\stout/windows.hpp(335): warning C4267: 'argument': conversion from 'size_t' to 'unsigned int', possible loss of data (compiling source file F:\jenkins\jenkins-slave\workspace\Mesos-Windows\3rdparty\libprocess\src\profiler.cpp) [<https://builds.apache.org/job/Mesos-Windows/ws/build\3rdparty\libprocess\src\process-0.0.1.vcxproj]>
         F:\jenkins\jenkins-slave\workspace\Mesos-Windows\3rdparty\stout\include\stout/duration.hpp(99): warning C4244: '=': conversion from 'double' to 'long', possible loss of data (compiling source file F:\jenkins\jenkins-slave\workspace\Mesos-Windows\3rdparty\libprocess\src\profiler.cpp) [<https://builds.apache.org/job/Mesos-Windows/ws/build\3rdparty\libprocess\src\process-0.0.1.vcxproj]>
         F:\jenkins\jenkins-slave\workspace\Mesos-Windows\3rdparty\stout\include\stout/duration.hpp(100): warning C4244: '=': conversion from 'double' to 'long', possible loss of data (compiling source file F:\jenkins\jenkins-slave\workspace\Mesos-Windows\3rdparty\libprocess\src\profiler.cpp) [<https://builds.apache.org/job/Mesos-Windows/ws/build\3rdparty\libprocess\src\process-0.0.1.vcxproj]>
         F:\jenkins\jenkins-slave\workspace\Mesos-Windows\3rdparty\stout\include\stout/bytes.hpp(107): warning C4244: '*=': conversion from 'double' to 'uint64_t', possible loss of data (compiling source file F:\jenkins\jenkins-slave\workspace\Mesos-Windows\3rdparty\libprocess\src\profiler.cpp) [<https://builds.apache.org/job/Mesos-Windows/ws/build\3rdparty\libprocess\src\process-0.0.1.vcxproj]>
         F:\jenkins\jenkins-slave\workspace\Mesos-Windows\3rdparty\stout\include\stout/bytes.hpp(118): warning C4244: '/=': conversion from 'double' to 'uint64_t', possible loss of data (compiling source file F:\jenkins\jenkins-slave\workspace\Mesos-Windows\3rdparty\libprocess\src\profiler.cpp) [<https://builds.apache.org/job/Mesos-Windows/ws/build\3rdparty\libprocess\src\process-0.0.1.vcxproj]>
         F:\jenkins\jenkins-slave\workspace\Mesos-Windows\3rdparty\stout\include\stout/os/socket.hpp(34): warning C4244: '=': conversion from 'SOCKET' to 'int', possible loss of data (compiling source file F:\jenkins\jenkins-slave\workspace\Mesos-Windows\3rdparty\libprocess\src\profiler.cpp) [<https://builds.apache.org/job/Mesos-Windows/ws/build\3rdparty\libprocess\src\process-0.0.1.vcxproj]>
         F:\jenkins\jenkins-slave\workspace\Mesos-Windows\3rdparty\stout\include\stout/os/windows/close.hpp(51): warning C4800: 'BOOL': forcing value to bool 'true' or 'false' (performance warning) (compiling source file F:\jenkins\jenkins-slave\workspace\Mesos-Windows\3rdparty\libprocess\src\profiler.cpp) [<https://builds.apache.org/job/Mesos-Windows/ws/build\3rdparty\libprocess\src\process-0.0.1.vcxproj]>
         F:\jenkins\jenkins-slave\workspace\Mesos-Windows\3rdparty\stout\include\stout/windows.hpp(333): warning C4267: 'argument': conversion from 'size_t' to 'unsigned int', possible loss of data (compiling source file F:\jenkins\jenkins-slave\workspace\Mesos-Windows\3rdparty\libprocess\src\process.cpp) [<https://builds.apache.org/job/Mesos-Windows/ws/build\3rdparty\libprocess\src\process-0.0.1.vcxproj]>
         F:\jenkins\jenkins-slave\workspace\Mesos-Windows\3rdparty\stout\include\stout/windows.hpp(335): warning C4267: 'argument': conversion from 'size_t' to 'unsigned int', possible loss of data (compiling source file F:\jenkins\jenkins-slave\workspace\Mesos-Windows\3rdparty\libprocess\src\process.cpp) [<https://builds.apache.org/job/Mesos-Windows/ws/build\3rdparty\libprocess\src\process-0.0.1.vcxproj]>
         F:\jenkins\jenkins-slave\workspace\Mesos-Windows\3rdparty\stout\include\stout/internal/windows/dirent.hpp(197): warning C4267: '=': conversion from 'size_t' to 'unsigned short', possible loss of data (compiling source file F:\jenkins\jenkins-slave\workspace\Mesos-Windows\3rdparty\libprocess\src\profiler.cpp) [<https://builds.apache.org/job/Mesos-Windows/ws/build\3rdparty\libprocess\src\process-0.0.1.vcxproj]>
         F:\jenkins\jenkins-slave\workspace\Mesos-Windows\3rdparty\stout\include\stout/internal/windows/dirent.hpp(217): warning C4267: '=': conversion from 'size_t' to 'unsigned short', possible loss of data (compiling source file F:\jenkins\jenkins-slave\workspace\Mesos-Windows\3rdparty\libprocess\src\profiler.cpp) [<https://builds.apache.org/job/Mesos-Windows/ws/build\3rdparty\libprocess\src\process-0.0.1.vcxproj]>
         F:\jenkins\jenkins-slave\workspace\Mesos-Windows\3rdparty\stout\include\stout/os/windows/shell.hpp(103): warning C4244: 'return': conversion from 'intptr_t' to 'int', possible loss of data (compiling source file F:\jenkins\jenkins-slave\workspace\Mesos-Windows\3rdparty\libprocess\src\profiler.cpp) [<https://builds.apache.org/job/Mesos-Windows/ws/build\3rdparty\libprocess\src\process-0.0.1.vcxproj]>
         F:\jenkins\jenkins-slave\workspace\Mesos-Windows\3rdparty\stout\include\stout/os/windows/shell.hpp(124): warning C4244: 'argument': conversion from 'intptr_t' to 'int', possible loss of data (compiling source file F:\jenkins\jenkins-slave\workspace\Mesos-Windows\3rdparty\libprocess\src\profiler.cpp) [<https://builds.apache.org/job/Mesos-Windows/ws/build\3rdparty\libprocess\src\process-0.0.1.vcxproj]>
         F:\jenkins\jenkins-slave\workspace\Mesos-Windows\3rdparty\stout\include\stout/os/windows/read.hpp(33): warning C4267: 'argument': conversion from 'size_t' to 'int', possible loss of data (compiling source file F:\jenkins\jenkins-slave\workspace\Mesos-Windows\3rdparty\libprocess\src\profiler.cpp) [<https://builds.apache.org/job/Mesos-Windows/ws/build\3rdparty\libprocess\src\process-0.0.1.vcxproj]>
         F:\jenkins\jenkins-slave\workspace\Mesos-Windows\3rdparty\stout\include\stout/os/windows/read.hpp(36): warning C4267: 'argument': conversion from 'size_t' to 'unsigned int', possible loss of data (compiling source file F:\jenkins\jenkins-slave\workspace\Mesos-Windows\3rdparty\libprocess\src\profiler.cpp) [<https://builds.apache.org/job/Mesos-Windows/ws/build\3rdparty\libprocess\src\process-0.0.1.vcxproj]>
         F:\jenkins\jenkins-slave\workspace\Mesos-Windows\3rdparty\stout\include\stout/windows/os.hpp(48): warning C4996: 'GetVersionExA': was declared deprecated (compiling source file F:\jenkins\jenkins-slave\workspace\Mesos-Windows\3rdparty\libprocess\src\profiler.cpp) [<https://builds.apache.org/job/Mesos-Windows/ws/build\3rdparty\libprocess\src\process-0.0.1.vcxproj]>
         F:\jenkins\jenkins-slave\workspace\Mesos-Windows\3rdparty\stout\include\stout/windows/os.hpp(155): warning C4267: 'argument': conversion from 'size_t' to 'DWORD', possible loss of data (compiling source file F:\jenkins\jenkins-slave\workspace\Mesos-Windows\3rdparty\libprocess\src\profiler.cpp) [<https://builds.apache.org/job/Mesos-Windows/ws/build\3rdparty\libprocess\src\process-0.0.1.vcxproj]>
         F:\jenkins\jenkins-slave\workspace\Mesos-Windows\3rdparty\stout\include\stout/windows/os.hpp(458): warning C4996: 'GetVersionExA': was declared deprecated (compiling source file F:\jenkins\jenkins-slave\workspace\Mesos-Windows\3rdparty\libprocess\src\profiler.cpp) [<https://builds.apache.org/job/Mesos-Windows/ws/build\3rdparty\libprocess\src\process-0.0.1.vcxproj]>
         F:\jenkins\jenkins-slave\workspace\Mesos-Windows\3rdparty\stout\include\stout/bytes.hpp(107): warning C4244: '*=': conversion from 'double' to 'uint64_t', possible loss of data (compiling source file F:\jenkins\jenkins-slave\workspace\Mesos-Windows\3rdparty\libprocess\src\process.cpp) [<https://builds.apache.org/job/Mesos-Windows/ws/build\3rdparty\libprocess\src\process-0.0.1.vcxproj]>
         F:\jenkins\jenkins-slave\workspace\Mesos-Windows\3rdparty\stout\include\stout/bytes.hpp(118): warning C4244: '/=': conversion from 'double' to 'uint64_t', possible loss of data (compiling source file F:\jenkins\jenkins-slave\workspace\Mesos-Windows\3rdparty\libprocess\src\process.cpp) [<https://builds.apache.org/job/Mesos-Windows/ws/build\3rdparty\libprocess\src\process-0.0.1.vcxproj]>
         F:\jenkins\jenkins-slave\workspace\Mesos-Windows\3rdparty\stout\include\stout/os/socket.hpp(34): warning C4244: '=': conversion from 'SOCKET' to 'int', possible loss of data (compiling source file F:\jenkins\jenkins-slave\workspace\Mesos-Windows\3rdparty\libprocess\src\process.cpp) [<https://builds.apache.org/job/Mesos-Windows/ws/build\3rdparty\libprocess\src\process-0.0.1.vcxproj]>
         F:\jenkins\jenkins-slave\workspace\Mesos-Windows\3rdparty\stout\include\stout/os/windows/close.hpp(51): warning C4800: 'BOOL': forcing value to bool 'true' or 'false' (performance warning) (compiling source file F:\jenkins\jenkins-slave\workspace\Mesos-Windows\3rdparty\libprocess\src\process.cpp) [<https://builds.apache.org/job/Mesos-Windows/ws/build\3rdparty\libprocess\src\process-0.0.1.vcxproj]>
         F:\jenkins\jenkins-slave\workspace\Mesos-Windows\3rdparty\stout\include\stout/duration.hpp(99): warning C4244: '=': conversion from 'double' to 'long', possible loss of data (compiling source file F:\jenkins\jenkins-slave\workspace\Mesos-Windows\3rdparty\libprocess\src\process.cpp) [<https://builds.apache.org/job/Mesos-Windows/ws/build\3rdparty\libprocess\src\process-0.0.1.vcxproj]>
         F:\jenkins\jenkins-slave\workspace\Mesos-Windows\3rdparty\stout\include\stout/duration.hpp(100): warning C4244: '=': conversion from 'double' to 'long', possible loss of data (compiling source file F:\jenkins\jenkins-slave\workspace\Mesos-Windows\3rdparty\libprocess\src\process.cpp) [<https://builds.apache.org/job/Mesos-Windows/ws/build\3rdparty\libprocess\src\process-0.0.1.vcxproj]>
         f:\jenkins\jenkins-slave\workspace\mesos-windows\3rdparty\stout\include\stout\numify.hpp(53): warning C4146: unary minus operator applied to unsigned type, result still unsigned (compiling source file F:\jenkins\jenkins-slave\workspace\Mesos-Windows\3rdparty\libprocess\src\profiler.cpp) [<https://builds.apache.org/job/Mesos-Windows/ws/build\3rdparty\libprocess\src\process-0.0.1.vcxproj]>
         F:\jenkins\jenkins-slave\workspace\Mesos-Windows\3rdparty\stout\include\stout/internal/windows/dirent.hpp(197): warning C4267: '=': conversion from 'size_t' to 'unsigned short', possible loss of data (compiling source file F:\jenkins\jenkins-slave\workspace\Mesos-Windows\3rdparty\libprocess\src\process.cpp) [<https://builds.apache.org/job/Mesos-Windows/ws/build\3rdparty\libprocess\src\process-0.0.1.vcxproj]>
         F:\jenkins\jenkins-slave\workspace\Mesos-Windows\3rdparty\stout\include\stout/internal/windows/dirent.hpp(217): warning C4267: '=': conversion from 'size_t' to 'unsigned short', possible loss of data (compiling source file F:\jenkins\jenkins-slave\workspace\Mesos-Windows\3rdparty\libprocess\src\process.cpp) [<https://builds.apache.org/job/Mesos-Windows/ws/build\3rdparty\libprocess\src\process-0.0.1.vcxproj]>
         F:\jenkins\jenkins-slave\workspace\Mesos-Windows\3rdparty\stout\include\stout/os/windows/shell.hpp(103): warning C4244: 'return': conversion from 'intptr_t' to 'int', possible loss of data (compiling source file F:\jenkins\jenkins-slave\workspace\Mesos-Windows\3rdparty\libprocess\src\process.cpp) [<https://builds.apache.org/job/Mesos-Windows/ws/build\3rdparty\libprocess\src\process-0.0.1.vcxproj]>
         F:\jenkins\jenkins-slave\workspace\Mesos-Windows\3rdparty\stout\include\stout/os/windows/shell.hpp(124): warning C4244: 'argument': conversion from 'intptr_t' to 'int', possible loss of data (compiling source file F:\jenkins\jenkins-slave\workspace\Mesos-Windows\3rdparty\libprocess\src\process.cpp) [<https://builds.apache.org/job/Mesos-Windows/ws/build\3rdparty\libprocess\src\process-0.0.1.vcxproj]>
         F:\jenkins\jenkins-slave\workspace\Mesos-Windows\3rdparty\stout\include\stout/os/windows/read.hpp(33): warning C4267: 'argument': conversion from 'size_t' to 'int', possible loss of data (compiling source file F:\jenkins\jenkins-slave\workspace\Mesos-Windows\3rdparty\libprocess\src\process.cpp) [<https://builds.apache.org/job/Mesos-Windows/ws/build\3rdparty\libprocess\src\process-0.0.1.vcxproj]>
         F:\jenkins\jenkins-slave\workspace\Mesos-Windows\3rdparty\stout\include\stout/os/windows/read.hpp(36): warning C4267: 'argument': conversion from 'size_t' to 'unsigned int', possible loss of data (compiling source file F:\jenkins\jenkins-slave\workspace\Mesos-Windows\3rdparty\libprocess\src\process.cpp) [<https://builds.apache.org/job/Mesos-Windows/ws/build\3rdparty\libprocess\src\process-0.0.1.vcxproj]>
         F:\jenkins\jenkins-slave\workspace\Mesos-Windows\3rdparty\stout\include\stout/windows/os.hpp(48): warning C4996: 'GetVersionExA': was declared deprecated (compiling source file F:\jenkins\jenkins-slave\workspace\Mesos-Windows\3rdparty\libprocess\src\process.cpp) [<https://builds.apache.org/job/Mesos-Windows/ws/build\3rdparty\libprocess\src\process-0.0.1.vcxproj]>
         F:\jenkins\jenkins-slave\workspace\Mesos-Windows\3rdparty\stout\include\stout/windows/os.hpp(155): warning C4267: 'argument': conversion from 'size_t' to 'DWORD', possible loss of data (compiling source file F:\jenkins\jenkins-slave\workspace\Mesos-Windows\3rdparty\libprocess\src\process.cpp) [<https://builds.apache.org/job/Mesos-Windows/ws/build\3rdparty\libprocess\src\process-0.0.1.vcxproj]>
         F:\jenkins\jenkins-slave\workspace\Mesos-Windows\3rdparty\stout\include\stout/windows/os.hpp(458): warning C4996: 'GetVersionExA': was declared deprecated (compiling source file F:\jenkins\jenkins-slave\workspace\Mesos-Windows\3rdparty\libprocess\src\process.cpp) [<https://builds.apache.org/job/Mesos-Windows/ws/build\3rdparty\libprocess\src\process-0.0.1.vcxproj]>
         F:\jenkins\jenkins-slave\workspace\Mesos-Windows\3rdparty\stout\include\stout/gzip.hpp(52): warning C4267: '=': conversion from 'size_t' to 'uInt', possible loss of data (compiling source file F:\jenkins\jenkins-slave\workspace\Mesos-Windows\3rdparty\libprocess\src\process.cpp) [<https://builds.apache.org/job/Mesos-Windows/ws/build\3rdparty\libprocess\src\process-0.0.1.vcxproj]>
         F:\jenkins\jenkins-slave\workspace\Mesos-Windows\3rdparty\stout\include\stout/gzip.hpp(105): warning C4267: '=': conversion from 'size_t' to 'uInt', possible loss of data (compiling source file F:\jenkins\jenkins-slave\workspace\Mesos-Windows\3rdparty\libprocess\src\process.cpp) [<https://builds.apache.org/job/Mesos-Windows/ws/build\3rdparty\libprocess\src\process-0.0.1.vcxproj]>
         f:\jenkins\jenkins-slave\workspace\mesos-windows\3rdparty\libprocess\src\decoder.hpp(175): warning C4800: 'int': forcing value to bool 'true' or 'false' (performance warning) (compiling source file F:\jenkins\jenkins-slave\workspace\Mesos-Windows\3rdparty\libprocess\src\process.cpp) [<https://builds.apache.org/job/Mesos-Windows/ws/build\3rdparty\libprocess\src\process-0.0.1.vcxproj]>
         f:\jenkins\jenkins-slave\workspace\mesos-windows\3rdparty\libprocess\src\decoder.hpp(243): warning C4267: 'argument': conversion from 'size_t' to 'char', possible loss of data (compiling source file F:\jenkins\jenkins-slave\workspace\Mesos-Windows\3rdparty\libprocess\src\process.cpp) [<https://builds.apache.org/job/Mesos-Windows/ws/build\3rdparty\libprocess\src\process-0.0.1.vcxproj]>
         f:\jenkins\jenkins-slave\workspace\mesos-windows\3rdparty\libprocess\src\decoder.hpp(434): warning C4267: 'argument': conversion from 'size_t' to 'char', possible loss of data (compiling source file F:\jenkins\jenkins-slave\workspace\Mesos-Windows\3rdparty\libprocess\src\process.cpp) [<https://builds.apache.org/job/Mesos-Windows/ws/build\3rdparty\libprocess\src\process-0.0.1.vcxproj]>
         f:\jenkins\jenkins-slave\workspace\mesos-windows\3rdparty\libprocess\src\encoder.hpp(270): warning C4267: '=': conversion from 'size_t' to 'off_t', possible loss of data (compiling source file F:\jenkins\jenkins-slave\workspace\Mesos-Windows\3rdparty\libprocess\src\process.cpp) [<https://builds.apache.org/job/Mesos-Windows/ws/build\3rdparty\libprocess\src\process-0.0.1.vcxproj]>
         f:\jenkins\jenkins-slave\workspace\mesos-windows\3rdparty\libprocess\src\encoder.hpp(279): warning C4267: '-=': conversion from 'size_t' to 'off_t', possible loss of data (compiling source file F:\jenkins\jenkins-slave\workspace\Mesos-Windows\3rdparty\libprocess\src\process.cpp) [<https://builds.apache.org/job/Mesos-Windows/ws/build\3rdparty\libprocess\src\process-0.0.1.vcxproj]>
         F:\jenkins\jenkins-slave\workspace\Mesos-Windows\3rdparty\stout\include\stout/windows.hpp(333): warning C4267: 'argument': conversion from 'size_t' to 'unsigned int', possible loss of data (compiling source file F:\jenkins\jenkins-slave\workspace\Mesos-Windows\3rdparty\libprocess\src\reap.cpp) [<https://builds.apache.org/job/Mesos-Windows/ws/build\3rdparty\libprocess\src\process-0.0.1.vcxproj]>
         F:\jenkins\jenkins-slave\workspace\Mesos-Windows\3rdparty\stout\include\stout/windows.hpp(335): warning C4267: 'argument': conversion from 'size_t' to 'unsigned int', possible loss of data (compiling source file F:\jenkins\jenkins-slave\workspace\Mesos-Windows\3rdparty\libprocess\src\reap.cpp) [<https://builds.apache.org/job/Mesos-Windows/ws/build\3rdparty\libprocess\src\process-0.0.1.vcxproj]>
         F:\jenkins\jenkins-slave\workspace\Mesos-Windows\3rdparty\stout\include\stout/duration.hpp(99): warning C4244: '=': conversion from 'double' to 'long', possible loss of data (compiling source file F:\jenkins\jenkins-slave\workspace\Mesos-Windows\3rdparty\libprocess\src\reap.cpp) [<https://builds.apache.org/job/Mesos-Windows/ws/build\3rdparty\libprocess\src\process-0.0.1.vcxproj]>
         F:\jenkins\jenkins-slave\workspace\Mesos-Windows\3rdparty\stout\include\stout/duration.hpp(100): warning C4244: '=': conversion from 'double' to 'long', possible loss of data (compiling source file F:\jenkins\jenkins-slave\workspace\Mesos-Windows\3rdparty\libprocess\src\reap.cpp) [<https://builds.apache.org/job/Mesos-Windows/ws/build\3rdparty\libprocess\src\process-0.0.1.vcxproj]>
         F:\jenkins\jenkins-slave\workspace\Mesos-Windows\3rdparty\stout\include\stout/bytes.hpp(107): warning C4244: '*=': conversion from 'double' to 'uint64_t', possible loss of data (compiling source file F:\jenkins\jenkins-slave\workspace\Mesos-Windows\3rdparty\libprocess\src\reap.cpp) [<https://builds.apache.org/job/Mesos-Windows/ws/build\3rdparty\libprocess\src\process-0.0.1.vcxproj]>
         F:\jenkins\jenkins-slave\workspace\Mesos-Windows\3rdparty\stout\include\stout/bytes.hpp(118): warning C4244: '/=': conversion from 'double' to 'uint64_t', possible loss of data (compiling source file F:\jenkins\jenkins-slave\workspace\Mesos-Windows\3rdparty\libprocess\src\reap.cpp) [<https://builds.apache.org/job/Mesos-Windows/ws/build\3rdparty\libprocess\src\process-0.0.1.vcxproj]>
         F:\jenkins\jenkins-slave\workspace\Mesos-Windows\3rdparty\stout\include\stout/os/socket.hpp(34): warning C4244: '=': conversion from 'SOCKET' to 'int', possible loss of data (compiling source file F:\jenkins\jenkins-slave\workspace\Mesos-Windows\3rdparty\libprocess\src\reap.cpp) [<https://builds.apache.org/job/Mesos-Windows/ws/build\3rdparty\libprocess\src\process-0.0.1.vcxproj]>
         F:\jenkins\jenkins-slave\workspace\Mesos-Windows\3rdparty\stout\include\stout/os/windows/close.hpp(51): warning C4800: 'BOOL': forcing value to bool 'true' or 'false' (performance warning) (compiling source file F:\jenkins\jenkins-slave\workspace\Mesos-Windows\3rdparty\libprocess\src\reap.cpp) [<https://builds.apache.org/job/Mesos-Windows/ws/build\3rdparty\libprocess\src\process-0.0.1.vcxproj]>
         F:\jenkins\jenkins-slave\workspace\Mesos-Windows\3rdparty\stout\include\stout/numify.hpp(53): warning C4146: unary minus operator applied to unsigned type, result still unsigned (compiling source file F:\jenkins\jenkins-slave\workspace\Mesos-Windows\3rdparty\libprocess\src\process.cpp) [<https://builds.apache.org/job/Mesos-Windows/ws/build\3rdparty\libprocess\src\process-0.0.1.vcxproj]>
         F:\jenkins\jenkins-slave\workspace\Mesos-Windows\3rdparty\stout\include\stout/internal/windows/dirent.hpp(197): warning C4267: '=': conversion from 'size_t' to 'unsigned short', possible loss of data (compiling source file F:\jenkins\jenkins-slave\workspace\Mesos-Windows\3rdparty\libprocess\src\reap.cpp) [<https://builds.apache.org/job/Mesos-Windows/ws/build\3rdparty\libprocess\src\process-0.0.1.vcxproj]>
         F:\jenkins\jenkins-slave\workspace\Mesos-Windows\3rdparty\stout\include\stout/internal/windows/dirent.hpp(217): warning C4267: '=': conversion from 'size_t' to 'unsigned short', possible loss of data (compiling source file F:\jenkins\jenkins-slave\workspace\Mesos-Windows\3rdparty\libprocess\src\reap.cpp) [<https://builds.apache.org/job/Mesos-Windows/ws/build\3rdparty\libprocess\src\process-0.0.1.vcxproj]>
         F:\jenkins\jenkins-slave\workspace\Mesos-Windows\3rdparty\stout\include\stout/os/windows/shell.hpp(103): warning C4244: 'return': conversion from 'intptr_t' to 'int', possible loss of data (compiling source file F:\jenkins\jenkins-slave\workspace\Mesos-Windows\3rdparty\libprocess\src\reap.cpp) [<https://builds.apache.org/job/Mesos-Windows/ws/build\3rdparty\libprocess\src\process-0.0.1.vcxproj]>
         F:\jenkins\jenkins-slave\workspace\Mesos-Windows\3rdparty\stout\include\stout/os/windows/shell.hpp(124): warning C4244: 'argument': conversion from 'intptr_t' to 'int', possible loss of data (compiling source file F:\jenkins\jenkins-slave\workspace\Mesos-Windows\3rdparty\libprocess\src\reap.cpp) [<https://builds.apache.org/job/Mesos-Windows/ws/build\3rdparty\libprocess\src\process-0.0.1.vcxproj]>
         F:\jenkins\jenkins-slave\workspace\Mesos-Windows\3rdparty\stout\include\stout/os/windows/read.hpp(33): warning C4267: 'argument': conversion from 'size_t' to 'int', possible loss of data (compiling source file F:\jenkins\jenkins-slave\workspace\Mesos-Windows\3rdparty\libprocess\src\reap.cpp) [<https://builds.apache.org/job/Mesos-Windows/ws/build\3rdparty\libprocess\src\process-0.0.1.vcxproj]>
         F:\jenkins\jenkins-slave\workspace\Mesos-Windows\3rdparty\stout\include\stout/os/windows/read.hpp(36): warning C4267: 'argument': conversion from 'size_t' to 'unsigned int', possible loss of data (compiling source file F:\jenkins\jenkins-slave\workspace\Mesos-Windows\3rdparty\libprocess\src\reap.cpp) [<https://builds.apache.org/job/Mesos-Windows/ws/build\3rdparty\libprocess\src\process-0.0.1.vcxproj]>
         F:\jenkins\jenkins-slave\workspace\Mesos-Windows\3rdparty\stout\include\stout/windows/os.hpp(48): warning C4996: 'GetVersionExA': was declared deprecated (compiling source file F:\jenkins\jenkins-slave\workspace\Mesos-Windows\3rdparty\libprocess\src\reap.cpp) [<https://builds.apache.org/job/Mesos-Windows/ws/build\3rdparty\libprocess\src\process-0.0.1.vcxproj]>
         F:\jenkins\jenkins-slave\workspace\Mesos-Windows\3rdparty\stout\include\stout/windows/os.hpp(155): warning C4267: 'argument': conversion from 'size_t' to 'DWORD', possible loss of data (compiling source file F:\jenkins\jenkins-slave\workspace\Mesos-Windows\3rdparty\libprocess\src\reap.cpp) [<https://builds.apache.org/job/Mesos-Windows/ws/build\3rdparty\libprocess\src\process-0.0.1.vcxproj]>
         F:\jenkins\jenkins-slave\workspace\Mesos-Windows\3rdparty\stout\include\stout/windows/os.hpp(458): warning C4996: 'GetVersionExA': was declared deprecated (compiling source file F:\jenkins\jenkins-slave\workspace\Mesos-Windows\3rdparty\libprocess\src\reap.cpp) [<https://builds.apache.org/job/Mesos-Windows/ws/build\3rdparty\libprocess\src\process-0.0.1.vcxproj]>
         F:\jenkins\jenkins-slave\workspace\Mesos-Windows\3rdparty\libprocess\include\process/future.hpp(918): warning C4244: 'argument': conversion from 'const uint64_t' to 'const double', possible loss of data (compiling source file F:\jenkins\jenkins-slave\workspace\Mesos-Windows\3rdparty\libprocess\src\process.cpp) [<https://builds.apache.org/job/Mesos-Windows/ws/build\3rdparty\libprocess\src\process-0.0.1.vcxproj]>
         f:\jenkins\jenkins-slave\workspace\mesos-windows\3rdparty\stout\include\stout\numify.hpp(53): warning C4146: unary minus operator applied to unsigned type, result still unsigned (compiling source file F:\jenkins\jenkins-slave\workspace\Mesos-Windows\3rdparty\libprocess\src\reap.cpp) [<https://builds.apache.org/job/Mesos-Windows/ws/build\3rdparty\libprocess\src\process-0.0.1.vcxproj]>
         F:\jenkins\jenkins-slave\workspace\Mesos-Windows\3rdparty\stout\include\stout/windows.hpp(333): warning C4267: 'argument': conversion from 'size_t' to 'unsigned int', possible loss of data (compiling source file F:\jenkins\jenkins-slave\workspace\Mesos-Windows\3rdparty\libprocess\src\socket.cpp) [<https://builds.apache.org/job/Mesos-Windows/ws/build\3rdparty\libprocess\src\process-0.0.1.vcxproj]>
         F:\jenkins\jenkins-slave\workspace\Mesos-Windows\3rdparty\stout\include\stout/windows.hpp(335): warning C4267: 'argument': conversion from 'size_t' to 'unsigned int', possible loss of data (compiling source file F:\jenkins\jenkins-slave\workspace\Mesos-Windows\3rdparty\libprocess\src\socket.cpp) [<https://builds.apache.org/job/Mesos-Windows/ws/build\3rdparty\libprocess\src\process-0.0.1.vcxproj]>
         F:\jenkins\jenkins-slave\workspace\Mesos-Windows\3rdparty\stout\include\stout/bytes.hpp(107): warning C4244: '*=': conversion from 'double' to 'uint64_t', possible loss of data (compiling source file F:\jenkins\jenkins-slave\workspace\Mesos-Windows\3rdparty\libprocess\src\socket.cpp) [<https://builds.apache.org/job/Mesos-Windows/ws/build\3rdparty\libprocess\src\process-0.0.1.vcxproj]>
         F:\jenkins\jenkins-slave\workspace\Mesos-Windows\3rdparty\stout\include\stout/bytes.hpp(118): warning C4244: '/=': conversion from 'double' to 'uint64_t', possible loss of data (compiling source file F:\jenkins\jenkins-slave\workspace\Mesos-Windows\3rdparty\libprocess\src\socket.cpp) [<https://builds.apache.org/job/Mesos-Windows/ws/build\3rdparty\libprocess\src\process-0.0.1.vcxproj]>
         F:\jenkins\jenkins-slave\workspace\Mesos-Windows\3rdparty\stout\include\stout/os/socket.hpp(34): warning C4244: '=': conversion from 'SOCKET' to 'int', possible loss of data (compiling source file F:\jenkins\jenkins-slave\workspace\Mesos-Windows\3rdparty\libprocess\src\socket.cpp) [<https://builds.apache.org/job/Mesos-Windows/ws/build\3rdparty\libprocess\src\process-0.0.1.vcxproj]>
         F:\jenkins\jenkins-slave\workspace\Mesos-Windows\3rdparty\stout\include\stout/os/windows/close.hpp(51): warning C4800: 'BOOL': forcing value to bool 'true' or 'false' (performance warning) (compiling source file F:\jenkins\jenkins-slave\workspace\Mesos-Windows\3rdparty\libprocess\src\socket.cpp) [<https://builds.apache.org/job/Mesos-Windows/ws/build\3rdparty\libprocess\src\process-0.0.1.vcxproj]>
         F:\jenkins\jenkins-slave\workspace\Mesos-Windows\3rdparty\libprocess\include\process/network.hpp(36): warning C4244: 'initializing': conversion from 'SOCKET' to 'int', possible loss of data (compiling source file F:\jenkins\jenkins-slave\workspace\Mesos-Windows\3rdparty\libprocess\src\socket.cpp) [<https://builds.apache.org/job/Mesos-Windows/ws/build\3rdparty\libprocess\src\process-0.0.1.vcxproj]>
         F:\jenkins\jenkins-slave\workspace\Mesos-Windows\3rdparty\libprocess\include\process/network.hpp(51): warning C4267: 'argument': conversion from 'size_t' to 'int', possible loss of data (compiling source file F:\jenkins\jenkins-slave\workspace\Mesos-Windows\3rdparty\libprocess\src\socket.cpp) [<https://builds.apache.org/job/Mesos-Windows/ws/build\3rdparty\libprocess\src\process-0.0.1.vcxproj]>
         F:\jenkins\jenkins-slave\workspace\Mesos-Windows\3rdparty\libprocess\include\process/network.hpp(65): warning C4267: 'argument': conversion from 'size_t' to 'int', possible loss of data (compiling source file F:\jenkins\jenkins-slave\workspace\Mesos-Windows\3rdparty\libprocess\src\socket.cpp) [<https://builds.apache.org/job/Mesos-Windows/ws/build\3rdparty\libprocess\src\process-0.0.1.vcxproj]>
         F:\jenkins\jenkins-slave\workspace\Mesos-Windows\3rdparty\stout\include\stout/duration.hpp(99): warning C4244: '=': conversion from 'double' to 'long', possible loss of data (compiling source file F:\jenkins\jenkins-slave\workspace\Mesos-Windows\3rdparty\libprocess\src\socket.cpp) [<https://builds.apache.org/job/Mesos-Windows/ws/build\3rdparty\libprocess\src\process-0.0.1.vcxproj]>
         F:\jenkins\jenkins-slave\workspace\Mesos-Windows\3rdparty\stout\include\stout/duration.hpp(100): warning C4244: '=': conversion from 'double' to 'long', possible loss of data (compiling source file F:\jenkins\jenkins-slave\workspace\Mesos-Windows\3rdparty\libprocess\src\socket.cpp) [<https://builds.apache.org/job/Mesos-Windows/ws/build\3rdparty\libprocess\src\process-0.0.1.vcxproj]>
         F:\jenkins\jenkins-slave\workspace\Mesos-Windows\3rdparty\stout\include\stout/internal/windows/dirent.hpp(197): warning C4267: '=': conversion from 'size_t' to 'unsigned short', possible loss of data (compiling source file F:\jenkins\jenkins-slave\workspace\Mesos-Windows\3rdparty\libprocess\src\socket.cpp) [<https://builds.apache.org/job/Mesos-Windows/ws/build\3rdparty\libprocess\src\process-0.0.1.vcxproj]>
         F:\jenkins\jenkins-slave\workspace\Mesos-Windows\3rdparty\stout\include\stout/internal/windows/dirent.hpp(217): warning C4267: '=': conversion from 'size_t' to 'unsigned short', possible loss of data (compiling source file F:\jenkins\jenkins-slave\workspace\Mesos-Windows\3rdparty\libprocess\src\socket.cpp) [<https://builds.apache.org/job/Mesos-Windows/ws/build\3rdparty\libprocess\src\process-0.0.1.vcxproj]>
         F:\jenkins\jenkins-slave\workspace\Mesos-Windows\3rdparty\stout\include\stout/os/windows/shell.hpp(103): warning C4244: 'return': conversion from 'intptr_t' to 'int', possible loss of data (compiling source file F:\jenkins\jenkins-slave\workspace\Mesos-Windows\3rdparty\libprocess\src\socket.cpp) [<https://builds.apache.org/job/Mesos-Windows/ws/build\3rdparty\libprocess\src\process-0.0.1.vcxproj]>
         F:\jenkins\jenkins-slave\workspace\Mesos-Windows\3rdparty\stout\include\stout/os/windows/shell.hpp(124): warning C4244: 'argument': conversion from 'intptr_t' to 'int', possible loss of data (compiling source file F:\jenkins\jenkins-slave\workspace\Mesos-Windows\3rdparty\libprocess\src\socket.cpp) [<https://builds.apache.org/job/Mesos-Windows/ws/build\3rdparty\libprocess\src\process-0.0.1.vcxproj]>
         F:\jenkins\jenkins-slave\workspace\Mesos-Windows\3rdparty\stout\include\stout/os/windows/read.hpp(33): warning C4267: 'argument': conversion from 'size_t' to 'int', possible loss of data (compiling source file F:\jenkins\jenkins-slave\workspace\Mesos-Windows\3rdparty\libprocess\src\socket.cpp) [<https://builds.apache.org/job/Mesos-Windows/ws/build\3rdparty\libprocess\src\process-0.0.1.vcxproj]>
         F:\jenkins\jenkins-slave\workspace\Mesos-Windows\3rdparty\stout\include\stout/os/windows/read.hpp(36): warning C4267: 'argument': conversion from 'size_t' to 'unsigned int', possible loss of data (compiling source file F:\jenkins\jenkins-slave\workspace\Mesos-Windows\3rdparty\libprocess\src\socket.cpp) [<https://builds.apache.org/job/Mesos-Windows/ws/build\3rdparty\libprocess\src\process-0.0.1.vcxproj]>
         F:\jenkins\jenkins-slave\workspace\Mesos-Windows\3rdparty\stout\include\stout/windows/os.hpp(48): warning C4996: 'GetVersionExA': was declared deprecated (compiling source file F:\jenkins\jenkins-slave\workspace\Mesos-Windows\3rdparty\libprocess\src\socket.cpp) [<https://builds.apache.org/job/Mesos-Windows/ws/build\3rdparty\libprocess\src\process-0.0.1.vcxproj]>
         F:\jenkins\jenkins-slave\workspace\Mesos-Windows\3rdparty\stout\include\stout/windows/os.hpp(155): warning C4267: 'argument': conversion from 'size_t' to 'DWORD', possible loss of data (compiling source file F:\jenkins\jenkins-slave\workspace\Mesos-Windows\3rdparty\libprocess\src\socket.cpp) [<https://builds.apache.org/job/Mesos-Windows/ws/build\3rdparty\libprocess\src\process-0.0.1.vcxproj]>
         F:\jenkins\jenkins-slave\workspace\Mesos-Windows\3rdparty\stout\include\stout/windows/os.hpp(458): warning C4996: 'GetVersionExA': was declared deprecated (compiling source file F:\jenkins\jenkins-slave\workspace\Mesos-Windows\3rdparty\libprocess\src\socket.cpp) [<https://builds.apache.org/job/Mesos-Windows/ws/build\3rdparty\libprocess\src\process-0.0.1.vcxproj]>
         F:\jenkins\jenkins-slave\workspace\Mesos-Windows\3rdparty\libprocess\src\socket.cpp(177): warning C4018: '>': signed/unsigned mismatch [<https://builds.apache.org/job/Mesos-Windows/ws/build\3rdparty\libprocess\src\process-0.0.1.vcxproj]>
         F:\jenkins\jenkins-slave\workspace\Mesos-Windows\3rdparty\stout\include\stout/numify.hpp(53): warning C4146: unary minus operator applied to unsigned type, result still unsigned (compiling source file F:\jenkins\jenkins-slave\workspace\Mesos-Windows\3rdparty\libprocess\src\socket.cpp) [<https://builds.apache.org/job/Mesos-Windows/ws/build\3rdparty\libprocess\src\process-0.0.1.vcxproj]>
         f:\jenkins\jenkins-slave\workspace\mesos-windows\3rdparty\libprocess\src\socket.cpp(102): warning C4715: 'process::network::Socket::create': not all control paths return a value [<https://builds.apache.org/job/Mesos-Windows/ws/build\3rdparty\libprocess\src\process-0.0.1.vcxproj]>
         F:\jenkins\jenkins-slave\workspace\Mesos-Windows\3rdparty\stout\include\stout/windows.hpp(333): warning C4267: 'argument': conversion from 'size_t' to 'unsigned int', possible loss of data (compiling source file F:\jenkins\jenkins-slave\workspace\Mesos-Windows\3rdparty\libprocess\src\subprocess.cpp) [<https://builds.apache.org/job/Mesos-Windows/ws/build\3rdparty\libprocess\src\process-0.0.1.vcxproj]>
         F:\jenkins\jenkins-slave\workspace\Mesos-Windows\3rdparty\stout\include\stout/windows.hpp(335): warning C4267: 'argument': conversion from 'size_t' to 'unsigned int', possible loss of data (compiling source file F:\jenkins\jenkins-slave\workspace\Mesos-Windows\3rdparty\libprocess\src\subprocess.cpp) [<https://builds.apache.org/job/Mesos-Windows/ws/build\3rdparty\libprocess\src\process-0.0.1.vcxproj]>
         F:\jenkins\jenkins-slave\workspace\Mesos-Windows\3rdparty\stout\include\stout/duration.hpp(99): warning C4244: '=': conversion from 'double' to 'long', possible loss of data (compiling source file F:\jenkins\jenkins-slave\workspace\Mesos-Windows\3rdparty\libprocess\src\subprocess.cpp) [<https://builds.apache.org/job/Mesos-Windows/ws/build\3rdparty\libprocess\src\process-0.0.1.vcxproj]>
         F:\jenkins\jenkins-slave\workspace\Mesos-Windows\3rdparty\stout\include\stout/duration.hpp(100): warning C4244: '=': conversion from 'double' to 'long', possible loss of data (compiling source file F:\jenkins\jenkins-slave\workspace\Mesos-Windows\3rdparty\libprocess\src\subprocess.cpp) [<https://builds.apache.org/job/Mesos-Windows/ws/build\3rdparty\libprocess\src\process-0.0.1.vcxproj]>
         F:\jenkins\jenkins-slave\workspace\Mesos-Windows\3rdparty\stout\include\stout/bytes.hpp(107): warning C4244: '*=': conversion from 'double' to 'uint64_t', possible loss of data (compiling source file F:\jenkins\jenkins-slave\workspace\Mesos-Windows\3rdparty\libprocess\src\subprocess.cpp) [<https://builds.apache.org/job/Mesos-Windows/ws/build\3rdparty\libprocess\src\process-0.0.1.vcxproj]>
         F:\jenkins\jenkins-slave\workspace\Mesos-Windows\3rdparty\stout\include\stout/bytes.hpp(118): warning C4244: '/=': conversion from 'double' to 'uint64_t', possible loss of data (compiling source file F:\jenkins\jenkins-slave\workspace\Mesos-Windows\3rdparty\libprocess\src\subprocess.cpp) [<https://builds.apache.org/job/Mesos-Windows/ws/build\3rdparty\libprocess\src\process-0.0.1.vcxproj]>
         F:\jenkins\jenkins-slave\workspace\Mesos-Windows\3rdparty\stout\include\stout/os/socket.hpp(34): warning C4244: '=': conversion from 'SOCKET' to 'int', possible loss of data (compiling source file F:\jenkins\jenkins-slave\workspace\Mesos-Windows\3rdparty\libprocess\src\subprocess.cpp) [<https://builds.apache.org/job/Mesos-Windows/ws/build\3rdparty\libprocess\src\process-0.0.1.vcxproj]>
         F:\jenkins\jenkins-slave\workspace\Mesos-Windows\3rdparty\stout\include\stout/os/windows/close.hpp(51): warning C4800: 'BOOL': forcing value to bool 'true' or 'false' (performance warning) (compiling source file F:\jenkins\jenkins-slave\workspace\Mesos-Windows\3rdparty\libprocess\src\subprocess.cpp) [<https://builds.apache.org/job/Mesos-Windows/ws/build\3rdparty\libprocess\src\process-0.0.1.vcxproj]>
         F:\jenkins\jenkins-slave\workspace\Mesos-Windows\3rdparty\stout\include\stout/os/windows/read.hpp(33): warning C4267: 'argument': conversion from 'size_t' to 'int', possible loss of data (compiling source file F:\jenkins\jenkins-slave\workspace\Mesos-Windows\3rdparty\libprocess\src\subprocess.cpp) [<https://builds.apache.org/job/Mesos-Windows/ws/build\3rdparty\libprocess\src\process-0.0.1.vcxproj]>
         F:\jenkins\jenkins-slave\workspace\Mesos-Windows\3rdparty\stout\include\stout/os/windows/read.hpp(36): warning C4267: 'argument': conversion from 'size_t' to 'unsigned int', possible loss of data (compiling source file F:\jenkins\jenkins-slave\workspace\Mesos-Windows\3rdparty\libprocess\src\subprocess.cpp) [<https://builds.apache.org/job/Mesos-Windows/ws/build\3rdparty\libprocess\src\process-0.0.1.vcxproj]>
         F:\jenkins\jenkins-slave\workspace\Mesos-Windows\3rdparty\stout\include\stout/flags/flags.hpp(869): warning C4267: '=': conversion from 'size_t' to 'int', possible loss of data (compiling source file F:\jenkins\jenkins-slave\workspace\Mesos-Windows\3rdparty\libprocess\src\subprocess.cpp) [<https://builds.apache.org/job/Mesos-Windows/ws/build\3rdparty\libprocess\src\process-0.0.1.vcxproj]>
         F:\jenkins\jenkins-slave\workspace\Mesos-Windows\3rdparty\stout\include\stout/os/windows/shell.hpp(103): warning C4244: 'return': conversion from 'intptr_t' to 'int', possible loss of data (compiling source file F:\jenkins\jenkins-slave\workspace\Mesos-Windows\3rdparty\libprocess\src\subprocess.cpp) [<https://builds.apache.org/job/Mesos-Windows/ws/build\3rdparty\libprocess\src\process-0.0.1.vcxproj]>
         F:\jenkins\jenkins-slave\workspace\Mesos-Windows\3rdparty\stout\include\stout/os/windows/shell.hpp(124): warning C4244: 'argument': conversion from 'intptr_t' to 'int', possible loss of data (compiling source file F:\jenkins\jenkins-slave\workspace\Mesos-Windows\3rdparty\libprocess\src\subprocess.cpp) [<https://builds.apache.org/job/Mesos-Windows/ws/build\3rdparty\libprocess\src\process-0.0.1.vcxproj]>
         F:\jenkins\jenkins-slave\workspace\Mesos-Windows\3rdparty\stout\include\stout/internal/windows/dirent.hpp(197): warning C4267: '=': conversion from 'size_t' to 'unsigned short', possible loss of data (compiling source file F:\jenkins\jenkins-slave\workspace\Mesos-Windows\3rdparty\libprocess\src\subprocess.cpp) [<https://builds.apache.org/job/Mesos-Windows/ws/build\3rdparty\libprocess\src\process-0.0.1.vcxproj]>
         F:\jenkins\jenkins-slave\workspace\Mesos-Windows\3rdparty\stout\include\stout/internal/windows/dirent.hpp(217): warning C4267: '=': conversion from 'size_t' to 'unsigned short', possible loss of data (compiling source file F:\jenkins\jenkins-slave\workspace\Mesos-Windows\3rdparty\libprocess\src\subprocess.cpp) [<https://builds.apache.org/job/Mesos-Windows/ws/build\3rdparty\libprocess\src\process-0.0.1.vcxproj]>
         F:\jenkins\jenkins-slave\workspace\Mesos-Windows\3rdparty\stout\include\stout/windows/os.hpp(48): warning C4996: 'GetVersionExA': was declared deprecated (compiling source file F:\jenkins\jenkins-slave\workspace\Mesos-Windows\3rdparty\libprocess\src\subprocess.cpp) [<https://builds.apache.org/job/Mesos-Windows/ws/build\3rdparty\libprocess\src\process-0.0.1.vcxproj]>
         F:\jenkins\jenkins-slave\workspace\Mesos-Windows\3rdparty\stout\include\stout/windows/os.hpp(155): warning C4267: 'argument': conversion from 'size_t' to 'DWORD', possible loss of data (compiling source file F:\jenkins\jenkins-slave\workspace\Mesos-Windows\3rdparty\libprocess\src\subprocess.cpp) [<https://builds.apache.org/job/Mesos-Windows/ws/build\3rdparty\libprocess\src\process-0.0.1.vcxproj]>
         F:\jenkins\jenkins-slave\workspace\Mesos-Windows\3rdparty\stout\include\stout/windows/os.hpp(458): warning C4996: 'GetVersionExA': was declared deprecated (compiling source file F:\jenkins\jenkins-slave\workspace\Mesos-Windows\3rdparty\libprocess\src\subprocess.cpp) [<https://builds.apache.org/job/Mesos-Windows/ws/build\3rdparty\libprocess\src\process-0.0.1.vcxproj]>
         F:\jenkins\jenkins-slave\workspace\Mesos-Windows\3rdparty\stout\include\stout/windows.hpp(333): warning C4267: 'argument': conversion from 'size_t' to 'unsigned int', possible loss of data (compiling source file F:\jenkins\jenkins-slave\workspace\Mesos-Windows\3rdparty\libprocess\src\time.cpp) [<https://builds.apache.org/job/Mesos-Windows/ws/build\3rdparty\libprocess\src\process-0.0.1.vcxproj]>
         F:\jenkins\jenkins-slave\workspace\Mesos-Windows\3rdparty\stout\include\stout/windows.hpp(335): warning C4267: 'argument': conversion from 'size_t' to 'unsigned int', possible loss of data (compiling source file F:\jenkins\jenkins-slave\workspace\Mesos-Windows\3rdparty\libprocess\src\time.cpp) [<https://builds.apache.org/job/Mesos-Windows/ws/build\3rdparty\libprocess\src\process-0.0.1.vcxproj]>
         F:\jenkins\jenkins-slave\workspace\Mesos-Windows\3rdparty\stout\include\stout/windows.hpp(333): warning C4267: 'argument': conversion from 'size_t' to 'unsigned int', possible loss of data (compiling source file F:\jenkins\jenkins-slave\workspace\Mesos-Windows\3rdparty\libprocess\src\timeseries.cpp) [<https://builds.apache.org/job/Mesos-Windows/ws/build\3rdparty\libprocess\src\process-0.0.1.vcxproj]>
         F:\jenkins\jenkins-slave\workspace\Mesos-Windows\3rdparty\stout\include\stout/windows.hpp(335): warning C4267: 'argument': conversion from 'size_t' to 'unsigned int', possible loss of data (compiling source file F:\jenkins\jenkins-slave\workspace\Mesos-Windows\3rdparty\libprocess\src\timeseries.cpp) [<https://builds.apache.org/job/Mesos-Windows/ws/build\3rdparty\libprocess\src\process-0.0.1.vcxproj]>
         F:\jenkins\jenkins-slave\workspace\Mesos-Windows\3rdparty\stout\include\stout/duration.hpp(99): warning C4244: '=': conversion from 'double' to 'long', possible loss of data (compiling source file F:\jenkins\jenkins-slave\workspace\Mesos-Windows\3rdparty\libprocess\src\time.cpp) [<https://builds.apache.org/job/Mesos-Windows/ws/build\3rdparty\libprocess\src\process-0.0.1.vcxproj]>
         F:\jenkins\jenkins-slave\workspace\Mesos-Windows\3rdparty\stout\include\stout/duration.hpp(100): warning C4244: '=': conversion from 'double' to 'long', possible loss of data (compiling source file F:\jenkins\jenkins-slave\workspace\Mesos-Windows\3rdparty\libprocess\src\time.cpp) [<https://builds.apache.org/job/Mesos-Windows/ws/build\3rdparty\libprocess\src\process-0.0.1.vcxproj]>
         F:\jenkins\jenkins-slave\workspace\Mesos-Windows\3rdparty\stout\include\stout/bytes.hpp(107): warning C4244: '*=': conversion from 'double' to 'uint64_t', possible loss of data (compiling source file F:\jenkins\jenkins-slave\workspace\Mesos-Windows\3rdparty\libprocess\src\time.cpp) [<https://builds.apache.org/job/Mesos-Windows/ws/build\3rdparty\libprocess\src\process-0.0.1.vcxproj]>
         F:\jenkins\jenkins-slave\workspace\Mesos-Windows\3rdparty\stout\include\stout/bytes.hpp(118): warning C4244: '/=': conversion from 'double' to 'uint64_t', possible loss of data (compiling source file F:\jenkins\jenkins-slave\workspace\Mesos-Windows\3rdparty\libprocess\src\time.cpp) [<https://builds.apache.org/job/Mesos-Windows/ws/build\3rdparty\libprocess\src\process-0.0.1.vcxproj]>
         F:\jenkins\jenkins-slave\workspace\Mesos-Windows\3rdparty\stout\include\stout/os/socket.hpp(34): warning C4244: '=': conversion from 'SOCKET' to 'int', possible loss of data (compiling source file F:\jenkins\jenkins-slave\workspace\Mesos-Windows\3rdparty\libprocess\src\time.cpp) [<https://builds.apache.org/job/Mesos-Windows/ws/build\3rdparty\libprocess\src\process-0.0.1.vcxproj]>
         F:\jenkins\jenkins-slave\workspace\Mesos-Windows\3rdparty\stout\include\stout/internal/windows/dirent.hpp(197): warning C4267: '=': conversion from 'size_t' to 'unsigned short', possible loss of data (compiling source file F:\jenkins\jenkins-slave\workspace\Mesos-Windows\3rdparty\libprocess\src\time.cpp) [<https://builds.apache.org/job/Mesos-Windows/ws/build\3rdparty\libprocess\src\process-0.0.1.vcxproj]>
         F:\jenkins\jenkins-slave\workspace\Mesos-Windows\3rdparty\stout\include\stout/internal/windows/dirent.hpp(217): warning C4267: '=': conversion from 'size_t' to 'unsigned short', possible loss of data (compiling source file F:\jenkins\jenkins-slave\workspace\Mesos-Windows\3rdparty\libprocess\src\time.cpp) [<https://builds.apache.org/job/Mesos-Windows/ws/build\3rdparty\libprocess\src\process-0.0.1.vcxproj]>
         F:\jenkins\jenkins-slave\workspace\Mesos-Windows\3rdparty\stout\include\stout/duration.hpp(99): warning C4244: '=': conversion from 'double' to 'long', possible loss of data (compiling source file F:\jenkins\jenkins-slave\workspace\Mesos-Windows\3rdparty\libprocess\src\timeseries.cpp) [<https://builds.apache.org/job/Mesos-Windows/ws/build\3rdparty\libprocess\src\process-0.0.1.vcxproj]>
         F:\jenkins\jenkins-slave\workspace\Mesos-Windows\3rdparty\stout\include\stout/duration.hpp(100): warning C4244: '=': conversion from 'double' to 'long', possible loss of data (compiling source file F:\jenkins\jenkins-slave\workspace\Mesos-Windows\3rdparty\libprocess\src\timeseries.cpp) [<https://builds.apache.org/job/Mesos-Windows/ws/build\3rdparty\libprocess\src\process-0.0.1.vcxproj]>
         F:\jenkins\jenkins-slave\workspace\Mesos-Windows\3rdparty\stout\include\stout/os/windows/close.hpp(51): warning C4800: 'BOOL': forcing value to bool 'true' or 'false' (performance warning) (compiling source file F:\jenkins\jenkins-slave\workspace\Mesos-Windows\3rdparty\libprocess\src\time.cpp) [<https://builds.apache.org/job/Mesos-Windows/ws/build\3rdparty\libprocess\src\process-0.0.1.vcxproj]>
         F:\jenkins\jenkins-slave\workspace\Mesos-Windows\3rdparty\stout\include\stout/os/windows/shell.hpp(103): warning C4244: 'return': conversion from 'intptr_t' to 'int', possible loss of data (compiling source file F:\jenkins\jenkins-slave\workspace\Mesos-Windows\3rdparty\libprocess\src\time.cpp) [<https://builds.apache.org/job/Mesos-Windows/ws/build\3rdparty\libprocess\src\process-0.0.1.vcxproj]>
         F:\jenkins\jenkins-slave\workspace\Mesos-Windows\3rdparty\stout\include\stout/os/windows/shell.hpp(124): warning C4244: 'argument': conversion from 'intptr_t' to 'int', possible loss of data (compiling source file F:\jenkins\jenkins-slave\workspace\Mesos-Windows\3rdparty\libprocess\src\time.cpp) [<https://builds.apache.org/job/Mesos-Windows/ws/build\3rdparty\libprocess\src\process-0.0.1.vcxproj]>
         F:\jenkins\jenkins-slave\workspace\Mesos-Windows\3rdparty\stout\include\stout/os/windows/read.hpp(33): warning C4267: 'argument': conversion from 'size_t' to 'int', possible loss of data (compiling source file F:\jenkins\jenkins-slave\workspace\Mesos-Windows\3rdparty\libprocess\src\time.cpp) [<https://builds.apache.org/job/Mesos-Windows/ws/build\3rdparty\libprocess\src\process-0.0.1.vcxproj]>
         F:\jenkins\jenkins-slave\workspace\Mesos-Windows\3rdparty\stout\include\stout/os/windows/read.hpp(36): warning C4267: 'argument': conversion from 'size_t' to 'unsigned int', possible loss of data (compiling source file F:\jenkins\jenkins-slave\workspace\Mesos-Windows\3rdparty\libprocess\src\time.cpp) [<https://builds.apache.org/job/Mesos-Windows/ws/build\3rdparty\libprocess\src\process-0.0.1.vcxproj]>
         F:\jenkins\jenkins-slave\workspace\Mesos-Windows\3rdparty\stout\include\stout/windows/os.hpp(48): warning C4996: 'GetVersionExA': was declared deprecated (compiling source file F:\jenkins\jenkins-slave\workspace\Mesos-Windows\3rdparty\libprocess\src\time.cpp) [<https://builds.apache.org/job/Mesos-Windows/ws/build\3rdparty\libprocess\src\process-0.0.1.vcxproj]>
         F:\jenkins\jenkins-slave\workspace\Mesos-Windows\3rdparty\stout\include\stout/windows/os.hpp(155): warning C4267: 'argument': conversion from 'size_t' to 'DWORD', possible loss of data (compiling source file F:\jenkins\jenkins-slave\workspace\Mesos-Windows\3rdparty\libprocess\src\time.cpp) [<https://builds.apache.org/job/Mesos-Windows/ws/build\3rdparty\libprocess\src\process-0.0.1.vcxproj]>
         F:\jenkins\jenkins-slave\workspace\Mesos-Windows\3rdparty\stout\include\stout/windows/os.hpp(458): warning C4996: 'GetVersionExA': was declared deprecated (compiling source file F:\jenkins\jenkins-slave\workspace\Mesos-Windows\3rdparty\libprocess\src\time.cpp) [<https://builds.apache.org/job/Mesos-Windows/ws/build\3rdparty\libprocess\src\process-0.0.1.vcxproj]>
         f:\jenkins\jenkins-slave\workspace\mesos-windows\3rdparty\stout\include\stout\numify.hpp(53): warning C4146: unary minus operator applied to unsigned type, result still unsigned (compiling source file F:\jenkins\jenkins-slave\workspace\Mesos-Windows\3rdparty\libprocess\src\time.cpp) [<https://builds.apache.org/job/Mesos-Windows/ws/build\3rdparty\libprocess\src\process-0.0.1.vcxproj]>
         F:\jenkins\jenkins-slave\workspace\Mesos-Windows\3rdparty\stout\include\stout/windows.hpp(333): warning C4267: 'argument': conversion from 'size_t' to 'unsigned int', possible loss of data (compiling source file F:\jenkins\jenkins-slave\workspace\Mesos-Windows\3rdparty\libprocess\src\libevent.cpp) [<https://builds.apache.org/job/Mesos-Windows/ws/build\3rdparty\libprocess\src\process-0.0.1.vcxproj]>
         F:\jenkins\jenkins-slave\workspace\Mesos-Windows\3rdparty\stout\include\stout/windows.hpp(335): warning C4267: 'argument': conversion from 'size_t' to 'unsigned int', possible loss of data (compiling source file F:\jenkins\jenkins-slave\workspace\Mesos-Windows\3rdparty\libprocess\src\libevent.cpp) [<https://builds.apache.org/job/Mesos-Windows/ws/build\3rdparty\libprocess\src\process-0.0.1.vcxproj]>
         F:\jenkins\jenkins-slave\workspace\Mesos-Windows\3rdparty\stout\include\stout/duration.hpp(99): warning C4244: '=': conversion from 'double' to 'long', possible loss of data (compiling source file F:\jenkins\jenkins-slave\workspace\Mesos-Windows\3rdparty\libprocess\src\libevent.cpp) [<https://builds.apache.org/job/Mesos-Windows/ws/build\3rdparty\libprocess\src\process-0.0.1.vcxproj]>
         F:\jenkins\jenkins-slave\workspace\Mesos-Windows\3rdparty\stout\include\stout/duration.hpp(100): warning C4244: '=': conversion from 'double' to 'long', possible loss of data (compiling source file F:\jenkins\jenkins-slave\workspace\Mesos-Windows\3rdparty\libprocess\src\libevent.cpp) [<https://builds.apache.org/job/Mesos-Windows/ws/build\3rdparty\libprocess\src\process-0.0.1.vcxproj]>
         F:\jenkins\jenkins-slave\workspace\Mesos-Windows\3rdparty\stout\include\stout/bytes.hpp(107): warning C4244: '*=': conversion from 'double' to 'uint64_t', possible loss of data (compiling source file F:\jenkins\jenkins-slave\workspace\Mesos-Windows\3rdparty\libprocess\src\libevent.cpp) [<https://builds.apache.org/job/Mesos-Windows/ws/build\3rdparty\libprocess\src\process-0.0.1.vcxproj]>
         F:\jenkins\jenkins-slave\workspace\Mesos-Windows\3rdparty\stout\include\stout/bytes.hpp(118): warning C4244: '/=': conversion from 'double' to 'uint64_t', possible loss of data (compiling source file F:\jenkins\jenkins-slave\workspace\Mesos-Windows\3rdparty\libprocess\src\libevent.cpp) [<https://builds.apache.org/job/Mesos-Windows/ws/build\3rdparty\libprocess\src\process-0.0.1.vcxproj]>
         F:\jenkins\jenkins-slave\workspace\Mesos-Windows\3rdparty\stout\include\stout/os/socket.hpp(34): warning C4244: '=': conversion from 'SOCKET' to 'int', possible loss of data (compiling source file F:\jenkins\jenkins-slave\workspace\Mesos-Windows\3rdparty\libprocess\src\libevent.cpp) [<https://builds.apache.org/job/Mesos-Windows/ws/build\3rdparty\libprocess\src\process-0.0.1.vcxproj]>
         F:\jenkins\jenkins-slave\workspace\Mesos-Windows\3rdparty\stout\include\stout/os/windows/close.hpp(51): warning C4800: 'BOOL': forcing value to bool 'true' or 'false' (performance warning) (compiling source file F:\jenkins\jenkins-slave\workspace\Mesos-Windows\3rdparty\libprocess\src\libevent.cpp) [<https://builds.apache.org/job/Mesos-Windows/ws/build\3rdparty\libprocess\src\process-0.0.1.vcxproj]>
         F:\jenkins\jenkins-slave\workspace\Mesos-Windows\3rdparty\stout\include\stout/windows.hpp(333): warning C4267: 'argument': conversion from 'size_t' to 'unsigned int', possible loss of data (compiling source file F:\jenkins\jenkins-slave\workspace\Mesos-Windows\3rdparty\libprocess\src\libevent_poll.cpp) [<https://builds.apache.org/job/Mesos-Windows/ws/build\3rdparty\libprocess\src\process-0.0.1.vcxproj]>
         F:\jenkins\jenkins-slave\workspace\Mesos-Windows\3rdparty\stout\include\stout/windows.hpp(335): warning C4267: 'argument': conversion from 'size_t' to 'unsigned int', possible loss of data (compiling source file F:\jenkins\jenkins-slave\workspace\Mesos-Windows\3rdparty\libprocess\src\libevent_poll.cpp) [<https://builds.apache.org/job/Mesos-Windows/ws/build\3rdparty\libprocess\src\process-0.0.1.vcxproj]>
         F:\jenkins\jenkins-slave\workspace\Mesos-Windows\3rdparty\stout\include\stout/duration.hpp(99): warning C4244: '=': conversion from 'double' to 'long', possible loss of data (compiling source file F:\jenkins\jenkins-slave\workspace\Mesos-Windows\3rdparty\libprocess\src\libevent_poll.cpp) [<https://builds.apache.org/job/Mesos-Windows/ws/build\3rdparty\libprocess\src\process-0.0.1.vcxproj]>
         F:\jenkins\jenkins-slave\workspace\Mesos-Windows\3rdparty\stout\include\stout/duration.hpp(100): warning C4244: '=': conversion from 'double' to 'long', possible loss of data (compiling source file F:\jenkins\jenkins-slave\workspace\Mesos-Windows\3rdparty\libprocess\src\libevent_poll.cpp) [<https://builds.apache.org/job/Mesos-Windows/ws/build\3rdparty\libprocess\src\process-0.0.1.vcxproj]>
         F:\jenkins\jenkins-slave\workspace\Mesos-Windows\3rdparty\stout\include\stout/bytes.hpp(107): warning C4244: '*=': conversion from 'double' to 'uint64_t', possible loss of data (compiling source file F:\jenkins\jenkins-slave\workspace\Mesos-Windows\3rdparty\libprocess\src\libevent_poll.cpp) [<https://builds.apache.org/job/Mesos-Windows/ws/build\3rdparty\libprocess\src\process-0.0.1.vcxproj]>
         F:\jenkins\jenkins-slave\workspace\Mesos-Windows\3rdparty\stout\include\stout/bytes.hpp(118): warning C4244: '/=': conversion from 'double' to 'uint64_t', possible loss of data (compiling source file F:\jenkins\jenkins-slave\workspace\Mesos-Windows\3rdparty\libprocess\src\libevent_poll.cpp) [<https://builds.apache.org/job/Mesos-Windows/ws/build\3rdparty\libprocess\src\process-0.0.1.vcxproj]>
         F:\jenkins\jenkins-slave\workspace\Mesos-Windows\3rdparty\stout\include\stout/os/socket.hpp(34): warning C4244: '=': conversion from 'SOCKET' to 'int', possible loss of data (compiling source file F:\jenkins\jenkins-slave\workspace\Mesos-Windows\3rdparty\libprocess\src\libevent_poll.cpp) [<https://builds.apache.org/job/Mesos-Windows/ws/build\3rdparty\libprocess\src\process-0.0.1.vcxproj]>
         F:\jenkins\jenkins-slave\workspace\Mesos-Windows\3rdparty\stout\include\stout/os/windows/close.hpp(51): warning C4800: 'BOOL': forcing value to bool 'true' or 'false' (performance warning) (compiling source file F:\jenkins\jenkins-slave\workspace\Mesos-Windows\3rdparty\libprocess\src\libevent_poll.cpp) [<https://builds.apache.org/job/Mesos-Windows/ws/build\3rdparty\libprocess\src\process-0.0.1.vcxproj]>
         f:\jenkins\jenkins-slave\workspace\mesos-windows\3rdparty\stout\include\stout\numify.hpp(53): warning C4146: unary minus operator applied to unsigned type, result still unsigned (compiling source file F:\jenkins\jenkins-slave\workspace\Mesos-Windows\3rdparty\libprocess\src\libevent.cpp) [<https://builds.apache.org/job/Mesos-Windows/ws/build\3rdparty\libprocess\src\process-0.0.1.vcxproj]>
         f:\jenkins\jenkins-slave\workspace\mesos-windows\3rdparty\stout\include\stout\numify.hpp(53): warning C4146: unary minus operator applied to unsigned type, result still unsigned (compiling source file F:\jenkins\jenkins-slave\workspace\Mesos-Windows\3rdparty\libprocess\src\libevent_poll.cpp) [<https://builds.apache.org/job/Mesos-Windows/ws/build\3rdparty\libprocess\src\process-0.0.1.vcxproj]>


       "<https://builds.apache.org/job/Mesos-Windows/ws/build\Mesos.sln"> (process_tests target) (1) ->
       "<https://builds.apache.org/job/Mesos-Windows/ws/build\3rdparty\libprocess\src\tests\process_tests.vcxproj.metaproj"> (default target) (2) ->
       "<https://builds.apache.org/job/Mesos-Windows/ws/build\3rdparty\libprocess\src\process-0.0.1.vcxproj.metaproj"> (default target) (13) ->
       "<https://builds.apache.org/job/Mesos-Windows/ws/build\3rdparty\libprocess\src\process-0.0.1.vcxproj"> (default target) (28) ->
       (ClCompile target) -> 
         F:\jenkins\jenkins-slave\workspace\Mesos-Windows\3rdparty\libprocess\src\subprocess.cpp(80): error C2039: 'setsid': is not a member of '`global namespace'' [<https://builds.apache.org/job/Mesos-Windows/ws/build\3rdparty\libprocess\src\process-0.0.1.vcxproj]>
         F:\jenkins\jenkins-slave\workspace\Mesos-Windows\3rdparty\libprocess\src\subprocess.cpp(80): error C3861: 'setsid': identifier not found [<https://builds.apache.org/job/Mesos-Windows/ws/build\3rdparty\libprocess\src\process-0.0.1.vcxproj]>
         F:\jenkins\jenkins-slave\workspace\Mesos-Windows\3rdparty\libprocess\src\subprocess.cpp(93): error C3861: 'kill': identifier not found [<https://builds.apache.org/job/Mesos-Windows/ws/build\3rdparty\libprocess\src\process-0.0.1.vcxproj]>

    386 Warning(s)
    3 Error(s)

Time Elapsed 00:05:07.26

<https://builds.apache.org/job/Mesos-Windows/ws/build>if> 1 NEQ 0 exit /b 1 
Build step 'Execute Windows batch command' marked build as failure

Mime
View raw message