mesos-builds mailing list archives

Site index · List index
Message view « Date » · « Thread »
Top « Date » · « Thread »
From Apache Jenkins Server <jenk...@builds.apache.org>
Subject Build failed in Jenkins: Mesos-Windows #581
Date Sun, 25 Sep 2016 04:19:58 GMT
See <https://builds.apache.org/job/Mesos-Windows/581/changes>

Changes:

[yujie.jay] Updated mesos containerizer to checkpoint container runtime information.

------------------------------------------
[...truncated 3032 lines...]
    22>F:\jenkins\jenkins-slave\workspace\Mesos-Windows\3rdparty\stout\include\stout/bytes.hpp(118): warning C4244: '/=': conversion from 'double' to 'uint64_t', possible loss of data (compiling source file F:\jenkins\jenkins-slave\workspace\Mesos-Windows\3rdparty\stout\tests\os\rmdir_tests.cpp) [<https://builds.apache.org/job/Mesos-Windows/ws/build\3rdparty\stout\tests\stout_tests.vcxproj]>
    22>F:\jenkins\jenkins-slave\workspace\Mesos-Windows\3rdparty\stout\include\stout/os/socket.hpp(34): warning C4244: '=': conversion from 'SOCKET' to 'int', possible loss of data (compiling source file F:\jenkins\jenkins-slave\workspace\Mesos-Windows\3rdparty\stout\tests\os\socket_tests.cpp) [<https://builds.apache.org/job/Mesos-Windows/ws/build\3rdparty\stout\tests\stout_tests.vcxproj]>
    22>F:\jenkins\jenkins-slave\workspace\Mesos-Windows\3rdparty\stout\include\stout/windows/fs.hpp(72): warning C4244: 'initializing': conversion from 'ULONGLONG' to 'double', possible loss of data (compiling source file F:\jenkins\jenkins-slave\workspace\Mesos-Windows\3rdparty\stout\tests\os\rmdir_tests.cpp) [<https://builds.apache.org/job/Mesos-Windows/ws/build\3rdparty\stout\tests\stout_tests.vcxproj]>
    22>F:\jenkins\jenkins-slave\workspace\Mesos-Windows\3rdparty\stout\include\stout/duration.hpp(99): warning C4244: '=': conversion from 'double' to 'long', possible loss of data (compiling source file F:\jenkins\jenkins-slave\workspace\Mesos-Windows\3rdparty\stout\tests\os\rmdir_tests.cpp) [<https://builds.apache.org/job/Mesos-Windows/ws/build\3rdparty\stout\tests\stout_tests.vcxproj]>
    22>F:\jenkins\jenkins-slave\workspace\Mesos-Windows\3rdparty\stout\include\stout/duration.hpp(100): warning C4244: '=': conversion from 'double' to 'long', possible loss of data (compiling source file F:\jenkins\jenkins-slave\workspace\Mesos-Windows\3rdparty\stout\tests\os\rmdir_tests.cpp) [<https://builds.apache.org/job/Mesos-Windows/ws/build\3rdparty\stout\tests\stout_tests.vcxproj]>
    22>F:\jenkins\jenkins-slave\workspace\Mesos-Windows\3rdparty\stout\include\stout/os/getcwd.hpp(31): warning C4267: 'argument': conversion from 'size_t' to 'int', possible loss of data (compiling source file F:\jenkins\jenkins-slave\workspace\Mesos-Windows\3rdparty\stout\tests\os\socket_tests.cpp) [<https://builds.apache.org/job/Mesos-Windows/ws/build\3rdparty\stout\tests\stout_tests.vcxproj]>
    22>F:\jenkins\jenkins-slave\workspace\Mesos-Windows\3rdparty\stout\include\stout/os/socket.hpp(34): warning C4244: '=': conversion from 'SOCKET' to 'int', possible loss of data (compiling source file F:\jenkins\jenkins-slave\workspace\Mesos-Windows\3rdparty\stout\tests\os\rmdir_tests.cpp) [<https://builds.apache.org/job/Mesos-Windows/ws/build\3rdparty\stout\tests\stout_tests.vcxproj]>
    22>F:\jenkins\jenkins-slave\workspace\Mesos-Windows\3rdparty\stout\include\stout/os/windows/kill.hpp(16): fatal error C1083: Cannot open include file: 'logging/logging.hpp': No such file or directory (compiling source file F:\jenkins\jenkins-slave\workspace\Mesos-Windows\3rdparty\stout\tests\os\rmdir_tests.cpp) [<https://builds.apache.org/job/Mesos-Windows/ws/build\3rdparty\stout\tests\stout_tests.vcxproj]>
         strerror_tests.cpp
         Unknown compiler version - please run the configure tests and report the results
    22>F:\jenkins\jenkins-slave\workspace\Mesos-Windows\3rdparty\stout\include\stout/bytes.hpp(107): warning C4244: '*=': conversion from 'double' to 'uint64_t', possible loss of data (compiling source file F:\jenkins\jenkins-slave\workspace\Mesos-Windows\3rdparty\stout\tests\os\socket_tests.cpp) [<https://builds.apache.org/job/Mesos-Windows/ws/build\3rdparty\stout\tests\stout_tests.vcxproj]>
    22>F:\jenkins\jenkins-slave\workspace\Mesos-Windows\3rdparty\stout\include\stout/bytes.hpp(118): warning C4244: '/=': conversion from 'double' to 'uint64_t', possible loss of data (compiling source file F:\jenkins\jenkins-slave\workspace\Mesos-Windows\3rdparty\stout\tests\os\socket_tests.cpp) [<https://builds.apache.org/job/Mesos-Windows/ws/build\3rdparty\stout\tests\stout_tests.vcxproj]>
         Unknown compiler version - please run the configure tests and report the results
    22>F:\jenkins\jenkins-slave\workspace\Mesos-Windows\3rdparty\stout\include\stout/numify.hpp(53): warning C4146: unary minus operator applied to unsigned type, result still unsigned (compiling source file F:\jenkins\jenkins-slave\workspace\Mesos-Windows\3rdparty\stout\tests\os\socket_tests.cpp) [<https://builds.apache.org/job/Mesos-Windows/ws/build\3rdparty\stout\tests\stout_tests.vcxproj]>
         F:\jenkins\jenkins-slave\workspace\Mesos-Windows\3rdparty\stout\include\stout/bytes.hpp(45): note: see reference to function template instantiation 'Try<uint64_t,Error> numify<uint64_t>(const std::string &)' being compiled (compiling source file F:\jenkins\jenkins-slave\workspace\Mesos-Windows\3rdparty\stout\tests\os\socket_tests.cpp)
    22>F:\jenkins\jenkins-slave\workspace\Mesos-Windows\3rdparty\stout\include\stout/bytes.hpp(107): warning C4244: '*=': conversion from 'double' to 'uint64_t', possible loss of data (compiling source file F:\jenkins\jenkins-slave\workspace\Mesos-Windows\3rdparty\stout\tests\os\strerror_tests.cpp) [<https://builds.apache.org/job/Mesos-Windows/ws/build\3rdparty\stout\tests\stout_tests.vcxproj]>
    22>F:\jenkins\jenkins-slave\workspace\Mesos-Windows\3rdparty\stout\include\stout/bytes.hpp(118): warning C4244: '/=': conversion from 'double' to 'uint64_t', possible loss of data (compiling source file F:\jenkins\jenkins-slave\workspace\Mesos-Windows\3rdparty\stout\tests\os\strerror_tests.cpp) [<https://builds.apache.org/job/Mesos-Windows/ws/build\3rdparty\stout\tests\stout_tests.vcxproj]>
    22>F:\jenkins\jenkins-slave\workspace\Mesos-Windows\3rdparty\stout\include\stout/duration.hpp(99): warning C4244: '=': conversion from 'double' to 'long', possible loss of data (compiling source file F:\jenkins\jenkins-slave\workspace\Mesos-Windows\3rdparty\stout\tests\os\strerror_tests.cpp) [<https://builds.apache.org/job/Mesos-Windows/ws/build\3rdparty\stout\tests\stout_tests.vcxproj]>
    22>F:\jenkins\jenkins-slave\workspace\Mesos-Windows\3rdparty\stout\include\stout/duration.hpp(100): warning C4244: '=': conversion from 'double' to 'long', possible loss of data (compiling source file F:\jenkins\jenkins-slave\workspace\Mesos-Windows\3rdparty\stout\tests\os\strerror_tests.cpp) [<https://builds.apache.org/job/Mesos-Windows/ws/build\3rdparty\stout\tests\stout_tests.vcxproj]>
    22>F:\jenkins\jenkins-slave\workspace\Mesos-Windows\3rdparty\stout\include\stout/os/socket.hpp(34): warning C4244: '=': conversion from 'SOCKET' to 'int', possible loss of data (compiling source file F:\jenkins\jenkins-slave\workspace\Mesos-Windows\3rdparty\stout\tests\os\strerror_tests.cpp) [<https://builds.apache.org/job/Mesos-Windows/ws/build\3rdparty\stout\tests\stout_tests.vcxproj]>
    22>F:\jenkins\jenkins-slave\workspace\Mesos-Windows\3rdparty\stout\include\stout/os/windows/kill.hpp(16): fatal error C1083: Cannot open include file: 'logging/logging.hpp': No such file or directory (compiling source file F:\jenkins\jenkins-slave\workspace\Mesos-Windows\3rdparty\stout\tests\os\strerror_tests.cpp) [<https://builds.apache.org/job/Mesos-Windows/ws/build\3rdparty\stout\tests\stout_tests.vcxproj]>
         systems_tests.cpp
         result_tests.cpp
         Unknown compiler version - please run the configure tests and report the results
    22>F:\jenkins\jenkins-slave\workspace\Mesos-Windows\3rdparty\stout\include\stout/bytes.hpp(107): warning C4244: '*=': conversion from 'double' to 'uint64_t', possible loss of data (compiling source file F:\jenkins\jenkins-slave\workspace\Mesos-Windows\3rdparty\stout\tests\os\systems_tests.cpp) [<https://builds.apache.org/job/Mesos-Windows/ws/build\3rdparty\stout\tests\stout_tests.vcxproj]>
    22>F:\jenkins\jenkins-slave\workspace\Mesos-Windows\3rdparty\stout\include\stout/bytes.hpp(118): warning C4244: '/=': conversion from 'double' to 'uint64_t', possible loss of data (compiling source file F:\jenkins\jenkins-slave\workspace\Mesos-Windows\3rdparty\stout\tests\os\systems_tests.cpp) [<https://builds.apache.org/job/Mesos-Windows/ws/build\3rdparty\stout\tests\stout_tests.vcxproj]>
    22>F:\jenkins\jenkins-slave\workspace\Mesos-Windows\3rdparty\stout\include\stout/duration.hpp(99): warning C4244: '=': conversion from 'double' to 'long', possible loss of data (compiling source file F:\jenkins\jenkins-slave\workspace\Mesos-Windows\3rdparty\stout\tests\os\systems_tests.cpp) [<https://builds.apache.org/job/Mesos-Windows/ws/build\3rdparty\stout\tests\stout_tests.vcxproj]>
    22>F:\jenkins\jenkins-slave\workspace\Mesos-Windows\3rdparty\stout\include\stout/duration.hpp(100): warning C4244: '=': conversion from 'double' to 'long', possible loss of data (compiling source file F:\jenkins\jenkins-slave\workspace\Mesos-Windows\3rdparty\stout\tests\os\systems_tests.cpp) [<https://builds.apache.org/job/Mesos-Windows/ws/build\3rdparty\stout\tests\stout_tests.vcxproj]>
    22>F:\jenkins\jenkins-slave\workspace\Mesos-Windows\3rdparty\stout\include\stout/os/socket.hpp(34): warning C4244: '=': conversion from 'SOCKET' to 'int', possible loss of data (compiling source file F:\jenkins\jenkins-slave\workspace\Mesos-Windows\3rdparty\stout\tests\os\systems_tests.cpp) [<https://builds.apache.org/job/Mesos-Windows/ws/build\3rdparty\stout\tests\stout_tests.vcxproj]>
    22>F:\jenkins\jenkins-slave\workspace\Mesos-Windows\3rdparty\stout\include\stout/os/windows/kill.hpp(16): fatal error C1083: Cannot open include file: 'logging/logging.hpp': No such file or directory (compiling source file F:\jenkins\jenkins-slave\workspace\Mesos-Windows\3rdparty\stout\tests\os\systems_tests.cpp) [<https://builds.apache.org/job/Mesos-Windows/ws/build\3rdparty\stout\tests\stout_tests.vcxproj]>
         some_tests.cpp
         strings_tests.cpp
         uuid_tests.cpp
         Unknown compiler version - please run the configure tests and report the results
         Unknown compiler version - please run the configure tests and report the results
         version_tests.cpp
         Unknown compiler version - please run the configure tests and report the results
    22>Done Building Project "<https://builds.apache.org/job/Mesos-Windows/ws/build\3rdparty\stout\tests\stout_tests.vcxproj"> (default targets) -- FAILED.
     2>Done Building Project "<https://builds.apache.org/job/Mesos-Windows/ws/build\3rdparty\stout\tests\stout_tests.vcxproj.metaproj"> (default targets) -- FAILED.
     1>Done Building Project "<https://builds.apache.org/job/Mesos-Windows/ws/build\Mesos.sln"> (stout_tests target(s)) -- FAILED.

Build FAILED.

       "<https://builds.apache.org/job/Mesos-Windows/ws/build\Mesos.sln"> (stout_tests target) (1) ->
       "<https://builds.apache.org/job/Mesos-Windows/ws/build\3rdparty\stout\tests\stout_tests.vcxproj.metaproj"> (default target) (2) ->
       "<https://builds.apache.org/job/Mesos-Windows/ws/build\3rdparty\glog-0.3.4.vcxproj.metaproj"> (default target) (7) ->
       "<https://builds.apache.org/job/Mesos-Windows/ws/build\3rdparty\glog-0.3.4.vcxproj"> (default target) (19) ->
       (CustomBuild target) -> 
         cmake -E tar : warning : skipping symbolic link "google-glog-4d391fe/test-driver" -> "/usr/share/automake-1.14/test-driver". [<https://builds.apache.org/job/Mesos-Windows/ws/build\3rdparty\glog-0.3.4.vcxproj]>
         F:\jenkins\jenkins-slave\workspace\Mesos-Windows\build\3rdparty\glog-0.3.4\src\glog-0.3.4\src\demangle.cc(343): warning C4267: 'initializing': conversion from 'size_t' to 'int', possible loss of data [F:\jenkins\jenkins-slave\workspace\Mesos-Windows\build\3rdparty\glog-0.3.4\src\glog-0.3.4-build\glog.vcxproj] [<https://builds.apache.org/job/Mesos-Windows/ws/build\3rdparty\glog-0.3.4.vcxproj]>
         F:\jenkins\jenkins-slave\workspace\Mesos-Windows\build\3rdparty\glog-0.3.4\src\glog-0.3.4\src\logging.cc(200): warning C4267: 'argument': conversion from 'size_t' to 'unsigned int', possible loss of data [F:\jenkins\jenkins-slave\workspace\Mesos-Windows\build\3rdparty\glog-0.3.4\src\glog-0.3.4-build\glog.vcxproj] [<https://builds.apache.org/job/Mesos-Windows/ws/build\3rdparty\glog-0.3.4.vcxproj]>
         F:\jenkins\jenkins-slave\workspace\Mesos-Windows\build\3rdparty\glog-0.3.4\src\glog-0.3.4\src\logging.cc(216): warning C4267: 'argument': conversion from 'size_t' to 'unsigned int', possible loss of data [F:\jenkins\jenkins-slave\workspace\Mesos-Windows\build\3rdparty\glog-0.3.4\src\glog-0.3.4-build\glog.vcxproj] [<https://builds.apache.org/job/Mesos-Windows/ws/build\3rdparty\glog-0.3.4.vcxproj]>
         F:\jenkins\jenkins-slave\workspace\Mesos-Windows\build\3rdparty\glog-0.3.4\src\glog-0.3.4\src\logging.cc(631): warning C4267: 'initializing': conversion from 'size_t' to 'int', possible loss of data [F:\jenkins\jenkins-slave\workspace\Mesos-Windows\build\3rdparty\glog-0.3.4\src\glog-0.3.4-build\glog.vcxproj] [<https://builds.apache.org/job/Mesos-Windows/ws/build\3rdparty\glog-0.3.4.vcxproj]>
         F:\jenkins\jenkins-slave\workspace\Mesos-Windows\build\3rdparty\glog-0.3.4\src\glog-0.3.4\src\logging.cc(764): warning C4267: 'argument': conversion from 'size_t' to 'int', possible loss of data [F:\jenkins\jenkins-slave\workspace\Mesos-Windows\build\3rdparty\glog-0.3.4\src\glog-0.3.4-build\glog.vcxproj] [<https://builds.apache.org/job/Mesos-Windows/ws/build\3rdparty\glog-0.3.4.vcxproj]>
         F:\jenkins\jenkins-slave\workspace\Mesos-Windows\build\3rdparty\glog-0.3.4\src\glog-0.3.4\src\logging.cc(789): warning C4267: 'initializing': conversion from 'size_t' to 'int', possible loss of data [F:\jenkins\jenkins-slave\workspace\Mesos-Windows\build\3rdparty\glog-0.3.4\src\glog-0.3.4-build\glog.vcxproj] [<https://builds.apache.org/job/Mesos-Windows/ws/build\3rdparty\glog-0.3.4.vcxproj]>
         F:\jenkins\jenkins-slave\workspace\Mesos-Windows\build\3rdparty\glog-0.3.4\src\glog-0.3.4\src\logging.cc(799): warning C4267: 'initializing': conversion from 'size_t' to 'int', possible loss of data [F:\jenkins\jenkins-slave\workspace\Mesos-Windows\build\3rdparty\glog-0.3.4\src\glog-0.3.4-build\glog.vcxproj] [<https://builds.apache.org/job/Mesos-Windows/ws/build\3rdparty\glog-0.3.4.vcxproj]>
         F:\jenkins\jenkins-slave\workspace\Mesos-Windows\build\3rdparty\glog-0.3.4\src\glog-0.3.4\src\logging.cc(1082): warning C4267: 'initializing': conversion from 'size_t' to 'int', possible loss of data [F:\jenkins\jenkins-slave\workspace\Mesos-Windows\build\3rdparty\glog-0.3.4\src\glog-0.3.4-build\glog.vcxproj] [<https://builds.apache.org/job/Mesos-Windows/ws/build\3rdparty\glog-0.3.4.vcxproj]>
         F:\jenkins\jenkins-slave\workspace\Mesos-Windows\build\3rdparty\glog-0.3.4\src\glog-0.3.4\src\logging.cc(1082): warning C4267: 'initializing': conversion from 'size_t' to 'const int', possible loss of data [F:\jenkins\jenkins-slave\workspace\Mesos-Windows\build\3rdparty\glog-0.3.4\src\glog-0.3.4-build\glog.vcxproj] [<https://builds.apache.org/job/Mesos-Windows/ws/build\3rdparty\glog-0.3.4.vcxproj]>
         F:\jenkins\jenkins-slave\workspace\Mesos-Windows\build\3rdparty\glog-0.3.4\src\glog-0.3.4\src\logging.cc(1343): warning C4267: 'initializing': conversion from 'size_t' to 'int', possible loss of data [F:\jenkins\jenkins-slave\workspace\Mesos-Windows\build\3rdparty\glog-0.3.4\src\glog-0.3.4-build\glog.vcxproj] [<https://builds.apache.org/job/Mesos-Windows/ws/build\3rdparty\glog-0.3.4.vcxproj]>
         F:\jenkins\jenkins-slave\workspace\Mesos-Windows\build\3rdparty\glog-0.3.4\src\glog-0.3.4\src\logging.cc(1343): warning C4267: 'initializing': conversion from 'size_t' to 'const int', possible loss of data [F:\jenkins\jenkins-slave\workspace\Mesos-Windows\build\3rdparty\glog-0.3.4\src\glog-0.3.4-build\glog.vcxproj] [<https://builds.apache.org/job/Mesos-Windows/ws/build\3rdparty\glog-0.3.4.vcxproj]>
         F:\jenkins\jenkins-slave\workspace\Mesos-Windows\build\3rdparty\glog-0.3.4\src\glog-0.3.4\src\logging.cc(1416): warning C4267: 'argument': conversion from 'size_t' to 'const int', possible loss of data [F:\jenkins\jenkins-slave\workspace\Mesos-Windows\build\3rdparty\glog-0.3.4\src\glog-0.3.4-build\glog.vcxproj] [<https://builds.apache.org/job/Mesos-Windows/ws/build\3rdparty\glog-0.3.4.vcxproj]>
         F:\jenkins\jenkins-slave\workspace\Mesos-Windows\build\3rdparty\glog-0.3.4\src\glog-0.3.4\src\logging.cc(1438): warning C4267: 'argument': conversion from 'size_t' to 'unsigned int', possible loss of data [F:\jenkins\jenkins-slave\workspace\Mesos-Windows\build\3rdparty\glog-0.3.4\src\glog-0.3.4-build\glog.vcxproj] [<https://builds.apache.org/job/Mesos-Windows/ws/build\3rdparty\glog-0.3.4.vcxproj]>
         F:\jenkins\jenkins-slave\workspace\Mesos-Windows\build\3rdparty\glog-0.3.4\src\glog-0.3.4\src\logging.cc(1516): warning C4267: 'initializing': conversion from 'size_t' to 'int', possible loss of data [F:\jenkins\jenkins-slave\workspace\Mesos-Windows\build\3rdparty\glog-0.3.4\src\glog-0.3.4-build\glog.vcxproj] [<https://builds.apache.org/job/Mesos-Windows/ws/build\3rdparty\glog-0.3.4.vcxproj]>
         F:\jenkins\jenkins-slave\workspace\Mesos-Windows\build\3rdparty\glog-0.3.4\src\glog-0.3.4\src\logging.cc(1529): warning C4267: 'initializing': conversion from 'size_t' to 'int', possible loss of data [F:\jenkins\jenkins-slave\workspace\Mesos-Windows\build\3rdparty\glog-0.3.4\src\glog-0.3.4-build\glog.vcxproj] [<https://builds.apache.org/job/Mesos-Windows/ws/build\3rdparty\glog-0.3.4.vcxproj]>
         F:\jenkins\jenkins-slave\workspace\Mesos-Windows\build\3rdparty\glog-0.3.4\src\glog-0.3.4\src\raw_logging.cc(153): warning C4267: 'argument': conversion from 'size_t' to 'unsigned int', possible loss of data [F:\jenkins\jenkins-slave\workspace\Mesos-Windows\build\3rdparty\glog-0.3.4\src\glog-0.3.4-build\glog.vcxproj] [<https://builds.apache.org/job/Mesos-Windows/ws/build\3rdparty\glog-0.3.4.vcxproj]>
         F:\jenkins\jenkins-slave\workspace\Mesos-Windows\build\3rdparty\glog-0.3.4\src\glog-0.3.4\src\vlog_is_on.cc(163): warning C4267: 'initializing': conversion from 'size_t' to 'int', possible loss of data [F:\jenkins\jenkins-slave\workspace\Mesos-Windows\build\3rdparty\glog-0.3.4\src\glog-0.3.4-build\glog.vcxproj] [<https://builds.apache.org/job/Mesos-Windows/ws/build\3rdparty\glog-0.3.4.vcxproj]>
         F:\jenkins\jenkins-slave\workspace\Mesos-Windows\build\3rdparty\glog-0.3.4\src\glog-0.3.4\src\vlog_is_on.cc(163): warning C4267: 'initializing': conversion from 'size_t' to 'const int', possible loss of data [F:\jenkins\jenkins-slave\workspace\Mesos-Windows\build\3rdparty\glog-0.3.4\src\glog-0.3.4-build\glog.vcxproj] [<https://builds.apache.org/job/Mesos-Windows/ws/build\3rdparty\glog-0.3.4.vcxproj]>
         f:\jenkins\jenkins-slave\workspace\mesos-windows\build\3rdparty\glog-0.3.4\src\glog-0.3.4\src\googletest.h(579): warning C4290: C++ exception specification ignored except to indicate a function is not __declspec(nothrow) [F:\jenkins\jenkins-slave\workspace\Mesos-Windows\build\3rdparty\glog-0.3.4\src\glog-0.3.4-build\demangle_unittest.vcxproj] [<https://builds.apache.org/job/Mesos-Windows/ws/build\3rdparty\glog-0.3.4.vcxproj]>
         f:\jenkins\jenkins-slave\workspace\mesos-windows\build\3rdparty\glog-0.3.4\src\glog-0.3.4\src\googletest.h(586): warning C4290: C++ exception specification ignored except to indicate a function is not __declspec(nothrow) [F:\jenkins\jenkins-slave\workspace\Mesos-Windows\build\3rdparty\glog-0.3.4\src\glog-0.3.4-build\demangle_unittest.vcxproj] [<https://builds.apache.org/job/Mesos-Windows/ws/build\3rdparty\glog-0.3.4.vcxproj]>
         f:\jenkins\jenkins-slave\workspace\mesos-windows\build\3rdparty\glog-0.3.4\src\glog-0.3.4\src\googletest.h(579): warning C4290: C++ exception specification ignored except to indicate a function is not __declspec(nothrow) [F:\jenkins\jenkins-slave\workspace\Mesos-Windows\build\3rdparty\glog-0.3.4\src\glog-0.3.4-build\logging_unittest.vcxproj] [<https://builds.apache.org/job/Mesos-Windows/ws/build\3rdparty\glog-0.3.4.vcxproj]>
         f:\jenkins\jenkins-slave\workspace\mesos-windows\build\3rdparty\glog-0.3.4\src\glog-0.3.4\src\googletest.h(586): warning C4290: C++ exception specification ignored except to indicate a function is not __declspec(nothrow) [F:\jenkins\jenkins-slave\workspace\Mesos-Windows\build\3rdparty\glog-0.3.4\src\glog-0.3.4-build\logging_unittest.vcxproj] [<https://builds.apache.org/job/Mesos-Windows/ws/build\3rdparty\glog-0.3.4.vcxproj]>
         F:\jenkins\jenkins-slave\workspace\Mesos-Windows\build\3rdparty\glog-0.3.4\src\glog-0.3.4\src\logging_unittest.cc(741): warning C4267: 'return': conversion from 'size_t' to 'google::uint32', possible loss of data [F:\jenkins\jenkins-slave\workspace\Mesos-Windows\build\3rdparty\glog-0.3.4\src\glog-0.3.4-build\logging_unittest.vcxproj] [<https://builds.apache.org/job/Mesos-Windows/ws/build\3rdparty\glog-0.3.4.vcxproj]>
         F:\jenkins\jenkins-slave\workspace\Mesos-Windows\build\3rdparty\glog-0.3.4\src\glog-0.3.4\src\logging_unittest.cc(798): warning C4267: 'argument': conversion from 'size_t' to 'unsigned int', possible loss of data [F:\jenkins\jenkins-slave\workspace\Mesos-Windows\build\3rdparty\glog-0.3.4\src\glog-0.3.4-build\logging_unittest.vcxproj] [<https://builds.apache.org/job/Mesos-Windows/ws/build\3rdparty\glog-0.3.4.vcxproj]>
         F:\jenkins\jenkins-slave\workspace\Mesos-Windows\build\3rdparty\glog-0.3.4\src\glog-0.3.4\src\logging_unittest.cc(963): warning C4267: 'initializing': conversion from 'size_t' to 'int', possible loss of data [F:\jenkins\jenkins-slave\workspace\Mesos-Windows\build\3rdparty\glog-0.3.4\src\glog-0.3.4-build\logging_unittest.vcxproj] [<https://builds.apache.org/job/Mesos-Windows/ws/build\3rdparty\glog-0.3.4.vcxproj]>
         f:\jenkins\jenkins-slave\workspace\mesos-windows\build\3rdparty\glog-0.3.4\src\glog-0.3.4\src\googletest.h(579): warning C4290: C++ exception specification ignored except to indicate a function is not __declspec(nothrow) [F:\jenkins\jenkins-slave\workspace\Mesos-Windows\build\3rdparty\glog-0.3.4\src\glog-0.3.4-build\stl_logging_unittest.vcxproj] [<https://builds.apache.org/job/Mesos-Windows/ws/build\3rdparty\glog-0.3.4.vcxproj]>
         f:\jenkins\jenkins-slave\workspace\mesos-windows\build\3rdparty\glog-0.3.4\src\glog-0.3.4\src\googletest.h(586): warning C4290: C++ exception specification ignored except to indicate a function is not __declspec(nothrow) [F:\jenkins\jenkins-slave\workspace\Mesos-Windows\build\3rdparty\glog-0.3.4\src\glog-0.3.4-build\stl_logging_unittest.vcxproj] [<https://builds.apache.org/job/Mesos-Windows/ws/build\3rdparty\glog-0.3.4.vcxproj]>
         f:\jenkins\jenkins-slave\workspace\mesos-windows\build\3rdparty\glog-0.3.4\src\glog-0.3.4\src\googletest.h(579): warning C4290: C++ exception specification ignored except to indicate a function is not __declspec(nothrow) [F:\jenkins\jenkins-slave\workspace\Mesos-Windows\build\3rdparty\glog-0.3.4\src\glog-0.3.4-build\utilities_unittest.vcxproj] [<https://builds.apache.org/job/Mesos-Windows/ws/build\3rdparty\glog-0.3.4.vcxproj]>
         f:\jenkins\jenkins-slave\workspace\mesos-windows\build\3rdparty\glog-0.3.4\src\glog-0.3.4\src\googletest.h(586): warning C4290: C++ exception specification ignored except to indicate a function is not __declspec(nothrow) [F:\jenkins\jenkins-slave\workspace\Mesos-Windows\build\3rdparty\glog-0.3.4\src\glog-0.3.4-build\utilities_unittest.vcxproj] [<https://builds.apache.org/job/Mesos-Windows/ws/build\3rdparty\glog-0.3.4.vcxproj]>
         F:\jenkins\jenkins-slave\workspace\Mesos-Windows\build\3rdparty\glog-0.3.4\src\glog-0.3.4\src\demangle.cc(343): warning C4267: 'initializing': conversion from 'size_t' to 'int', possible loss of data [F:\jenkins\jenkins-slave\workspace\Mesos-Windows\build\3rdparty\glog-0.3.4\src\glog-0.3.4-build\glog.vcxproj] [<https://builds.apache.org/job/Mesos-Windows/ws/build\3rdparty\glog-0.3.4.vcxproj]>
         F:\jenkins\jenkins-slave\workspace\Mesos-Windows\build\3rdparty\glog-0.3.4\src\glog-0.3.4\src\logging.cc(200): warning C4267: 'argument': conversion from 'size_t' to 'unsigned int', possible loss of data [F:\jenkins\jenkins-slave\workspace\Mesos-Windows\build\3rdparty\glog-0.3.4\src\glog-0.3.4-build\glog.vcxproj] [<https://builds.apache.org/job/Mesos-Windows/ws/build\3rdparty\glog-0.3.4.vcxproj]>
         F:\jenkins\jenkins-slave\workspace\Mesos-Windows\build\3rdparty\glog-0.3.4\src\glog-0.3.4\src\logging.cc(216): warning C4267: 'argument': conversion from 'size_t' to 'unsigned int', possible loss of data [F:\jenkins\jenkins-slave\workspace\Mesos-Windows\build\3rdparty\glog-0.3.4\src\glog-0.3.4-build\glog.vcxproj] [<https://builds.apache.org/job/Mesos-Windows/ws/build\3rdparty\glog-0.3.4.vcxproj]>
         F:\jenkins\jenkins-slave\workspace\Mesos-Windows\build\3rdparty\glog-0.3.4\src\glog-0.3.4\src\logging.cc(631): warning C4267: 'initializing': conversion from 'size_t' to 'int', possible loss of data [F:\jenkins\jenkins-slave\workspace\Mesos-Windows\build\3rdparty\glog-0.3.4\src\glog-0.3.4-build\glog.vcxproj] [<https://builds.apache.org/job/Mesos-Windows/ws/build\3rdparty\glog-0.3.4.vcxproj]>
         F:\jenkins\jenkins-slave\workspace\Mesos-Windows\build\3rdparty\glog-0.3.4\src\glog-0.3.4\src\logging.cc(764): warning C4267: 'argument': conversion from 'size_t' to 'int', possible loss of data [F:\jenkins\jenkins-slave\workspace\Mesos-Windows\build\3rdparty\glog-0.3.4\src\glog-0.3.4-build\glog.vcxproj] [<https://builds.apache.org/job/Mesos-Windows/ws/build\3rdparty\glog-0.3.4.vcxproj]>
         F:\jenkins\jenkins-slave\workspace\Mesos-Windows\build\3rdparty\glog-0.3.4\src\glog-0.3.4\src\logging.cc(789): warning C4267: 'initializing': conversion from 'size_t' to 'int', possible loss of data [F:\jenkins\jenkins-slave\workspace\Mesos-Windows\build\3rdparty\glog-0.3.4\src\glog-0.3.4-build\glog.vcxproj] [<https://builds.apache.org/job/Mesos-Windows/ws/build\3rdparty\glog-0.3.4.vcxproj]>
         F:\jenkins\jenkins-slave\workspace\Mesos-Windows\build\3rdparty\glog-0.3.4\src\glog-0.3.4\src\logging.cc(799): warning C4267: 'initializing': conversion from 'size_t' to 'int', possible loss of data [F:\jenkins\jenkins-slave\workspace\Mesos-Windows\build\3rdparty\glog-0.3.4\src\glog-0.3.4-build\glog.vcxproj] [<https://builds.apache.org/job/Mesos-Windows/ws/build\3rdparty\glog-0.3.4.vcxproj]>
         F:\jenkins\jenkins-slave\workspace\Mesos-Windows\build\3rdparty\glog-0.3.4\src\glog-0.3.4\src\logging.cc(1082): warning C4267: 'initializing': conversion from 'size_t' to 'int', possible loss of data [F:\jenkins\jenkins-slave\workspace\Mesos-Windows\build\3rdparty\glog-0.3.4\src\glog-0.3.4-build\glog.vcxproj] [<https://builds.apache.org/job/Mesos-Windows/ws/build\3rdparty\glog-0.3.4.vcxproj]>
         F:\jenkins\jenkins-slave\workspace\Mesos-Windows\build\3rdparty\glog-0.3.4\src\glog-0.3.4\src\logging.cc(1082): warning C4267: 'initializing': conversion from 'size_t' to 'const int', possible loss of data [F:\jenkins\jenkins-slave\workspace\Mesos-Windows\build\3rdparty\glog-0.3.4\src\glog-0.3.4-build\glog.vcxproj] [<https://builds.apache.org/job/Mesos-Windows/ws/build\3rdparty\glog-0.3.4.vcxproj]>
         F:\jenkins\jenkins-slave\workspace\Mesos-Windows\build\3rdparty\glog-0.3.4\src\glog-0.3.4\src\logging.cc(1343): warning C4267: 'initializing': conversion from 'size_t' to 'int', possible loss of data [F:\jenkins\jenkins-slave\workspace\Mesos-Windows\build\3rdparty\glog-0.3.4\src\glog-0.3.4-build\glog.vcxproj] [<https://builds.apache.org/job/Mesos-Windows/ws/build\3rdparty\glog-0.3.4.vcxproj]>
         F:\jenkins\jenkins-slave\workspace\Mesos-Windows\build\3rdparty\glog-0.3.4\src\glog-0.3.4\src\logging.cc(1343): warning C4267: 'initializing': conversion from 'size_t' to 'const int', possible loss of data [F:\jenkins\jenkins-slave\workspace\Mesos-Windows\build\3rdparty\glog-0.3.4\src\glog-0.3.4-build\glog.vcxproj] [<https://builds.apache.org/job/Mesos-Windows/ws/build\3rdparty\glog-0.3.4.vcxproj]>
         F:\jenkins\jenkins-slave\workspace\Mesos-Windows\build\3rdparty\glog-0.3.4\src\glog-0.3.4\src\logging.cc(1416): warning C4267: 'argument': conversion from 'size_t' to 'const int', possible loss of data [F:\jenkins\jenkins-slave\workspace\Mesos-Windows\build\3rdparty\glog-0.3.4\src\glog-0.3.4-build\glog.vcxproj] [<https://builds.apache.org/job/Mesos-Windows/ws/build\3rdparty\glog-0.3.4.vcxproj]>
         F:\jenkins\jenkins-slave\workspace\Mesos-Windows\build\3rdparty\glog-0.3.4\src\glog-0.3.4\src\logging.cc(1438): warning C4267: 'argument': conversion from 'size_t' to 'unsigned int', possible loss of data [F:\jenkins\jenkins-slave\workspace\Mesos-Windows\build\3rdparty\glog-0.3.4\src\glog-0.3.4-build\glog.vcxproj] [<https://builds.apache.org/job/Mesos-Windows/ws/build\3rdparty\glog-0.3.4.vcxproj]>
         F:\jenkins\jenkins-slave\workspace\Mesos-Windows\build\3rdparty\glog-0.3.4\src\glog-0.3.4\src\logging.cc(1516): warning C4267: 'initializing': conversion from 'size_t' to 'int', possible loss of data [F:\jenkins\jenkins-slave\workspace\Mesos-Windows\build\3rdparty\glog-0.3.4\src\glog-0.3.4-build\glog.vcxproj] [<https://builds.apache.org/job/Mesos-Windows/ws/build\3rdparty\glog-0.3.4.vcxproj]>
         F:\jenkins\jenkins-slave\workspace\Mesos-Windows\build\3rdparty\glog-0.3.4\src\glog-0.3.4\src\logging.cc(1529): warning C4267: 'initializing': conversion from 'size_t' to 'int', possible loss of data [F:\jenkins\jenkins-slave\workspace\Mesos-Windows\build\3rdparty\glog-0.3.4\src\glog-0.3.4-build\glog.vcxproj] [<https://builds.apache.org/job/Mesos-Windows/ws/build\3rdparty\glog-0.3.4.vcxproj]>
         F:\jenkins\jenkins-slave\workspace\Mesos-Windows\build\3rdparty\glog-0.3.4\src\glog-0.3.4\src\raw_logging.cc(153): warning C4267: 'argument': conversion from 'size_t' to 'unsigned int', possible loss of data [F:\jenkins\jenkins-slave\workspace\Mesos-Windows\build\3rdparty\glog-0.3.4\src\glog-0.3.4-build\glog.vcxproj] [<https://builds.apache.org/job/Mesos-Windows/ws/build\3rdparty\glog-0.3.4.vcxproj]>
         F:\jenkins\jenkins-slave\workspace\Mesos-Windows\build\3rdparty\glog-0.3.4\src\glog-0.3.4\src\vlog_is_on.cc(163): warning C4267: 'initializing': conversion from 'size_t' to 'int', possible loss of data [F:\jenkins\jenkins-slave\workspace\Mesos-Windows\build\3rdparty\glog-0.3.4\src\glog-0.3.4-build\glog.vcxproj] [<https://builds.apache.org/job/Mesos-Windows/ws/build\3rdparty\glog-0.3.4.vcxproj]>
         F:\jenkins\jenkins-slave\workspace\Mesos-Windows\build\3rdparty\glog-0.3.4\src\glog-0.3.4\src\vlog_is_on.cc(163): warning C4267: 'initializing': conversion from 'size_t' to 'const int', possible loss of data [F:\jenkins\jenkins-slave\workspace\Mesos-Windows\build\3rdparty\glog-0.3.4\src\glog-0.3.4-build\glog.vcxproj] [<https://builds.apache.org/job/Mesos-Windows/ws/build\3rdparty\glog-0.3.4.vcxproj]>
         f:\jenkins\jenkins-slave\workspace\mesos-windows\build\3rdparty\glog-0.3.4\src\glog-0.3.4\src\googletest.h(579): warning C4290: C++ exception specification ignored except to indicate a function is not __declspec(nothrow) [F:\jenkins\jenkins-slave\workspace\Mesos-Windows\build\3rdparty\glog-0.3.4\src\glog-0.3.4-build\demangle_unittest.vcxproj] [<https://builds.apache.org/job/Mesos-Windows/ws/build\3rdparty\glog-0.3.4.vcxproj]>
         f:\jenkins\jenkins-slave\workspace\mesos-windows\build\3rdparty\glog-0.3.4\src\glog-0.3.4\src\googletest.h(586): warning C4290: C++ exception specification ignored except to indicate a function is not __declspec(nothrow) [F:\jenkins\jenkins-slave\workspace\Mesos-Windows\build\3rdparty\glog-0.3.4\src\glog-0.3.4-build\demangle_unittest.vcxproj] [<https://builds.apache.org/job/Mesos-Windows/ws/build\3rdparty\glog-0.3.4.vcxproj]>
         f:\jenkins\jenkins-slave\workspace\mesos-windows\build\3rdparty\glog-0.3.4\src\glog-0.3.4\src\googletest.h(579): warning C4290: C++ exception specification ignored except to indicate a function is not __declspec(nothrow) [F:\jenkins\jenkins-slave\workspace\Mesos-Windows\build\3rdparty\glog-0.3.4\src\glog-0.3.4-build\logging_unittest.vcxproj] [<https://builds.apache.org/job/Mesos-Windows/ws/build\3rdparty\glog-0.3.4.vcxproj]>
         f:\jenkins\jenkins-slave\workspace\mesos-windows\build\3rdparty\glog-0.3.4\src\glog-0.3.4\src\googletest.h(586): warning C4290: C++ exception specification ignored except to indicate a function is not __declspec(nothrow) [F:\jenkins\jenkins-slave\workspace\Mesos-Windows\build\3rdparty\glog-0.3.4\src\glog-0.3.4-build\logging_unittest.vcxproj] [<https://builds.apache.org/job/Mesos-Windows/ws/build\3rdparty\glog-0.3.4.vcxproj]>
         F:\jenkins\jenkins-slave\workspace\Mesos-Windows\build\3rdparty\glog-0.3.4\src\glog-0.3.4\src\logging_unittest.cc(741): warning C4267: 'return': conversion from 'size_t' to 'google::uint32', possible loss of data [F:\jenkins\jenkins-slave\workspace\Mesos-Windows\build\3rdparty\glog-0.3.4\src\glog-0.3.4-build\logging_unittest.vcxproj] [<https://builds.apache.org/job/Mesos-Windows/ws/build\3rdparty\glog-0.3.4.vcxproj]>
         F:\jenkins\jenkins-slave\workspace\Mesos-Windows\build\3rdparty\glog-0.3.4\src\glog-0.3.4\src\logging_unittest.cc(798): warning C4267: 'argument': conversion from 'size_t' to 'unsigned int', possible loss of data [F:\jenkins\jenkins-slave\workspace\Mesos-Windows\build\3rdparty\glog-0.3.4\src\glog-0.3.4-build\logging_unittest.vcxproj] [<https://builds.apache.org/job/Mesos-Windows/ws/build\3rdparty\glog-0.3.4.vcxproj]>
         F:\jenkins\jenkins-slave\workspace\Mesos-Windows\build\3rdparty\glog-0.3.4\src\glog-0.3.4\src\logging_unittest.cc(963): warning C4267: 'initializing': conversion from 'size_t' to 'int', possible loss of data [F:\jenkins\jenkins-slave\workspace\Mesos-Windows\build\3rdparty\glog-0.3.4\src\glog-0.3.4-build\logging_unittest.vcxproj] [<https://builds.apache.org/job/Mesos-Windows/ws/build\3rdparty\glog-0.3.4.vcxproj]>
         f:\jenkins\jenkins-slave\workspace\mesos-windows\build\3rdparty\glog-0.3.4\src\glog-0.3.4\src\googletest.h(579): warning C4290: C++ exception specification ignored except to indicate a function is not __declspec(nothrow) [F:\jenkins\jenkins-slave\workspace\Mesos-Windows\build\3rdparty\glog-0.3.4\src\glog-0.3.4-build\stl_logging_unittest.vcxproj] [<https://builds.apache.org/job/Mesos-Windows/ws/build\3rdparty\glog-0.3.4.vcxproj]>
         f:\jenkins\jenkins-slave\workspace\mesos-windows\build\3rdparty\glog-0.3.4\src\glog-0.3.4\src\googletest.h(586): warning C4290: C++ exception specification ignored except to indicate a function is not __declspec(nothrow) [F:\jenkins\jenkins-slave\workspace\Mesos-Windows\build\3rdparty\glog-0.3.4\src\glog-0.3.4-build\stl_logging_unittest.vcxproj] [<https://builds.apache.org/job/Mesos-Windows/ws/build\3rdparty\glog-0.3.4.vcxproj]>
         f:\jenkins\jenkins-slave\workspace\mesos-windows\build\3rdparty\glog-0.3.4\src\glog-0.3.4\src\googletest.h(579): warning C4290: C++ exception specification ignored except to indicate a function is not __declspec(nothrow) [F:\jenkins\jenkins-slave\workspace\Mesos-Windows\build\3rdparty\glog-0.3.4\src\glog-0.3.4-build\utilities_unittest.vcxproj] [<https://builds.apache.org/job/Mesos-Windows/ws/build\3rdparty\glog-0.3.4.vcxproj]>
         f:\jenkins\jenkins-slave\workspace\mesos-windows\build\3rdparty\glog-0.3.4\src\glog-0.3.4\src\googletest.h(586): warning C4290: C++ exception specification ignored except to indicate a function is not __declspec(nothrow) [F:\jenkins\jenkins-slave\workspace\Mesos-Windows\build\3rdparty\glog-0.3.4\src\glog-0.3.4-build\utilities_unittest.vcxproj] [<https://builds.apache.org/job/Mesos-Windows/ws/build\3rdparty\glog-0.3.4.vcxproj]>


       "<https://builds.apache.org/job/Mesos-Windows/ws/build\Mesos.sln"> (stout_tests target) (1) ->
       "<https://builds.apache.org/job/Mesos-Windows/ws/build\3rdparty\stout\tests\stout_tests.vcxproj.metaproj"> (default target) (2) ->
       "<https://builds.apache.org/job/Mesos-Windows/ws/build\3rdparty\protobuf-2.6.1.vcxproj.metaproj"> (default target) (11) ->
       "<https://builds.apache.org/job/Mesos-Windows/ws/build\3rdparty\protobuf-2.6.1.vcxproj"> (default target) (15) ->
         F:\jenkins\jenkins-slave\workspace\Mesos-Windows\build\3rdparty\protobuf-2.6.1\src\protobuf-2.6.1\src\google\protobuf\generated_message_reflection.cc(1996): warning C4065: switch statement contains 'default' but no 'case' labels [F:\jenkins\jenkins-slave\workspace\Mesos-Windows\build\3rdparty\protobuf-2.6.1\src\protobuf-2.6.1-build\libprotobuf.vcxproj] [<https://builds.apache.org/job/Mesos-Windows/ws/build\3rdparty\protobuf-2.6.1.vcxproj]>
         F:\jenkins\jenkins-slave\workspace\Mesos-Windows\build\3rdparty\protobuf-2.6.1\src\protobuf-2.6.1\src\google\protobuf\generated_message_reflection.cc(2276): warning C4506: no definition for inline function 'google::protobuf::Arena *google::protobuf::internal::GenericTypeHandler<google::protobuf::Message>::GetArena(GenericType *)' [F:\jenkins\jenkins-slave\workspace\Mesos-Windows\build\3rdparty\protobuf-2.6.1\src\protobuf-2.6.1-build\libprotobuf.vcxproj] [<https://builds.apache.org/job/Mesos-Windows/ws/build\3rdparty\protobuf-2.6.1.vcxproj]>
         F:\jenkins\jenkins-slave\workspace\Mesos-Windows\build\3rdparty\protobuf-2.6.1\src\protobuf-2.6.1\src\google\protobuf\generated_message_reflection.cc(2276): warning C4506: no definition for inline function 'void *google::protobuf::internal::GenericTypeHandler<google::protobuf::Message>::GetMaybeArenaPointer(GenericType *)' [F:\jenkins\jenkins-slave\workspace\Mesos-Windows\build\3rdparty\protobuf-2.6.1\src\protobuf-2.6.1-build\libprotobuf.vcxproj] [<https://builds.apache.org/job/Mesos-Windows/ws/build\3rdparty\protobuf-2.6.1.vcxproj]>
         F:\jenkins\jenkins-slave\workspace\Mesos-Windows\build\3rdparty\protobuf-2.6.1\src\protobuf-2.6.1\src\google\protobuf\map_field.cc(467): warning C4506: no definition for inline function 'google::protobuf::Arena *google::protobuf::internal::GenericTypeHandler<google::protobuf::Message>::GetArena(GenericType *)' [F:\jenkins\jenkins-slave\workspace\Mesos-Windows\build\3rdparty\protobuf-2.6.1\src\protobuf-2.6.1-build\libprotobuf.vcxproj] [<https://builds.apache.org/job/Mesos-Windows/ws/build\3rdparty\protobuf-2.6.1.vcxproj]>
         F:\jenkins\jenkins-slave\workspace\Mesos-Windows\build\3rdparty\protobuf-2.6.1\src\protobuf-2.6.1\src\google\protobuf\map_field.cc(467): warning C4506: no definition for inline function 'void *google::protobuf::internal::GenericTypeHandler<google::protobuf::Message>::GetMaybeArenaPointer(GenericType *)' [F:\jenkins\jenkins-slave\workspace\Mesos-Windows\build\3rdparty\protobuf-2.6.1\src\protobuf-2.6.1-build\libprotobuf.vcxproj] [<https://builds.apache.org/job/Mesos-Windows/ws/build\3rdparty\protobuf-2.6.1.vcxproj]>
         error_listener.obj : warning LNK4221: This object file does not define any previously undefined public symbols, so it will not be used by any link operation that consumes this library [F:\jenkins\jenkins-slave\workspace\Mesos-Windows\build\3rdparty\protobuf-2.6.1\src\protobuf-2.6.1-build\libprotobuf.vcxproj] [<https://builds.apache.org/job/Mesos-Windows/ws/build\3rdparty\protobuf-2.6.1.vcxproj]>
         atomicops_internals_x86_gcc.obj : warning LNK4221: This object file does not define any previously undefined public symbols, so it will not be used by any link operation that consumes this library [F:\jenkins\jenkins-slave\workspace\Mesos-Windows\build\3rdparty\protobuf-2.6.1\src\protobuf-2.6.1-build\libprotobuf.vcxproj] [<https://builds.apache.org/job/Mesos-Windows/ws/build\3rdparty\protobuf-2.6.1.vcxproj]>
         atomicops_internals_x86_gcc.obj : warning LNK4221: This object file does not define any previously undefined public symbols, so it will not be used by any link operation that consumes this library [F:\jenkins\jenkins-slave\workspace\Mesos-Windows\build\3rdparty\protobuf-2.6.1\src\protobuf-2.6.1-build\libprotobuf-lite.vcxproj] [<https://builds.apache.org/job/Mesos-Windows/ws/build\3rdparty\protobuf-2.6.1.vcxproj]>
         F:\jenkins\jenkins-slave\workspace\Mesos-Windows\build\3rdparty\protobuf-2.6.1\src\protobuf-2.6.1\src\google\protobuf\compiler\cpp\cpp_message.cc(1104): warning C4065: switch statement contains 'default' but no 'case' labels [F:\jenkins\jenkins-slave\workspace\Mesos-Windows\build\3rdparty\protobuf-2.6.1\src\protobuf-2.6.1-build\libprotoc.vcxproj] [<https://builds.apache.org/job/Mesos-Windows/ws/build\3rdparty\protobuf-2.6.1.vcxproj]>
         F:\jenkins\jenkins-slave\workspace\Mesos-Windows\build\3rdparty\protobuf-2.6.1\src\protobuf-2.6.1\src\google\protobuf\generated_message_reflection.cc(1996): warning C4065: switch statement contains 'default' but no 'case' labels [F:\jenkins\jenkins-slave\workspace\Mesos-Windows\build\3rdparty\protobuf-2.6.1\src\protobuf-2.6.1-build\libprotobuf.vcxproj] [<https://builds.apache.org/job/Mesos-Windows/ws/build\3rdparty\protobuf-2.6.1.vcxproj]>
         F:\jenkins\jenkins-slave\workspace\Mesos-Windows\build\3rdparty\protobuf-2.6.1\src\protobuf-2.6.1\src\google\protobuf\generated_message_reflection.cc(2276): warning C4506: no definition for inline function 'google::protobuf::Arena *google::protobuf::internal::GenericTypeHandler<google::protobuf::Message>::GetArena(GenericType *)' [F:\jenkins\jenkins-slave\workspace\Mesos-Windows\build\3rdparty\protobuf-2.6.1\src\protobuf-2.6.1-build\libprotobuf.vcxproj] [<https://builds.apache.org/job/Mesos-Windows/ws/build\3rdparty\protobuf-2.6.1.vcxproj]>
         F:\jenkins\jenkins-slave\workspace\Mesos-Windows\build\3rdparty\protobuf-2.6.1\src\protobuf-2.6.1\src\google\protobuf\generated_message_reflection.cc(2276): warning C4506: no definition for inline function 'void *google::protobuf::internal::GenericTypeHandler<google::protobuf::Message>::GetMaybeArenaPointer(GenericType *)' [F:\jenkins\jenkins-slave\workspace\Mesos-Windows\build\3rdparty\protobuf-2.6.1\src\protobuf-2.6.1-build\libprotobuf.vcxproj] [<https://builds.apache.org/job/Mesos-Windows/ws/build\3rdparty\protobuf-2.6.1.vcxproj]>
         F:\jenkins\jenkins-slave\workspace\Mesos-Windows\build\3rdparty\protobuf-2.6.1\src\protobuf-2.6.1\src\google\protobuf\map_field.cc(467): warning C4506: no definition for inline function 'google::protobuf::Arena *google::protobuf::internal::GenericTypeHandler<google::protobuf::Message>::GetArena(GenericType *)' [F:\jenkins\jenkins-slave\workspace\Mesos-Windows\build\3rdparty\protobuf-2.6.1\src\protobuf-2.6.1-build\libprotobuf.vcxproj] [<https://builds.apache.org/job/Mesos-Windows/ws/build\3rdparty\protobuf-2.6.1.vcxproj]>
         F:\jenkins\jenkins-slave\workspace\Mesos-Windows\build\3rdparty\protobuf-2.6.1\src\protobuf-2.6.1\src\google\protobuf\map_field.cc(467): warning C4506: no definition for inline function 'void *google::protobuf::internal::GenericTypeHandler<google::protobuf::Message>::GetMaybeArenaPointer(GenericType *)' [F:\jenkins\jenkins-slave\workspace\Mesos-Windows\build\3rdparty\protobuf-2.6.1\src\protobuf-2.6.1-build\libprotobuf.vcxproj] [<https://builds.apache.org/job/Mesos-Windows/ws/build\3rdparty\protobuf-2.6.1.vcxproj]>
         error_listener.obj : warning LNK4221: This object file does not define any previously undefined public symbols, so it will not be used by any link operation that consumes this library [F:\jenkins\jenkins-slave\workspace\Mesos-Windows\build\3rdparty\protobuf-2.6.1\src\protobuf-2.6.1-build\libprotobuf.vcxproj] [<https://builds.apache.org/job/Mesos-Windows/ws/build\3rdparty\protobuf-2.6.1.vcxproj]>
         atomicops_internals_x86_gcc.obj : warning LNK4221: This object file does not define any previously undefined public symbols, so it will not be used by any link operation that consumes this library [F:\jenkins\jenkins-slave\workspace\Mesos-Windows\build\3rdparty\protobuf-2.6.1\src\protobuf-2.6.1-build\libprotobuf.vcxproj] [<https://builds.apache.org/job/Mesos-Windows/ws/build\3rdparty\protobuf-2.6.1.vcxproj]>
         atomicops_internals_x86_gcc.obj : warning LNK4221: This object file does not define any previously undefined public symbols, so it will not be used by any link operation that consumes this library [F:\jenkins\jenkins-slave\workspace\Mesos-Windows\build\3rdparty\protobuf-2.6.1\src\protobuf-2.6.1-build\libprotobuf-lite.vcxproj] [<https://builds.apache.org/job/Mesos-Windows/ws/build\3rdparty\protobuf-2.6.1.vcxproj]>
         F:\jenkins\jenkins-slave\workspace\Mesos-Windows\build\3rdparty\protobuf-2.6.1\src\protobuf-2.6.1\src\google\protobuf\compiler\cpp\cpp_message.cc(1104): warning C4065: switch statement contains 'default' but no 'case' labels [F:\jenkins\jenkins-slave\workspace\Mesos-Windows\build\3rdparty\protobuf-2.6.1\src\protobuf-2.6.1-build\libprotoc.vcxproj] [<https://builds.apache.org/job/Mesos-Windows/ws/build\3rdparty\protobuf-2.6.1.vcxproj]>


       "<https://builds.apache.org/job/Mesos-Windows/ws/build\Mesos.sln"> (stout_tests target) (1) ->
       "<https://builds.apache.org/job/Mesos-Windows/ws/build\3rdparty\stout\tests\stout_tests.vcxproj.metaproj"> (default target) (2) ->
       "<https://builds.apache.org/job/Mesos-Windows/ws/build\3rdparty\curl-7.43.0.vcxproj.metaproj"> (default target) (5) ->
       "<https://builds.apache.org/job/Mesos-Windows/ws/build\3rdparty\curl-7.43.0.vcxproj"> (default target) (21) ->
         F:\jenkins\jenkins-slave\workspace\Mesos-Windows\build\3rdparty\curl-7.43.0\src\curl-7.43.0\lib\file.c(546): warning C4244: 'function': conversion from 'curl_off_t' to 'long', possible loss of data [F:\jenkins\jenkins-slave\workspace\Mesos-Windows\build\3rdparty\curl-7.43.0\src\curl-7.43.0-build\lib\libcurl.vcxproj] [<https://builds.apache.org/job/Mesos-Windows/ws/build\3rdparty\curl-7.43.0.vcxproj]>
         F:\jenkins\jenkins-slave\workspace\Mesos-Windows\build\3rdparty\curl-7.43.0\src\curl-7.43.0\lib\cookie.c(335): warning C4013: 'inet_pton' undefined; assuming extern returning int [F:\jenkins\jenkins-slave\workspace\Mesos-Windows\build\3rdparty\curl-7.43.0\src\curl-7.43.0-build\lib\libcurl.vcxproj] [<https://builds.apache.org/job/Mesos-Windows/ws/build\3rdparty\curl-7.43.0.vcxproj]>
         F:\jenkins\jenkins-slave\workspace\Mesos-Windows\build\3rdparty\curl-7.43.0\src\curl-7.43.0\lib\sendf.c(257): warning C4267: 'function': conversion from 'size_t' to 'int', possible loss of data [F:\jenkins\jenkins-slave\workspace\Mesos-Windows\build\3rdparty\curl-7.43.0\src\curl-7.43.0-build\lib\libcurl.vcxproj] [<https://builds.apache.org/job/Mesos-Windows/ws/build\3rdparty\curl-7.43.0.vcxproj]>
         F:\jenkins\jenkins-slave\workspace\Mesos-Windows\build\3rdparty\curl-7.43.0\src\curl-7.43.0\lib\sendf.c(314): warning C4267: 'function': conversion from 'size_t' to 'int', possible loss of data [F:\jenkins\jenkins-slave\workspace\Mesos-Windows\build\3rdparty\curl-7.43.0\src\curl-7.43.0-build\lib\libcurl.vcxproj] [<https://builds.apache.org/job/Mesos-Windows/ws/build\3rdparty\curl-7.43.0.vcxproj]>
         F:\jenkins\jenkins-slave\workspace\Mesos-Windows\build\3rdparty\curl-7.43.0\src\curl-7.43.0\lib\sendf.c(519): warning C4267: 'function': conversion from 'size_t' to 'int', possible loss of data [F:\jenkins\jenkins-slave\workspace\Mesos-Windows\build\3rdparty\curl-7.43.0\src\curl-7.43.0-build\lib\libcurl.vcxproj] [<https://builds.apache.org/job/Mesos-Windows/ws/build\3rdparty\curl-7.43.0.vcxproj]>
         F:\jenkins\jenkins-slave\workspace\Mesos-Windows\build\3rdparty\curl-7.43.0\src\curl-7.43.0\lib\telnet.c(944): warning C4267: 'function': conversion from 'size_t' to 'int', possible loss of data [F:\jenkins\jenkins-slave\workspace\Mesos-Windows\build\3rdparty\curl-7.43.0\src\curl-7.43.0-build\lib\libcurl.vcxproj] [<https://builds.apache.org/job/Mesos-Windows/ws/build\3rdparty\curl-7.43.0.vcxproj]>
         F:\jenkins\jenkins-slave\workspace\Mesos-Windows\build\3rdparty\curl-7.43.0\src\curl-7.43.0\lib\telnet.c(956): warning C4267: 'function': conversion from 'size_t' to 'int', possible loss of data [F:\jenkins\jenkins-slave\workspace\Mesos-Windows\build\3rdparty\curl-7.43.0\src\curl-7.43.0-build\lib\libcurl.vcxproj] [<https://builds.apache.org/job/Mesos-Windows/ws/build\3rdparty\curl-7.43.0.vcxproj]>
         F:\jenkins\jenkins-slave\workspace\Mesos-Windows\build\3rdparty\curl-7.43.0\src\curl-7.43.0\lib\telnet.c(984): warning C4267: 'function': conversion from 'size_t' to 'int', possible loss of data [F:\jenkins\jenkins-slave\workspace\Mesos-Windows\build\3rdparty\curl-7.43.0\src\curl-7.43.0-build\lib\libcurl.vcxproj] [<https://builds.apache.org/job/Mesos-Windows/ws/build\3rdparty\curl-7.43.0.vcxproj]>
         F:\jenkins\jenkins-slave\workspace\Mesos-Windows\build\3rdparty\curl-7.43.0\src\curl-7.43.0\lib\connect.c(402): warning C4013: 'inet_pton' undefined; assuming extern returning int [F:\jenkins\jenkins-slave\workspace\Mesos-Windows\build\3rdparty\curl-7.43.0\src\curl-7.43.0-build\lib\libcurl.vcxproj] [<https://builds.apache.org/job/Mesos-Windows/ws/build\3rdparty\curl-7.43.0.vcxproj]>
         F:\jenkins\jenkins-slave\workspace\Mesos-Windows\build\3rdparty\curl-7.43.0\src\curl-7.43.0\lib\hostip4.c(133): warning C4013: 'inet_pton' undefined; assuming extern returning int [F:\jenkins\jenkins-slave\workspace\Mesos-Windows\build\3rdparty\curl-7.43.0\src\curl-7.43.0-build\lib\libcurl.vcxproj] [<https://builds.apache.org/job/Mesos-Windows/ws/build\3rdparty\curl-7.43.0.vcxproj]>
         F:\jenkins\jenkins-slave\workspace\Mesos-Windows\build\3rdparty\curl-7.43.0\src\curl-7.43.0\lib\hostip4.c(294): warning C4996: 'gethostbyname': Use getaddrinfo() or GetAddrInfoW() instead or define _WINSOCK_DEPRECATED_NO_WARNINGS to disable deprecated API warnings [F:\jenkins\jenkins-slave\workspace\Mesos-Windows\build\3rdparty\curl-7.43.0\src\curl-7.43.0-build\lib\libcurl.vcxproj] [<https://builds.apache.org/job/Mesos-Windows/ws/build\3rdparty\curl-7.43.0.vcxproj]>
         F:\jenkins\jenkins-slave\workspace\Mesos-Windows\build\3rdparty\curl-7.43.0\src\curl-7.43.0\lib\tftp.c(528): warning C4267: 'function': conversion from 'size_t' to 'int', possible loss of data [F:\jenkins\jenkins-slave\workspace\Mesos-Windows\build\3rdparty\curl-7.43.0\src\curl-7.43.0-build\lib\libcurl.vcxproj] [<https://builds.apache.org/job/Mesos-Windows/ws/build\3rdparty\curl-7.43.0.vcxproj]>
         F:\jenkins\jenkins-slave\workspace\Mesos-Windows\build\3rdparty\curl-7.43.0\src\curl-7.43.0\lib\curl_addrinfo.c(461): warning C4013: 'inet_pton' undefined; assuming extern returning int [F:\jenkins\jenkins-slave\workspace\Mesos-Windows\build\3rdparty\curl-7.43.0\src\curl-7.43.0-build\lib\libcurl.vcxproj] [<https://builds.apache.org/job/Mesos-Windows/ws/build\3rdparty\curl-7.43.0.vcxproj]>
         F:\jenkins\jenkins-slave\workspace\Mesos-Windows\build\3rdparty\curl-7.43.0\src\curl-7.43.0\lib\file.c(546): warning C4244: 'function': conversion from 'curl_off_t' to 'long', possible loss of data [F:\jenkins\jenkins-slave\workspace\Mesos-Windows\build\3rdparty\curl-7.43.0\src\curl-7.43.0-build\lib\libcurl.vcxproj] [<https://builds.apache.org/job/Mesos-Windows/ws/build\3rdparty\curl-7.43.0.vcxproj]>
         F:\jenkins\jenkins-slave\workspace\Mesos-Windows\build\3rdparty\curl-7.43.0\src\curl-7.43.0\lib\cookie.c(335): warning C4013: 'inet_pton' undefined; assuming extern returning int [F:\jenkins\jenkins-slave\workspace\Mesos-Windows\build\3rdparty\curl-7.43.0\src\curl-7.43.0-build\lib\libcurl.vcxproj] [<https://builds.apache.org/job/Mesos-Windows/ws/build\3rdparty\curl-7.43.0.vcxproj]>
         F:\jenkins\jenkins-slave\workspace\Mesos-Windows\build\3rdparty\curl-7.43.0\src\curl-7.43.0\lib\sendf.c(257): warning C4267: 'function': conversion from 'size_t' to 'int', possible loss of data [F:\jenkins\jenkins-slave\workspace\Mesos-Windows\build\3rdparty\curl-7.43.0\src\curl-7.43.0-build\lib\libcurl.vcxproj] [<https://builds.apache.org/job/Mesos-Windows/ws/build\3rdparty\curl-7.43.0.vcxproj]>
         F:\jenkins\jenkins-slave\workspace\Mesos-Windows\build\3rdparty\curl-7.43.0\src\curl-7.43.0\lib\sendf.c(314): warning C4267: 'function': conversion from 'size_t' to 'int', possible loss of data [F:\jenkins\jenkins-slave\workspace\Mesos-Windows\build\3rdparty\curl-7.43.0\src\curl-7.43.0-build\lib\libcurl.vcxproj] [<https://builds.apache.org/job/Mesos-Windows/ws/build\3rdparty\curl-7.43.0.vcxproj]>
         F:\jenkins\jenkins-slave\workspace\Mesos-Windows\build\3rdparty\curl-7.43.0\src\curl-7.43.0\lib\sendf.c(519): warning C4267: 'function': conversion from 'size_t' to 'int', possible loss of data [F:\jenkins\jenkins-slave\workspace\Mesos-Windows\build\3rdparty\curl-7.43.0\src\curl-7.43.0-build\lib\libcurl.vcxproj] [<https://builds.apache.org/job/Mesos-Windows/ws/build\3rdparty\curl-7.43.0.vcxproj]>
         F:\jenkins\jenkins-slave\workspace\Mesos-Windows\build\3rdparty\curl-7.43.0\src\curl-7.43.0\lib\telnet.c(944): warning C4267: 'function': conversion from 'size_t' to 'int', possible loss of data [F:\jenkins\jenkins-slave\workspace\Mesos-Windows\build\3rdparty\curl-7.43.0\src\curl-7.43.0-build\lib\libcurl.vcxproj] [<https://builds.apache.org/job/Mesos-Windows/ws/build\3rdparty\curl-7.43.0.vcxproj]>
         F:\jenkins\jenkins-slave\workspace\Mesos-Windows\build\3rdparty\curl-7.43.0\src\curl-7.43.0\lib\telnet.c(956): warning C4267: 'function': conversion from 'size_t' to 'int', possible loss of data [F:\jenkins\jenkins-slave\workspace\Mesos-Windows\build\3rdparty\curl-7.43.0\src\curl-7.43.0-build\lib\libcurl.vcxproj] [<https://builds.apache.org/job/Mesos-Windows/ws/build\3rdparty\curl-7.43.0.vcxproj]>
         F:\jenkins\jenkins-slave\workspace\Mesos-Windows\build\3rdparty\curl-7.43.0\src\curl-7.43.0\lib\telnet.c(984): warning C4267: 'function': conversion from 'size_t' to 'int', possible loss of data [F:\jenkins\jenkins-slave\workspace\Mesos-Windows\build\3rdparty\curl-7.43.0\src\curl-7.43.0-build\lib\libcurl.vcxproj] [<https://builds.apache.org/job/Mesos-Windows/ws/build\3rdparty\curl-7.43.0.vcxproj]>
         F:\jenkins\jenkins-slave\workspace\Mesos-Windows\build\3rdparty\curl-7.43.0\src\curl-7.43.0\lib\connect.c(402): warning C4013: 'inet_pton' undefined; assuming extern returning int [F:\jenkins\jenkins-slave\workspace\Mesos-Windows\build\3rdparty\curl-7.43.0\src\curl-7.43.0-build\lib\libcurl.vcxproj] [<https://builds.apache.org/job/Mesos-Windows/ws/build\3rdparty\curl-7.43.0.vcxproj]>
         F:\jenkins\jenkins-slave\workspace\Mesos-Windows\build\3rdparty\curl-7.43.0\src\curl-7.43.0\lib\hostip4.c(133): warning C4013: 'inet_pton' undefined; assuming extern returning int [F:\jenkins\jenkins-slave\workspace\Mesos-Windows\build\3rdparty\curl-7.43.0\src\curl-7.43.0-build\lib\libcurl.vcxproj] [<https://builds.apache.org/job/Mesos-Windows/ws/build\3rdparty\curl-7.43.0.vcxproj]>
         F:\jenkins\jenkins-slave\workspace\Mesos-Windows\build\3rdparty\curl-7.43.0\src\curl-7.43.0\lib\hostip4.c(294): warning C4996: 'gethostbyname': Use getaddrinfo() or GetAddrInfoW() instead or define _WINSOCK_DEPRECATED_NO_WARNINGS to disable deprecated API warnings [F:\jenkins\jenkins-slave\workspace\Mesos-Windows\build\3rdparty\curl-7.43.0\src\curl-7.43.0-build\lib\libcurl.vcxproj] [<https://builds.apache.org/job/Mesos-Windows/ws/build\3rdparty\curl-7.43.0.vcxproj]>
         F:\jenkins\jenkins-slave\workspace\Mesos-Windows\build\3rdparty\curl-7.43.0\src\curl-7.43.0\lib\tftp.c(528): warning C4267: 'function': conversion from 'size_t' to 'int', possible loss of data [F:\jenkins\jenkins-slave\workspace\Mesos-Windows\build\3rdparty\curl-7.43.0\src\curl-7.43.0-build\lib\libcurl.vcxproj] [<https://builds.apache.org/job/Mesos-Windows/ws/build\3rdparty\curl-7.43.0.vcxproj]>
         F:\jenkins\jenkins-slave\workspace\Mesos-Windows\build\3rdparty\curl-7.43.0\src\curl-7.43.0\lib\curl_addrinfo.c(461): warning C4013: 'inet_pton' undefined; assuming extern returning int [F:\jenkins\jenkins-slave\workspace\Mesos-Windows\build\3rdparty\curl-7.43.0\src\curl-7.43.0-build\lib\libcurl.vcxproj] [<https://builds.apache.org/job/Mesos-Windows/ws/build\3rdparty\curl-7.43.0.vcxproj]>


       "<https://builds.apache.org/job/Mesos-Windows/ws/build\Mesos.sln"> (stout_tests target) (1) ->
       "<https://builds.apache.org/job/Mesos-Windows/ws/build\3rdparty\stout\tests\stout_tests.vcxproj.metaproj"> (default target) (2) ->
       "<https://builds.apache.org/job/Mesos-Windows/ws/build\3rdparty\stout\tests\stout_tests.vcxproj"> (default target) (22) ->
       (ClCompile target) -> 
         F:\jenkins\jenkins-slave\workspace\Mesos-Windows\3rdparty\stout\include\stout/bytes.hpp(107): warning C4244: '*=': conversion from 'double' to 'uint64_t', possible loss of data (compiling source file F:\jenkins\jenkins-slave\workspace\Mesos-Windows\3rdparty\stout\tests\bytes_tests.cpp) [<https://builds.apache.org/job/Mesos-Windows/ws/build\3rdparty\stout\tests\stout_tests.vcxproj]>
         F:\jenkins\jenkins-slave\workspace\Mesos-Windows\3rdparty\stout\include\stout/bytes.hpp(118): warning C4244: '/=': conversion from 'double' to 'uint64_t', possible loss of data (compiling source file F:\jenkins\jenkins-slave\workspace\Mesos-Windows\3rdparty\stout\tests\bytes_tests.cpp) [<https://builds.apache.org/job/Mesos-Windows/ws/build\3rdparty\stout\tests\stout_tests.vcxproj]>
         F:\jenkins\jenkins-slave\workspace\Mesos-Windows\3rdparty\stout\include\stout/numify.hpp(53): warning C4146: unary minus operator applied to unsigned type, result still unsigned (compiling source file F:\jenkins\jenkins-slave\workspace\Mesos-Windows\3rdparty\stout\tests\bytes_tests.cpp) [<https://builds.apache.org/job/Mesos-Windows/ws/build\3rdparty\stout\tests\stout_tests.vcxproj]>
         F:\jenkins\jenkins-slave\workspace\Mesos-Windows\3rdparty\stout\include\stout/duration.hpp(99): warning C4244: '=': conversion from 'double' to 'long', possible loss of data (compiling source file F:\jenkins\jenkins-slave\workspace\Mesos-Windows\3rdparty\stout\tests\duration_tests.cpp) [<https://builds.apache.org/job/Mesos-Windows/ws/build\3rdparty\stout\tests\stout_tests.vcxproj]>
         F:\jenkins\jenkins-slave\workspace\Mesos-Windows\3rdparty\stout\include\stout/duration.hpp(100): warning C4244: '=': conversion from 'double' to 'long', possible loss of data (compiling source file F:\jenkins\jenkins-slave\workspace\Mesos-Windows\3rdparty\stout\tests\duration_tests.cpp) [<https://builds.apache.org/job/Mesos-Windows/ws/build\3rdparty\stout\tests\stout_tests.vcxproj]>
         F:\jenkins\jenkins-slave\workspace\Mesos-Windows\3rdparty\stout\include\stout/gzip.hpp(52): warning C4267: '=': conversion from 'size_t' to 'uInt', possible loss of data (compiling source file F:\jenkins\jenkins-slave\workspace\Mesos-Windows\3rdparty\stout\tests\gzip_tests.cpp) [<https://builds.apache.org/job/Mesos-Windows/ws/build\3rdparty\stout\tests\stout_tests.vcxproj]>
         F:\jenkins\jenkins-slave\workspace\Mesos-Windows\3rdparty\stout\include\stout/gzip.hpp(105): warning C4267: '=': conversion from 'size_t' to 'uInt', possible loss of data (compiling source file F:\jenkins\jenkins-slave\workspace\Mesos-Windows\3rdparty\stout\tests\gzip_tests.cpp) [<https://builds.apache.org/job/Mesos-Windows/ws/build\3rdparty\stout\tests\stout_tests.vcxproj]>
         F:\jenkins\jenkins-slave\workspace\Mesos-Windows\3rdparty\stout\include\stout/bytes.hpp(107): warning C4244: '*=': conversion from 'double' to 'uint64_t', possible loss of data (compiling source file F:\jenkins\jenkins-slave\workspace\Mesos-Windows\3rdparty\stout\tests\ip_tests.cpp) [<https://builds.apache.org/job/Mesos-Windows/ws/build\3rdparty\stout\tests\stout_tests.vcxproj]>
         F:\jenkins\jenkins-slave\workspace\Mesos-Windows\3rdparty\stout\include\stout/bytes.hpp(118): warning C4244: '/=': conversion from 'double' to 'uint64_t', possible loss of data (compiling source file F:\jenkins\jenkins-slave\workspace\Mesos-Windows\3rdparty\stout\tests\ip_tests.cpp) [<https://builds.apache.org/job/Mesos-Windows/ws/build\3rdparty\stout\tests\stout_tests.vcxproj]>
         F:\jenkins\jenkins-slave\workspace\Mesos-Windows\3rdparty\stout\include\stout/os/socket.hpp(34): warning C4244: '=': conversion from 'SOCKET' to 'int', possible loss of data (compiling source file F:\jenkins\jenkins-slave\workspace\Mesos-Windows\3rdparty\stout\tests\ip_tests.cpp) [<https://builds.apache.org/job/Mesos-Windows/ws/build\3rdparty\stout\tests\stout_tests.vcxproj]>
         F:\jenkins\jenkins-slave\workspace\Mesos-Windows\3rdparty\stout\include\stout/os/windows/close.hpp(51): warning C4800: 'BOOL': forcing value to bool 'true' or 'false' (performance warning) (compiling source file F:\jenkins\jenkins-slave\workspace\Mesos-Windows\3rdparty\stout\tests\ip_tests.cpp) [<https://builds.apache.org/job/Mesos-Windows/ws/build\3rdparty\stout\tests\stout_tests.vcxproj]>
         F:\jenkins\jenkins-slave\workspace\Mesos-Windows\3rdparty\stout\include\stout/numify.hpp(53): warning C4146: unary minus operator applied to unsigned type, result still unsigned (compiling source file F:\jenkins\jenkins-slave\workspace\Mesos-Windows\3rdparty\stout\tests\ip_tests.cpp) [<https://builds.apache.org/job/Mesos-Windows/ws/build\3rdparty\stout\tests\stout_tests.vcxproj]>
         F:\jenkins\jenkins-slave\workspace\Mesos-Windows\3rdparty\stout\include\stout/os/socket.hpp(34): warning C4244: '=': conversion from 'SOCKET' to 'int', possible loss of data (compiling source file F:\jenkins\jenkins-slave\workspace\Mesos-Windows\3rdparty\stout\tests\main.cpp) [<https://builds.apache.org/job/Mesos-Windows/ws/build\3rdparty\stout\tests\stout_tests.vcxproj]>
         F:\jenkins\jenkins-slave\workspace\Mesos-Windows\3rdparty\stout\include\stout/numify.hpp(53): warning C4146: unary minus operator applied to unsigned type, result still unsigned (compiling source file F:\jenkins\jenkins-slave\workspace\Mesos-Windows\3rdparty\stout\tests\numify_tests.cpp) [<https://builds.apache.org/job/Mesos-Windows/ws/build\3rdparty\stout\tests\stout_tests.vcxproj]>
         F:\jenkins\jenkins-slave\workspace\Mesos-Windows\3rdparty\stout\include\stout/bytes.hpp(107): warning C4244: '*=': conversion from 'double' to 'uint64_t', possible loss of data (compiling source file F:\jenkins\jenkins-slave\workspace\Mesos-Windows\3rdparty\stout\tests\os\env_tests.cpp) [<https://builds.apache.org/job/Mesos-Windows/ws/build\3rdparty\stout\tests\stout_tests.vcxproj]>
         F:\jenkins\jenkins-slave\workspace\Mesos-Windows\3rdparty\stout\include\stout/bytes.hpp(118): warning C4244: '/=': conversion from 'double' to 'uint64_t', possible loss of data (compiling source file F:\jenkins\jenkins-slave\workspace\Mesos-Windows\3rdparty\stout\tests\os\env_tests.cpp) [<https://builds.apache.org/job/Mesos-Windows/ws/build\3rdparty\stout\tests\stout_tests.vcxproj]>
         F:\jenkins\jenkins-slave\workspace\Mesos-Windows\3rdparty\stout\include\stout/duration.hpp(99): warning C4244: '=': conversion from 'double' to 'long', possible loss of data (compiling source file F:\jenkins\jenkins-slave\workspace\Mesos-Windows\3rdparty\stout\tests\os\env_tests.cpp) [<https://builds.apache.org/job/Mesos-Windows/ws/build\3rdparty\stout\tests\stout_tests.vcxproj]>
         F:\jenkins\jenkins-slave\workspace\Mesos-Windows\3rdparty\stout\include\stout/duration.hpp(100): warning C4244: '=': conversion from 'double' to 'long', possible loss of data (compiling source file F:\jenkins\jenkins-slave\workspace\Mesos-Windows\3rdparty\stout\tests\os\env_tests.cpp) [<https://builds.apache.org/job/Mesos-Windows/ws/build\3rdparty\stout\tests\stout_tests.vcxproj]>
         F:\jenkins\jenkins-slave\workspace\Mesos-Windows\3rdparty\stout\include\stout/os/socket.hpp(34): warning C4244: '=': conversion from 'SOCKET' to 'int', possible loss of data (compiling source file F:\jenkins\jenkins-slave\workspace\Mesos-Windows\3rdparty\stout\tests\os\env_tests.cpp) [<https://builds.apache.org/job/Mesos-Windows/ws/build\3rdparty\stout\tests\stout_tests.vcxproj]>
         F:\jenkins\jenkins-slave\workspace\Mesos-Windows\3rdparty\stout\include\stout/bytes.hpp(107): warning C4244: '*=': conversion from 'double' to 'uint64_t', possible loss of data (compiling source file F:\jenkins\jenkins-slave\workspace\Mesos-Windows\3rdparty\stout\tests\os\filesystem_tests.cpp) [<https://builds.apache.org/job/Mesos-Windows/ws/build\3rdparty\stout\tests\stout_tests.vcxproj]>
         F:\jenkins\jenkins-slave\workspace\Mesos-Windows\3rdparty\stout\include\stout/bytes.hpp(118): warning C4244: '/=': conversion from 'double' to 'uint64_t', possible loss of data (compiling source file F:\jenkins\jenkins-slave\workspace\Mesos-Windows\3rdparty\stout\tests\os\filesystem_tests.cpp) [<https://builds.apache.org/job/Mesos-Windows/ws/build\3rdparty\stout\tests\stout_tests.vcxproj]>
         F:\jenkins\jenkins-slave\workspace\Mesos-Windows\3rdparty\stout\include\stout/windows/fs.hpp(72): warning C4244: 'initializing': conversion from 'ULONGLONG' to 'double', possible loss of data (compiling source file F:\jenkins\jenkins-slave\workspace\Mesos-Windows\3rdparty\stout\tests\os\filesystem_tests.cpp) [<https://builds.apache.org/job/Mesos-Windows/ws/build\3rdparty\stout\tests\stout_tests.vcxproj]>
         F:\jenkins\jenkins-slave\workspace\Mesos-Windows\3rdparty\stout\include\stout/internal/windows/dirent.hpp(197): warning C4267: '=': conversion from 'size_t' to 'unsigned short', possible loss of data (compiling source file F:\jenkins\jenkins-slave\workspace\Mesos-Windows\3rdparty\stout\tests\os\filesystem_tests.cpp) [<https://builds.apache.org/job/Mesos-Windows/ws/build\3rdparty\stout\tests\stout_tests.vcxproj]>
         F:\jenkins\jenkins-slave\workspace\Mesos-Windows\3rdparty\stout\include\stout/internal/windows/dirent.hpp(217): warning C4267: '=': conversion from 'size_t' to 'unsigned short', possible loss of data (compiling source file F:\jenkins\jenkins-slave\workspace\Mesos-Windows\3rdparty\stout\tests\os\filesystem_tests.cpp) [<https://builds.apache.org/job/Mesos-Windows/ws/build\3rdparty\stout\tests\stout_tests.vcxproj]>
         F:\jenkins\jenkins-slave\workspace\Mesos-Windows\3rdparty\stout\include\stout/os/getcwd.hpp(31): warning C4267: 'argument': conversion from 'size_t' to 'int', possible loss of data (compiling source file F:\jenkins\jenkins-slave\workspace\Mesos-Windows\3rdparty\stout\tests\os\filesystem_tests.cpp) [<https://builds.apache.org/job/Mesos-Windows/ws/build\3rdparty\stout\tests\stout_tests.vcxproj]>
         F:\jenkins\jenkins-slave\workspace\Mesos-Windows\3rdparty\stout\include\stout/os/socket.hpp(34): warning C4244: '=': conversion from 'SOCKET' to 'int', possible loss of data (compiling source file F:\jenkins\jenkins-slave\workspace\Mesos-Windows\3rdparty\stout\tests\os\filesystem_tests.cpp) [<https://builds.apache.org/job/Mesos-Windows/ws/build\3rdparty\stout\tests\stout_tests.vcxproj]>
         F:\jenkins\jenkins-slave\workspace\Mesos-Windows\3rdparty\stout\include\stout/os/windows/read.hpp(33): warning C4267: 'argument': conversion from 'size_t' to 'int', possible loss of data (compiling source file F:\jenkins\jenkins-slave\workspace\Mesos-Windows\3rdparty\stout\tests\os\filesystem_tests.cpp) [<https://builds.apache.org/job/Mesos-Windows/ws/build\3rdparty\stout\tests\stout_tests.vcxproj]>
         F:\jenkins\jenkins-slave\workspace\Mesos-Windows\3rdparty\stout\include\stout/os/windows/read.hpp(36): warning C4267: 'argument': conversion from 'size_t' to 'unsigned int', possible loss of data (compiling source file F:\jenkins\jenkins-slave\workspace\Mesos-Windows\3rdparty\stout\tests\os\filesystem_tests.cpp) [<https://builds.apache.org/job/Mesos-Windows/ws/build\3rdparty\stout\tests\stout_tests.vcxproj]>
         F:\jenkins\jenkins-slave\workspace\Mesos-Windows\3rdparty\stout\include\stout/os/windows/close.hpp(51): warning C4800: 'BOOL': forcing value to bool 'true' or 'false' (performance warning) (compiling source file F:\jenkins\jenkins-slave\workspace\Mesos-Windows\3rdparty\stout\tests\os\filesystem_tests.cpp) [<https://builds.apache.org/job/Mesos-Windows/ws/build\3rdparty\stout\tests\stout_tests.vcxproj]>
         F:\jenkins\jenkins-slave\workspace\Mesos-Windows\3rdparty\stout\include\stout/os/windows/write.hpp(34): warning C4267: 'argument': conversion from 'size_t' to 'int', possible loss of data (compiling source file F:\jenkins\jenkins-slave\workspace\Mesos-Windows\3rdparty\stout\tests\os\filesystem_tests.cpp) [<https://builds.apache.org/job/Mesos-Windows/ws/build\3rdparty\stout\tests\stout_tests.vcxproj]>
         F:\jenkins\jenkins-slave\workspace\Mesos-Windows\3rdparty\stout\include\stout/os/windows/write.hpp(37): warning C4267: 'argument': conversion from 'size_t' to 'unsigned int', possible loss of data (compiling source file F:\jenkins\jenkins-slave\workspace\Mesos-Windows\3rdparty\stout\tests\os\filesystem_tests.cpp) [<https://builds.apache.org/job/Mesos-Windows/ws/build\3rdparty\stout\tests\stout_tests.vcxproj]>
         F:\jenkins\jenkins-slave\workspace\Mesos-Windows\3rdparty\stout\tests\os\filesystem_tests.cpp(404): warning C4267: 'argument': conversion from 'size_t' to 'DWORD', possible loss of data [<https://builds.apache.org/job/Mesos-Windows/ws/build\3rdparty\stout\tests\stout_tests.vcxproj]>
         F:\jenkins\jenkins-slave\workspace\Mesos-Windows\3rdparty\stout\tests\os\filesystem_tests.cpp(405): warning C4800: 'BOOL': forcing value to bool 'true' or 'false' (performance warning) [<https://builds.apache.org/job/Mesos-Windows/ws/build\3rdparty\stout\tests\stout_tests.vcxproj]>
         F:\jenkins\jenkins-slave\workspace\Mesos-Windows\3rdparty\stout\tests\os\filesystem_tests.cpp(415): warning C4267: 'argument': conversion from 'size_t' to 'DWORD', possible loss of data [<https://builds.apache.org/job/Mesos-Windows/ws/build\3rdparty\stout\tests\stout_tests.vcxproj]>
         F:\jenkins\jenkins-slave\workspace\Mesos-Windows\3rdparty\stout\include\stout/numify.hpp(53): warning C4146: unary minus operator applied to unsigned type, result still unsigned (compiling source file F:\jenkins\jenkins-slave\workspace\Mesos-Windows\3rdparty\stout\tests\os\filesystem_tests.cpp) [<https://builds.apache.org/job/Mesos-Windows/ws/build\3rdparty\stout\tests\stout_tests.vcxproj]>
         F:\jenkins\jenkins-slave\workspace\Mesos-Windows\3rdparty\stout\include\stout/bytes.hpp(107): warning C4244: '*=': conversion from 'double' to 'uint64_t', possible loss of data (compiling source file F:\jenkins\jenkins-slave\workspace\Mesos-Windows\3rdparty\stout\tests\os\process_tests.cpp) [<https://builds.apache.org/job/Mesos-Windows/ws/build\3rdparty\stout\tests\stout_tests.vcxproj]>
         F:\jenkins\jenkins-slave\workspace\Mesos-Windows\3rdparty\stout\include\stout/bytes.hpp(118): warning C4244: '/=': conversion from 'double' to 'uint64_t', possible loss of data (compiling source file F:\jenkins\jenkins-slave\workspace\Mesos-Windows\3rdparty\stout\tests\os\process_tests.cpp) [<https://builds.apache.org/job/Mesos-Windows/ws/build\3rdparty\stout\tests\stout_tests.vcxproj]>
         F:\jenkins\jenkins-slave\workspace\Mesos-Windows\3rdparty\stout\include\stout/duration.hpp(99): warning C4244: '=': conversion from 'double' to 'long', possible loss of data (compiling source file F:\jenkins\jenkins-slave\workspace\Mesos-Windows\3rdparty\stout\tests\os\process_tests.cpp) [<https://builds.apache.org/job/Mesos-Windows/ws/build\3rdparty\stout\tests\stout_tests.vcxproj]>
         F:\jenkins\jenkins-slave\workspace\Mesos-Windows\3rdparty\stout\include\stout/duration.hpp(100): warning C4244: '=': conversion from 'double' to 'long', possible loss of data (compiling source file F:\jenkins\jenkins-slave\workspace\Mesos-Windows\3rdparty\stout\tests\os\process_tests.cpp) [<https://builds.apache.org/job/Mesos-Windows/ws/build\3rdparty\stout\tests\stout_tests.vcxproj]>
         F:\jenkins\jenkins-slave\workspace\Mesos-Windows\3rdparty\stout\include\stout/os/socket.hpp(34): warning C4244: '=': conversion from 'SOCKET' to 'int', possible loss of data (compiling source file F:\jenkins\jenkins-slave\workspace\Mesos-Windows\3rdparty\stout\tests\os\process_tests.cpp) [<https://builds.apache.org/job/Mesos-Windows/ws/build\3rdparty\stout\tests\stout_tests.vcxproj]>
         F:\jenkins\jenkins-slave\workspace\Mesos-Windows\3rdparty\stout\include\stout/bytes.hpp(107): warning C4244: '*=': conversion from 'double' to 'uint64_t', possible loss of data (compiling source file F:\jenkins\jenkins-slave\workspace\Mesos-Windows\3rdparty\stout\tests\os\rmdir_tests.cpp) [<https://builds.apache.org/job/Mesos-Windows/ws/build\3rdparty\stout\tests\stout_tests.vcxproj]>
         F:\jenkins\jenkins-slave\workspace\Mesos-Windows\3rdparty\stout\include\stout/bytes.hpp(118): warning C4244: '/=': conversion from 'double' to 'uint64_t', possible loss of data (compiling source file F:\jenkins\jenkins-slave\workspace\Mesos-Windows\3rdparty\stout\tests\os\rmdir_tests.cpp) [<https://builds.apache.org/job/Mesos-Windows/ws/build\3rdparty\stout\tests\stout_tests.vcxproj]>
         F:\jenkins\jenkins-slave\workspace\Mesos-Windows\3rdparty\stout\include\stout/os/socket.hpp(34): warning C4244: '=': conversion from 'SOCKET' to 'int', possible loss of data (compiling source file F:\jenkins\jenkins-slave\workspace\Mesos-Windows\3rdparty\stout\tests\os\socket_tests.cpp) [<https://builds.apache.org/job/Mesos-Windows/ws/build\3rdparty\stout\tests\stout_tests.vcxproj]>
         F:\jenkins\jenkins-slave\workspace\Mesos-Windows\3rdparty\stout\include\stout/windows/fs.hpp(72): warning C4244: 'initializing': conversion from 'ULONGLONG' to 'double', possible loss of data (compiling source file F:\jenkins\jenkins-slave\workspace\Mesos-Windows\3rdparty\stout\tests\os\rmdir_tests.cpp) [<https://builds.apache.org/job/Mesos-Windows/ws/build\3rdparty\stout\tests\stout_tests.vcxproj]>
         F:\jenkins\jenkins-slave\workspace\Mesos-Windows\3rdparty\stout\include\stout/duration.hpp(99): warning C4244: '=': conversion from 'double' to 'long', possible loss of data (compiling source file F:\jenkins\jenkins-slave\workspace\Mesos-Windows\3rdparty\stout\tests\os\rmdir_tests.cpp) [<https://builds.apache.org/job/Mesos-Windows/ws/build\3rdparty\stout\tests\stout_tests.vcxproj]>
         F:\jenkins\jenkins-slave\workspace\Mesos-Windows\3rdparty\stout\include\stout/duration.hpp(100): warning C4244: '=': conversion from 'double' to 'long', possible loss of data (compiling source file F:\jenkins\jenkins-slave\workspace\Mesos-Windows\3rdparty\stout\tests\os\rmdir_tests.cpp) [<https://builds.apache.org/job/Mesos-Windows/ws/build\3rdparty\stout\tests\stout_tests.vcxproj]>
         F:\jenkins\jenkins-slave\workspace\Mesos-Windows\3rdparty\stout\include\stout/os/getcwd.hpp(31): warning C4267: 'argument': conversion from 'size_t' to 'int', possible loss of data (compiling source file F:\jenkins\jenkins-slave\workspace\Mesos-Windows\3rdparty\stout\tests\os\socket_tests.cpp) [<https://builds.apache.org/job/Mesos-Windows/ws/build\3rdparty\stout\tests\stout_tests.vcxproj]>
         F:\jenkins\jenkins-slave\workspace\Mesos-Windows\3rdparty\stout\include\stout/os/socket.hpp(34): warning C4244: '=': conversion from 'SOCKET' to 'int', possible loss of data (compiling source file F:\jenkins\jenkins-slave\workspace\Mesos-Windows\3rdparty\stout\tests\os\rmdir_tests.cpp) [<https://builds.apache.org/job/Mesos-Windows/ws/build\3rdparty\stout\tests\stout_tests.vcxproj]>
         F:\jenkins\jenkins-slave\workspace\Mesos-Windows\3rdparty\stout\include\stout/bytes.hpp(107): warning C4244: '*=': conversion from 'double' to 'uint64_t', possible loss of data (compiling source file F:\jenkins\jenkins-slave\workspace\Mesos-Windows\3rdparty\stout\tests\os\socket_tests.cpp) [<https://builds.apache.org/job/Mesos-Windows/ws/build\3rdparty\stout\tests\stout_tests.vcxproj]>
         F:\jenkins\jenkins-slave\workspace\Mesos-Windows\3rdparty\stout\include\stout/bytes.hpp(118): warning C4244: '/=': conversion from 'double' to 'uint64_t', possible loss of data (compiling source file F:\jenkins\jenkins-slave\workspace\Mesos-Windows\3rdparty\stout\tests\os\socket_tests.cpp) [<https://builds.apache.org/job/Mesos-Windows/ws/build\3rdparty\stout\tests\stout_tests.vcxproj]>
         F:\jenkins\jenkins-slave\workspace\Mesos-Windows\3rdparty\stout\include\stout/numify.hpp(53): warning C4146: unary minus operator applied to unsigned type, result still unsigned (compiling source file F:\jenkins\jenkins-slave\workspace\Mesos-Windows\3rdparty\stout\tests\os\socket_tests.cpp) [<https://builds.apache.org/job/Mesos-Windows/ws/build\3rdparty\stout\tests\stout_tests.vcxproj]>
         F:\jenkins\jenkins-slave\workspace\Mesos-Windows\3rdparty\stout\include\stout/bytes.hpp(107): warning C4244: '*=': conversion from 'double' to 'uint64_t', possible loss of data (compiling source file F:\jenkins\jenkins-slave\workspace\Mesos-Windows\3rdparty\stout\tests\os\strerror_tests.cpp) [<https://builds.apache.org/job/Mesos-Windows/ws/build\3rdparty\stout\tests\stout_tests.vcxproj]>
         F:\jenkins\jenkins-slave\workspace\Mesos-Windows\3rdparty\stout\include\stout/bytes.hpp(118): warning C4244: '/=': conversion from 'double' to 'uint64_t', possible loss of data (compiling source file F:\jenkins\jenkins-slave\workspace\Mesos-Windows\3rdparty\stout\tests\os\strerror_tests.cpp) [<https://builds.apache.org/job/Mesos-Windows/ws/build\3rdparty\stout\tests\stout_tests.vcxproj]>
         F:\jenkins\jenkins-slave\workspace\Mesos-Windows\3rdparty\stout\include\stout/duration.hpp(99): warning C4244: '=': conversion from 'double' to 'long', possible loss of data (compiling source file F:\jenkins\jenkins-slave\workspace\Mesos-Windows\3rdparty\stout\tests\os\strerror_tests.cpp) [<https://builds.apache.org/job/Mesos-Windows/ws/build\3rdparty\stout\tests\stout_tests.vcxproj]>
         F:\jenkins\jenkins-slave\workspace\Mesos-Windows\3rdparty\stout\include\stout/duration.hpp(100): warning C4244: '=': conversion from 'double' to 'long', possible loss of data (compiling source file F:\jenkins\jenkins-slave\workspace\Mesos-Windows\3rdparty\stout\tests\os\strerror_tests.cpp) [<https://builds.apache.org/job/Mesos-Windows/ws/build\3rdparty\stout\tests\stout_tests.vcxproj]>
         F:\jenkins\jenkins-slave\workspace\Mesos-Windows\3rdparty\stout\include\stout/os/socket.hpp(34): warning C4244: '=': conversion from 'SOCKET' to 'int', possible loss of data (compiling source file F:\jenkins\jenkins-slave\workspace\Mesos-Windows\3rdparty\stout\tests\os\strerror_tests.cpp) [<https://builds.apache.org/job/Mesos-Windows/ws/build\3rdparty\stout\tests\stout_tests.vcxproj]>
         F:\jenkins\jenkins-slave\workspace\Mesos-Windows\3rdparty\stout\include\stout/bytes.hpp(107): warning C4244: '*=': conversion from 'double' to 'uint64_t', possible loss of data (compiling source file F:\jenkins\jenkins-slave\workspace\Mesos-Windows\3rdparty\stout\tests\os\systems_tests.cpp) [<https://builds.apache.org/job/Mesos-Windows/ws/build\3rdparty\stout\tests\stout_tests.vcxproj]>
         F:\jenkins\jenkins-slave\workspace\Mesos-Windows\3rdparty\stout\include\stout/bytes.hpp(118): warning C4244: '/=': conversion from 'double' to 'uint64_t', possible loss of data (compiling source file F:\jenkins\jenkins-slave\workspace\Mesos-Windows\3rdparty\stout\tests\os\systems_tests.cpp) [<https://builds.apache.org/job/Mesos-Windows/ws/build\3rdparty\stout\tests\stout_tests.vcxproj]>
         F:\jenkins\jenkins-slave\workspace\Mesos-Windows\3rdparty\stout\include\stout/duration.hpp(99): warning C4244: '=': conversion from 'double' to 'long', possible loss of data (compiling source file F:\jenkins\jenkins-slave\workspace\Mesos-Windows\3rdparty\stout\tests\os\systems_tests.cpp) [<https://builds.apache.org/job/Mesos-Windows/ws/build\3rdparty\stout\tests\stout_tests.vcxproj]>
         F:\jenkins\jenkins-slave\workspace\Mesos-Windows\3rdparty\stout\include\stout/duration.hpp(100): warning C4244: '=': conversion from 'double' to 'long', possible loss of data (compiling source file F:\jenkins\jenkins-slave\workspace\Mesos-Windows\3rdparty\stout\tests\os\systems_tests.cpp) [<https://builds.apache.org/job/Mesos-Windows/ws/build\3rdparty\stout\tests\stout_tests.vcxproj]>
         F:\jenkins\jenkins-slave\workspace\Mesos-Windows\3rdparty\stout\include\stout/os/socket.hpp(34): warning C4244: '=': conversion from 'SOCKET' to 'int', possible loss of data (compiling source file F:\jenkins\jenkins-slave\workspace\Mesos-Windows\3rdparty\stout\tests\os\systems_tests.cpp) [<https://builds.apache.org/job/Mesos-Windows/ws/build\3rdparty\stout\tests\stout_tests.vcxproj]>


       "<https://builds.apache.org/job/Mesos-Windows/ws/build\Mesos.sln"> (stout_tests target) (1) ->
       "<https://builds.apache.org/job/Mesos-Windows/ws/build\3rdparty\stout\tests\stout_tests.vcxproj.metaproj"> (default target) (2) ->
       "<https://builds.apache.org/job/Mesos-Windows/ws/build\3rdparty\stout\tests\stout_tests.vcxproj"> (default target) (22) ->
       (ClCompile target) -> 
         F:\jenkins\jenkins-slave\workspace\Mesos-Windows\3rdparty\stout\include\stout/os/windows/kill.hpp(16): fatal error C1083: Cannot open include file: 'logging/logging.hpp': No such file or directory (compiling source file F:\jenkins\jenkins-slave\workspace\Mesos-Windows\3rdparty\stout\tests\os\env_tests.cpp) [<https://builds.apache.org/job/Mesos-Windows/ws/build\3rdparty\stout\tests\stout_tests.vcxproj]>
         F:\jenkins\jenkins-slave\workspace\Mesos-Windows\3rdparty\stout\include\stout/os/windows/kill.hpp(16): fatal error C1083: Cannot open include file: 'logging/logging.hpp': No such file or directory (compiling source file F:\jenkins\jenkins-slave\workspace\Mesos-Windows\3rdparty\stout\tests\os\process_tests.cpp) [<https://builds.apache.org/job/Mesos-Windows/ws/build\3rdparty\stout\tests\stout_tests.vcxproj]>
         F:\jenkins\jenkins-slave\workspace\Mesos-Windows\3rdparty\stout\include\stout/os/windows/kill.hpp(16): fatal error C1083: Cannot open include file: 'logging/logging.hpp': No such file or directory (compiling source file F:\jenkins\jenkins-slave\workspace\Mesos-Windows\3rdparty\stout\tests\os\rmdir_tests.cpp) [<https://builds.apache.org/job/Mesos-Windows/ws/build\3rdparty\stout\tests\stout_tests.vcxproj]>
         F:\jenkins\jenkins-slave\workspace\Mesos-Windows\3rdparty\stout\include\stout/os/windows/kill.hpp(16): fatal error C1083: Cannot open include file: 'logging/logging.hpp': No such file or directory (compiling source file F:\jenkins\jenkins-slave\workspace\Mesos-Windows\3rdparty\stout\tests\os\strerror_tests.cpp) [<https://builds.apache.org/job/Mesos-Windows/ws/build\3rdparty\stout\tests\stout_tests.vcxproj]>
         F:\jenkins\jenkins-slave\workspace\Mesos-Windows\3rdparty\stout\include\stout/os/windows/kill.hpp(16): fatal error C1083: Cannot open include file: 'logging/logging.hpp': No such file or directory (compiling source file F:\jenkins\jenkins-slave\workspace\Mesos-Windows\3rdparty\stout\tests\os\systems_tests.cpp) [<https://builds.apache.org/job/Mesos-Windows/ws/build\3rdparty\stout\tests\stout_tests.vcxproj]>

    164 Warning(s)
    5 Error(s)

Time Elapsed 00:05:45.68

<https://builds.apache.org/job/Mesos-Windows/ws/build>if> 1 NEQ 0 exit /b 1 
Build step 'Execute Windows batch command' marked build as failure

Mime
View raw message