mesos-builds mailing list archives

Site index · List index
Message view « Date » · « Thread »
Top « Date » · « Thread »
From Apache Jenkins Server <jenk...@builds.apache.org>
Subject Build failed in Jenkins: mesos-reviewbot #15471
Date Fri, 30 Sep 2016 20:01:59 GMT
See <https://builds.apache.org/job/mesos-reviewbot/15471/>

------------------------------------------
[...truncated 209712 lines...]
[ RUN      ] Endpoint/SlaveEndpointTest.AuthorizedRequest/1
I0930 20:01:49.505771 29096 containerizer.cpp:226] Using isolation: posix/cpu,posix/mem,filesystem/posix,network/cni
W0930 20:01:49.506469 29096 backend.cpp:75] Failed to create 'aufs' backend: AufsBackend requires
root privileges, but is running as user mesos
W0930 20:01:49.506649 29096 backend.cpp:75] Failed to create 'bind' backend: BindBackend requires
root privileges
I0930 20:01:49.510166 29120 slave.cpp:208] Mesos agent started on (607)@172.17.0.2:55430
I0930 20:01:49.510196 29120 slave.cpp:209] Flags at startup: --acls="" --appc_simple_discovery_uri_prefix="http://"
--appc_store_dir="/tmp/mesos/store/appc" --authenticate_http_readonly="true" --authenticate_http_readwrite="true"
--authenticatee="crammd5" --authentication_backoff_factor="1secs" --authorizer="local" --cgroups_cpu_enable_pids_and_tids_count="false"
--cgroups_enable_cfs="false" --cgroups_hierarchy="/sys/fs/cgroup" --cgroups_limit_swap="false"
--cgroups_root="mesos" --container_disk_watch_interval="15secs" --containerizers="mesos" --credential="/tmp/Endpoint_SlaveEndpointTest_AuthorizedRequest_1_8thRXM/credential"
--default_role="*" --disk_watch_interval="1mins" --docker="docker" --docker_kill_orphans="true"
--docker_registry="https://registry-1.docker.io" --docker_remove_delay="6hrs" --docker_socket="/var/run/docker.sock"
--docker_stop_timeout="0ns" --docker_store_dir="/tmp/mesos/store/docker" --docker_volume_checkpoint_dir="/var/run/mesos/isolators/docker/volume"
--enforce_container_disk_quota="false" --executor_registration_timeout="1mins" --executor_shutdown_grace_period="5secs"
--fetcher_cache_dir="/tmp/Endpoint_SlaveEndpointTest_AuthorizedRequest_1_8thRXM/fetch" --fetcher_cache_size="2GB"
--frameworks_home="" --gc_delay="1weeks" --gc_disk_headroom="0.1" --hadoop_home="" --help="true"
--hostname_lookup="true" --http_authenticators="basic" --http_command_executor="false" --http_credentials="/tmp/Endpoint_SlaveEndpointTest_AuthorizedRequest_1_8thRXM/http_credentials"
--image_provisioner_backend="copy" --initialize_driver_logging="true" --isolation="posix/cpu,posix/mem"
--launcher="posix" --launcher_dir="/mesos/mesos-1.1.0/_build/src" --logbufsecs="0" --logging_level="INFO"
--oversubscribed_resources_interval="15secs" --perf_duration="10secs" --perf_interval="1mins"
--qos_correction_interval_min="0ns" --quiet="false" --recover="reconnect" --recovery_timeout="15mins"
--registration_backoff_factor="10ms" --resources="cpus:2;gpus:0;mem:1024;disk:1024;ports:[31000-32000]"
--revocable_cpu_low_priority="true" --runtime_dir="/tmp/Endpoint_SlaveEndpointTest_AuthorizedRequest_1_8thRXM"
--sandbox_directory="/mnt/mesos/sandbox" --strict="true" --switch_user="true" --systemd_enable_support="true"
--systemd_runtime_directory="/run/systemd/system" --version="false" --work_dir="/tmp/Endpoint_SlaveEndpointTest_AuthorizedRequest_1_CP3Yvk"
I0930 20:01:49.510962 29120 credentials.hpp:86] Loading credential for authentication from
'/tmp/Endpoint_SlaveEndpointTest_AuthorizedRequest_1_8thRXM/credential'
I0930 20:01:49.511189 29120 slave.cpp:346] Agent using credential for: test-principal
I0930 20:01:49.511222 29120 credentials.hpp:37] Loading credentials for authentication from
'/tmp/Endpoint_SlaveEndpointTest_AuthorizedRequest_1_8thRXM/http_credentials'
I0930 20:01:49.511564 29120 http.cpp:883] Using default 'basic' HTTP authenticator for realm
'mesos-agent-readonly'
I0930 20:01:49.511716 29120 http.cpp:883] Using default 'basic' HTTP authenticator for realm
'mesos-agent-readwrite'
I0930 20:01:49.513130 29120 slave.cpp:533] Agent resources: cpus(*):2; mem(*):1024; disk(*):1024;
ports(*):[31000-32000]
I0930 20:01:49.513231 29120 slave.cpp:541] Agent attributes: [  ]
I0930 20:01:49.513257 29120 slave.cpp:546] Agent hostname: 9c819b452782
I0930 20:01:49.514833 29122 state.cpp:57] Recovering state from '/tmp/Endpoint_SlaveEndpointTest_AuthorizedRequest_1_CP3Yvk/meta'
I0930 20:01:49.514910 29120 process.cpp:3377] Handling HTTP event for process 'slave(607)'
with path: '/slave(607)/monitor/statistics.json'
I0930 20:01:49.515468 29123 status_update_manager.cpp:203] Recovering status update manager
I0930 20:01:49.515723 29127 containerizer.cpp:580] Recovering containerizer
I0930 20:01:49.515858 29121 http.cpp:835] Authorizing principal 'test-principal' to GET the
'/monitor/statistics.json' endpoint
I0930 20:01:49.517436 29117 provisioner.cpp:253] Provisioner recovery complete
I0930 20:01:49.518066 29115 slave.cpp:5256] Finished recovery
I0930 20:01:49.518569 29115 slave.cpp:5428] Querying resource estimator for oversubscribable
resources
I0930 20:01:49.518776 29125 slave.cpp:5442] Received oversubscribable resources {} from the
resource estimator
I0930 20:01:49.521131 29123 slave.cpp:787] Agent terminating
[       OK ] Endpoint/SlaveEndpointTest.AuthorizedRequest/1 (25 ms)
[ RUN      ] Endpoint/SlaveEndpointTest.AuthorizedRequest/2
I0930 20:01:49.534903 29096 containerizer.cpp:226] Using isolation: posix/cpu,posix/mem,filesystem/posix,network/cni
W0930 20:01:49.535650 29096 backend.cpp:75] Failed to create 'aufs' backend: AufsBackend requires
root privileges, but is running as user mesos
W0930 20:01:49.535825 29096 backend.cpp:75] Failed to create 'bind' backend: BindBackend requires
root privileges
I0930 20:01:49.539360 29115 slave.cpp:208] Mesos agent started on (608)@172.17.0.2:55430
I0930 20:01:49.539386 29115 slave.cpp:209] Flags at startup: --acls="" --appc_simple_discovery_uri_prefix="http://"
--appc_store_dir="/tmp/mesos/store/appc" --authenticate_http_readonly="true" --authenticate_http_readwrite="true"
--authenticatee="crammd5" --authentication_backoff_factor="1secs" --authorizer="local" --cgroups_cpu_enable_pids_and_tids_count="false"
--cgroups_enable_cfs="false" --cgroups_hierarchy="/sys/fs/cgroup" --cgroups_limit_swap="false"
--cgroups_root="mesos" --container_disk_watch_interval="15secs" --containerizers="mesos" --credential="/tmp/Endpoint_SlaveEndpointTest_AuthorizedRequest_2_6bMH1C/credential"
--default_role="*" --disk_watch_interval="1mins" --docker="docker" --docker_kill_orphans="true"
--docker_registry="https://registry-1.docker.io" --docker_remove_delay="6hrs" --docker_socket="/var/run/docker.sock"
--docker_stop_timeout="0ns" --docker_store_dir="/tmp/mesos/store/docker" --docker_volume_checkpoint_dir="/var/run/mesos/isolators/docker/volume"
--enforce_container_disk_quota="false" --executor_registration_timeout="1mins" --executor_shutdown_grace_period="5secs"
--fetcher_cache_dir="/tmp/Endpoint_SlaveEndpointTest_AuthorizedRequest_2_6bMH1C/fetch" --fetcher_cache_size="2GB"
--frameworks_home="" --gc_delay="1weeks" --gc_disk_headroom="0.1" --hadoop_home="" --help="true"
--hostname_lookup="true" --http_authenticators="basic" --http_command_executor="false" --http_credentials="/tmp/Endpoint_SlaveEndpointTest_AuthorizedRequest_2_6bMH1C/http_credentials"
--image_provisioner_backend="copy" --initialize_driver_logging="true" --isolation="posix/cpu,posix/mem"
--launcher="posix" --launcher_dir="/mesos/mesos-1.1.0/_build/src" --logbufsecs="0" --logging_level="INFO"
--oversubscribed_resources_interval="15secs" --perf_duration="10secs" --perf_interval="1mins"
--qos_correction_interval_min="0ns" --quiet="false" --recover="reconnect" --recovery_timeout="15mins"
--registration_backoff_factor="10ms" --resources="cpus:2;gpus:0;mem:1024;disk:1024;ports:[31000-32000]"
--revocable_cpu_low_priority="true" --runtime_dir="/tmp/Endpoint_SlaveEndpointTest_AuthorizedRequest_2_6bMH1C"
--sandbox_directory="/mnt/mesos/sandbox" --strict="true" --switch_user="true" --systemd_enable_support="true"
--systemd_runtime_directory="/run/systemd/system" --version="false" --work_dir="/tmp/Endpoint_SlaveEndpointTest_AuthorizedRequest_2_eNz5ua"
I0930 20:01:49.539966 29115 credentials.hpp:86] Loading credential for authentication from
'/tmp/Endpoint_SlaveEndpointTest_AuthorizedRequest_2_6bMH1C/credential'
I0930 20:01:49.540135 29115 slave.cpp:346] Agent using credential for: test-principal
I0930 20:01:49.540158 29115 credentials.hpp:37] Loading credentials for authentication from
'/tmp/Endpoint_SlaveEndpointTest_AuthorizedRequest_2_6bMH1C/http_credentials'
I0930 20:01:49.540489 29115 http.cpp:883] Using default 'basic' HTTP authenticator for realm
'mesos-agent-readonly'
I0930 20:01:49.540647 29115 http.cpp:883] Using default 'basic' HTTP authenticator for realm
'mesos-agent-readwrite'
I0930 20:01:49.541731 29115 slave.cpp:533] Agent resources: cpus(*):2; mem(*):1024; disk(*):1024;
ports(*):[31000-32000]
I0930 20:01:49.541826 29115 slave.cpp:541] Agent attributes: [  ]
I0930 20:01:49.541839 29115 slave.cpp:546] Agent hostname: 9c819b452782
I0930 20:01:49.543375 29119 state.cpp:57] Recovering state from '/tmp/Endpoint_SlaveEndpointTest_AuthorizedRequest_2_eNz5ua/meta'
I0930 20:01:49.543421 29115 process.cpp:3377] Handling HTTP event for process 'slave(608)'
with path: '/slave(608)/containers'
I0930 20:01:49.544685 29118 status_update_manager.cpp:203] Recovering status update manager
I0930 20:01:49.545116 29124 containerizer.cpp:580] Recovering containerizer
I0930 20:01:49.545543 29116 http.cpp:835] Authorizing principal 'test-principal' to GET the
'/containers' endpoint
I0930 20:01:49.546717 29130 provisioner.cpp:253] Provisioner recovery complete
I0930 20:01:49.547117 29128 slave.cpp:5256] Finished recovery
I0930 20:01:49.547588 29128 slave.cpp:5428] Querying resource estimator for oversubscribable
resources
I0930 20:01:49.547958 29118 slave.cpp:5442] Received oversubscribable resources {} from the
resource estimator
I0930 20:01:49.549486 29128 slave.cpp:787] Agent terminating
[       OK ] Endpoint/SlaveEndpointTest.AuthorizedRequest/2 (25 ms)
[ RUN      ] Endpoint/SlaveEndpointTest.UnauthorizedRequest/0
I0930 20:01:49.564417 29096 containerizer.cpp:226] Using isolation: posix/cpu,posix/mem,filesystem/posix,network/cni
W0930 20:01:49.564929 29096 backend.cpp:75] Failed to create 'aufs' backend: AufsBackend requires
root privileges, but is running as user mesos
W0930 20:01:49.565068 29096 backend.cpp:75] Failed to create 'bind' backend: BindBackend requires
root privileges
I0930 20:01:49.567476 29128 slave.cpp:208] Mesos agent started on (609)@172.17.0.2:55430
I0930 20:01:49.567497 29128 slave.cpp:209] Flags at startup: --acls="" --appc_simple_discovery_uri_prefix="http://"
--appc_store_dir="/tmp/mesos/store/appc" --authenticate_http_readonly="true" --authenticate_http_readwrite="true"
--authenticatee="crammd5" --authentication_backoff_factor="1secs" --authorizer="local" --cgroups_cpu_enable_pids_and_tids_count="false"
--cgroups_enable_cfs="false" --cgroups_hierarchy="/sys/fs/cgroup" --cgroups_limit_swap="false"
--cgroups_root="mesos" --container_disk_watch_interval="15secs" --containerizers="mesos" --credential="/tmp/Endpoint_SlaveEndpointTest_UnauthorizedRequest_0_gPotot/credential"
--default_role="*" --disk_watch_interval="1mins" --docker="docker" --docker_kill_orphans="true"
--docker_registry="https://registry-1.docker.io" --docker_remove_delay="6hrs" --docker_socket="/var/run/docker.sock"
--docker_stop_timeout="0ns" --docker_store_dir="/tmp/mesos/store/docker" --docker_volume_checkpoint_dir="/var/run/mesos/isolators/docker/volume"
--enforce_container_disk_quota="false" --executor_registration_timeout="1mins" --executor_shutdown_grace_period="5secs"
--fetcher_cache_dir="/tmp/Endpoint_SlaveEndpointTest_UnauthorizedRequest_0_gPotot/fetch" --fetcher_cache_size="2GB"
--frameworks_home="" --gc_delay="1weeks" --gc_disk_headroom="0.1" --hadoop_home="" --help="true"
--hostname_lookup="true" --http_authenticators="basic" --http_command_executor="false" --http_credentials="/tmp/Endpoint_SlaveEndpointTest_UnauthorizedRequest_0_gPotot/http_credentials"
--image_provisioner_backend="copy" --initialize_driver_logging="true" --isolation="posix/cpu,posix/mem"
--launcher="posix" --launcher_dir="/mesos/mesos-1.1.0/_build/src" --logbufsecs="0" --logging_level="INFO"
--oversubscribed_resources_interval="15secs" --perf_duration="10secs" --perf_interval="1mins"
--qos_correction_interval_min="0ns" --quiet="false" --recover="reconnect" --recovery_timeout="15mins"
--registration_backoff_factor="10ms" --resources="cpus:2;gpus:0;mem:1024;disk:1024;ports:[31000-32000]"
--revocable_cpu_low_priority="true" --runtime_dir="/tmp/Endpoint_SlaveEndpointTest_UnauthorizedRequest_0_gPotot"
--sandbox_directory="/mnt/mesos/sandbox" --strict="true" --switch_user="true" --systemd_enable_support="true"
--systemd_runtime_directory="/run/systemd/system" --version="false" --work_dir="/tmp/Endpoint_SlaveEndpointTest_UnauthorizedRequest_0_mVH7M0"
I0930 20:01:49.567893 29128 credentials.hpp:86] Loading credential for authentication from
'/tmp/Endpoint_SlaveEndpointTest_UnauthorizedRequest_0_gPotot/credential'
I0930 20:01:49.568030 29128 slave.cpp:346] Agent using credential for: test-principal
I0930 20:01:49.568055 29128 credentials.hpp:37] Loading credentials for authentication from
'/tmp/Endpoint_SlaveEndpointTest_UnauthorizedRequest_0_gPotot/http_credentials'
I0930 20:01:49.568331 29128 http.cpp:883] Using default 'basic' HTTP authenticator for realm
'mesos-agent-readonly'
I0930 20:01:49.568444 29128 http.cpp:883] Using default 'basic' HTTP authenticator for realm
'mesos-agent-readwrite'
I0930 20:01:49.569339 29128 slave.cpp:533] Agent resources: cpus(*):2; mem(*):1024; disk(*):1024;
ports(*):[31000-32000]
I0930 20:01:49.569406 29128 slave.cpp:541] Agent attributes: [  ]
I0930 20:01:49.569417 29128 slave.cpp:546] Agent hostname: 9c819b452782
I0930 20:01:49.570767 29115 state.cpp:57] Recovering state from '/tmp/Endpoint_SlaveEndpointTest_UnauthorizedRequest_0_mVH7M0/meta'
I0930 20:01:49.570806 29128 process.cpp:3377] Handling HTTP event for process 'slave(609)'
with path: '/slave(609)/monitor/statistics'
I0930 20:01:49.571172 29127 status_update_manager.cpp:203] Recovering status update manager
I0930 20:01:49.571313 29116 containerizer.cpp:580] Recovering containerizer
I0930 20:01:49.571586 29123 http.cpp:835] Authorizing principal 'test-principal' to GET the
'/monitor/statistics' endpoint
I0930 20:01:49.572829 29120 provisioner.cpp:253] Provisioner recovery complete
I0930 20:01:49.573078 29124 slave.cpp:5256] Finished recovery
I0930 20:01:49.573433 29124 slave.cpp:5428] Querying resource estimator for oversubscribable
resources
I0930 20:01:49.573601 29120 slave.cpp:5442] Received oversubscribable resources {} from the
resource estimator
I0930 20:01:49.574055 29122 slave.cpp:787] Agent terminating
[       OK ] Endpoint/SlaveEndpointTest.UnauthorizedRequest/0 (18 ms)
[ RUN      ] Endpoint/SlaveEndpointTest.UnauthorizedRequest/1
I0930 20:01:49.584906 29096 containerizer.cpp:226] Using isolation: posix/cpu,posix/mem,filesystem/posix,network/cni
W0930 20:01:49.585611 29096 backend.cpp:75] Failed to create 'aufs' backend: AufsBackend requires
root privileges, but is running as user mesos
W0930 20:01:49.585790 29096 backend.cpp:75] Failed to create 'bind' backend: BindBackend requires
root privileges
I0930 20:01:49.588974 29118 slave.cpp:208] Mesos agent started on (610)@172.17.0.2:55430
I0930 20:01:49.589025 29118 slave.cpp:209] Flags at startup: --acls="" --appc_simple_discovery_uri_prefix="http://"
--appc_store_dir="/tmp/mesos/store/appc" --authenticate_http_readonly="true" --authenticate_http_readwrite="true"
--authenticatee="crammd5" --authentication_backoff_factor="1secs" --authorizer="local" --cgroups_cpu_enable_pids_and_tids_count="false"
--cgroups_enable_cfs="false" --cgroups_hierarchy="/sys/fs/cgroup" --cgroups_limit_swap="false"
--cgroups_root="mesos" --container_disk_watch_interval="15secs" --containerizers="mesos" --credential="/tmp/Endpoint_SlaveEndpointTest_UnauthorizedRequest_1_0WABZj/credential"
--default_role="*" --disk_watch_interval="1mins" --docker="docker" --docker_kill_orphans="true"
--docker_registry="https://registry-1.docker.io" --docker_remove_delay="6hrs" --docker_socket="/var/run/docker.sock"
--docker_stop_timeout="0ns" --docker_store_dir="/tmp/mesos/store/docker" --docker_volume_checkpoint_dir="/var/run/mesos/isolators/docker/volume"
--enforce_container_disk_quota="false" --executor_registration_timeout="1mins" --executor_shutdown_grace_period="5secs"
--fetcher_cache_dir="/tmp/Endpoint_SlaveEndpointTest_UnauthorizedRequest_1_0WABZj/fetch" --fetcher_cache_size="2GB"
--frameworks_home="" --gc_delay="1weeks" --gc_disk_headroom="0.1" --hadoop_home="" --help="true"
--hostname_lookup="true" --http_authenticators="basic" --http_command_executor="false" --http_credentials="/tmp/Endpoint_SlaveEndpointTest_UnauthorizedRequest_1_0WABZj/http_credentials"
--image_provisioner_backend="copy" --initialize_driver_logging="true" --isolation="posix/cpu,posix/mem"
--launcher="posix" --launcher_dir="/mesos/mesos-1.1.0/_build/src" --logbufsecs="0" --logging_level="INFO"
--oversubscribed_resources_interval="15secs" --perf_duration="10secs" --perf_interval="1mins"
--qos_correction_interval_min="0ns" --quiet="false" --recover="reconnect" --recovery_timeout="15mins"
--registration_backoff_factor="10ms" --resources="cpus:2;gpus:0;mem:1024;disk:1024;ports:[31000-32000]"
--revocable_cpu_low_priority="true" --runtime_dir="/tmp/Endpoint_SlaveEndpointTest_UnauthorizedRequest_1_0WABZj"
--sandbox_directory="/mnt/mesos/sandbox" --strict="true" --switch_user="true" --systemd_enable_support="true"
--systemd_runtime_directory="/run/systemd/system" --version="false" --work_dir="/tmp/Endpoint_SlaveEndpointTest_UnauthorizedRequest_1_SLrSkR"
I0930 20:01:49.589618 29118 credentials.hpp:86] Loading credential for authentication from
'/tmp/Endpoint_SlaveEndpointTest_UnauthorizedRequest_1_0WABZj/credential'
I0930 20:01:49.589777 29118 slave.cpp:346] Agent using credential for: test-principal
I0930 20:01:49.589807 29118 credentials.hpp:37] Loading credentials for authentication from
'/tmp/Endpoint_SlaveEndpointTest_UnauthorizedRequest_1_0WABZj/http_credentials'
I0930 20:01:49.590091 29118 http.cpp:883] Using default 'basic' HTTP authenticator for realm
'mesos-agent-readonly'
I0930 20:01:49.590234 29118 http.cpp:883] Using default 'basic' HTTP authenticator for realm
'mesos-agent-readwrite'
I0930 20:01:49.591315 29118 slave.cpp:533] Agent resources: cpus(*):2; mem(*):1024; disk(*):1024;
ports(*):[31000-32000]
I0930 20:01:49.591418 29118 slave.cpp:541] Agent attributes: [  ]
I0930 20:01:49.591442 29118 slave.cpp:546] Agent hostname: 9c819b452782
I0930 20:01:49.592981 29127 state.cpp:57] Recovering state from '/tmp/Endpoint_SlaveEndpointTest_UnauthorizedRequest_1_SLrSkR/meta'
I0930 20:01:49.593065 29118 process.cpp:3377] Handling HTTP event for process 'slave(610)'
with path: '/slave(610)/monitor/statistics.json'
I0930 20:01:49.593578 29122 status_update_manager.cpp:203] Recovering status update manager
I0930 20:01:49.593698 29122 containerizer.cpp:580] Recovering containerizer
I0930 20:01:49.594133 29119 http.cpp:835] Authorizing principal 'test-principal' to GET the
'/monitor/statistics.json' endpoint
I0930 20:01:49.595110 29117 provisioner.cpp:253] Provisioner recovery complete
I0930 20:01:49.595695 29120 slave.cpp:5256] Finished recovery
I0930 20:01:49.596143 29120 slave.cpp:5428] Querying resource estimator for oversubscribable
resources
I0930 20:01:49.596269 29120 slave.cpp:787] Agent terminating
[       OK ] Endpoint/SlaveEndpointTest.UnauthorizedRequest/1 (19 ms)
[ RUN      ] Endpoint/SlaveEndpointTest.UnauthorizedRequest/2
I0930 20:01:49.607856 29096 containerizer.cpp:226] Using isolation: posix/cpu,posix/mem,filesystem/posix,network/cni
W0930 20:01:49.608424 29096 backend.cpp:75] Failed to create 'aufs' backend: AufsBackend requires
root privileges, but is running as user mesos
W0930 20:01:49.608602 29096 backend.cpp:75] Failed to create 'bind' backend: BindBackend requires
root privileges
I0930 20:01:49.611008 29129 slave.cpp:208] Mesos agent started on (611)@172.17.0.2:55430
I0930 20:01:49.611039 29129 slave.cpp:209] Flags at startup: --acls="" --appc_simple_discovery_uri_prefix="http://"
--appc_store_dir="/tmp/mesos/store/appc" --authenticate_http_readonly="true" --authenticate_http_readwrite="true"
--authenticatee="crammd5" --authentication_backoff_factor="1secs" --authorizer="local" --cgroups_cpu_enable_pids_and_tids_count="false"
--cgroups_enable_cfs="false" --cgroups_hierarchy="/sys/fs/cgroup" --cgroups_limit_swap="false"
--cgroups_root="mesos" --container_disk_watch_interval="15secs" --containerizers="mesos" --credential="/tmp/Endpoint_SlaveEndpointTest_UnauthorizedRequest_2_QDqzPa/credential"
--default_role="*" --disk_watch_interval="1mins" --docker="docker" --docker_kill_orphans="true"
--docker_registry="https://registry-1.docker.io" --docker_remove_delay="6hrs" --docker_socket="/var/run/docker.sock"
--docker_stop_timeout="0ns" --docker_store_dir="/tmp/mesos/store/docker" --docker_volume_checkpoint_dir="/var/run/mesos/isolators/docker/volume"
--enforce_container_disk_quota="false" --executor_registration_timeout="1mins" --executor_shutdown_grace_period="5secs"
--fetcher_cache_dir="/tmp/Endpoint_SlaveEndpointTest_UnauthorizedRequest_2_QDqzPa/fetch" --fetcher_cache_size="2GB"
--frameworks_home="" --gc_delay="1weeks" --gc_disk_headroom="0.1" --hadoop_home="" --help="true"
--hostname_lookup="true" --http_authenticators="basic" --http_command_executor="false" --http_credentials="/tmp/Endpoint_SlaveEndpointTest_UnauthorizedRequest_2_QDqzPa/http_credentials"
--image_provisioner_backend="copy" --initialize_driver_logging="true" --isolation="posix/cpu,posix/mem"
--launcher="posix" --launcher_dir="/mesos/mesos-1.1.0/_build/src" --logbufsecs="0" --logging_level="INFO"
--oversubscribed_resources_interval="15secs" --perf_duration="10secs" --perf_interval="1mins"
--qos_correction_interval_min="0ns" --quiet="false" --recover="reconnect" --recovery_timeout="15mins"
--registration_backoff_factor="10ms" --resources="cpus:2;gpus:0;mem:1024;disk:1024;ports:[31000-32000]"
--revocable_cpu_low_priority="true" --runtime_dir="/tmp/Endpoint_SlaveEndpointTest_UnauthorizedRequest_2_QDqzPa"
--sandbox_directory="/mnt/mesos/sandbox" --strict="true" --switch_user="true" --systemd_enable_support="true"
--systemd_runtime_directory="/run/systemd/system" --version="false" --work_dir="/tmp/Endpoint_SlaveEndpointTest_UnauthorizedRequest_2_Mfn76H"
I0930 20:01:49.611462 29129 credentials.hpp:86] Loading credential for authentication from
'/tmp/Endpoint_SlaveEndpointTest_UnauthorizedRequest_2_QDqzPa/credential'
I0930 20:01:49.611593 29129 slave.cpp:346] Agent using credential for: test-principal
I0930 20:01:49.611616 29129 credentials.hpp:37] Loading credentials for authentication from
'/tmp/Endpoint_SlaveEndpointTest_UnauthorizedRequest_2_QDqzPa/http_credentials'
I0930 20:01:49.611832 29129 http.cpp:883] Using default 'basic' HTTP authenticator for realm
'mesos-agent-readonly'
I0930 20:01:49.611953 29129 http.cpp:883] Using default 'basic' HTTP authenticator for realm
'mesos-agent-readwrite'
I0930 20:01:49.613116 29129 slave.cpp:533] Agent resources: cpus(*):2; mem(*):1024; disk(*):1024;
ports(*):[31000-32000]
I0930 20:01:49.613214 29129 slave.cpp:541] Agent attributes: [  ]
I0930 20:01:49.613229 29129 slave.cpp:546] Agent hostname: 9c819b452782
I0930 20:01:49.614711 29128 state.cpp:57] Recovering state from '/tmp/Endpoint_SlaveEndpointTest_UnauthorizedRequest_2_Mfn76H/meta'
I0930 20:01:49.614783 29129 process.cpp:3377] Handling HTTP event for process 'slave(611)'
with path: '/slave(611)/containers'
I0930 20:01:49.615317 29128 status_update_manager.cpp:203] Recovering status update manager
I0930 20:01:49.615531 29126 containerizer.cpp:580] Recovering containerizer
I0930 20:01:49.615721 29115 http.cpp:835] Authorizing principal 'test-principal' to GET the
'/containers' endpoint
I0930 20:01:49.617003 29125 provisioner.cpp:253] Provisioner recovery complete
I0930 20:01:49.617261 29120 slave.cpp:5256] Finished recovery
I0930 20:01:49.617848 29120 slave.cpp:5428] Querying resource estimator for oversubscribable
resources
I0930 20:01:49.618141 29123 slave.cpp:5442] Received oversubscribable resources {} from the
resource estimator
I0930 20:01:49.618788 29127 slave.cpp:787] Agent terminating
[       OK ] Endpoint/SlaveEndpointTest.UnauthorizedRequest/2 (20 ms)
[ RUN      ] Endpoint/SlaveEndpointTest.NoAuthorizer/0
I0930 20:01:49.640733 29096 containerizer.cpp:226] Using isolation: posix/cpu,posix/mem,filesystem/posix,network/cni
W0930 20:01:49.641237 29096 backend.cpp:75] Failed to create 'aufs' backend: AufsBackend requires
root privileges, but is running as user mesos
W0930 20:01:49.641368 29096 backend.cpp:75] Failed to create 'bind' backend: BindBackend requires
root privileges
I0930 20:01:49.642462 29096 cluster.cpp:435] Creating default 'local' authorizer
I0930 20:01:49.643857 29121 slave.cpp:208] Mesos agent started on (612)@172.17.0.2:55430
I0930 20:01:49.643882 29121 slave.cpp:209] Flags at startup: --acls="" --appc_simple_discovery_uri_prefix="http://"
--appc_store_dir="/tmp/mesos/store/appc" --authenticate_http_readonly="true" --authenticate_http_readwrite="true"
--authenticatee="crammd5" --authentication_backoff_factor="1secs" --authorizer="local" --cgroups_cpu_enable_pids_and_tids_count="false"
--cgroups_enable_cfs="false" --cgroups_hierarchy="/sys/fs/cgroup" --cgroups_limit_swap="false"
--cgroups_root="mesos" --container_disk_watch_interval="15secs" --containerizers="mesos" --credential="/tmp/Endpoint_SlaveEndpointTest_NoAuthorizer_0_aSBeZ1/credential"
--default_role="*" --disk_watch_interval="1mins" --docker="docker" --docker_kill_orphans="true"
--docker_registry="https://registry-1.docker.io" --docker_remove_delay="6hrs" --docker_socket="/var/run/docker.sock"
--docker_stop_timeout="0ns" --docker_store_dir="/tmp/mesos/store/docker" --docker_volume_checkpoint_dir="/var/run/mesos/isolators/docker/volume"
--enforce_container_disk_quota="false" --executor_registration_timeout="1mins" --executor_shutdown_grace_period="5secs"
--fetcher_cache_dir="/tmp/Endpoint_SlaveEndpointTest_NoAuthorizer_0_aSBeZ1/fetch" --fetcher_cache_size="2GB"
--frameworks_home="" --gc_delay="1weeks" --gc_disk_headroom="0.1" --hadoop_home="" --help="false"
--hostname_lookup="true" --http_authenticators="basic" --http_command_executor="false" --http_credentials="/tmp/Endpoint_SlaveEndpointTest_NoAuthorizer_0_aSBeZ1/http_credentials"
--image_provisioner_backend="copy" --initialize_driver_logging="true" --isolation="posix/cpu,posix/mem"
--launcher="posix" --launcher_dir="/mesos/mesos-1.1.0/_build/src" --logbufsecs="0" --logging_level="INFO"
--oversubscribed_resources_interval="15secs" --perf_duration="10secs" --perf_interval="1mins"
--qos_correction_interval_min="0ns" --quiet="false" --recover="reconnect" --recovery_timeout="15mins"
--registration_backoff_factor="10ms" --resources="cpus:2;gpus:0;mem:1024;disk:1024;ports:[31000-32000]"
--revocable_cpu_low_priority="true" --runtime_dir="/tmp/Endpoint_SlaveEndpointTest_NoAuthorizer_0_aSBeZ1"
--sandbox_directory="/mnt/mesos/sandbox" --strict="true" --switch_user="true" --systemd_enable_support="true"
--systemd_runtime_directory="/run/systemd/system" --version="false" --work_dir="/tmp/Endpoint_SlaveEndpointTest_NoAuthorizer_0_pErpbz"
I0930 20:01:49.644300 29121 credentials.hpp:86] Loading credential for authentication from
'/tmp/Endpoint_SlaveEndpointTest_NoAuthorizer_0_aSBeZ1/credential'
I0930 20:01:49.644450 29121 slave.cpp:346] Agent using credential for: test-principal
I0930 20:01:49.644484 29121 credentials.hpp:37] Loading credentials for authentication from
'/tmp/Endpoint_SlaveEndpointTest_NoAuthorizer_0_aSBeZ1/http_credentials'
I0930 20:01:49.644784 29121 http.cpp:883] Using default 'basic' HTTP authenticator for realm
'mesos-agent-readonly'
I0930 20:01:49.644892 29121 http.cpp:883] Using default 'basic' HTTP authenticator for realm
'mesos-agent-readwrite'
I0930 20:01:49.645757 29121 slave.cpp:533] Agent resources: cpus(*):2; mem(*):1024; disk(*):1024;
ports(*):[31000-32000]
I0930 20:01:49.645833 29121 slave.cpp:541] Agent attributes: [  ]
I0930 20:01:49.645845 29121 slave.cpp:546] Agent hostname: 9c819b452782
I0930 20:01:49.647117 29127 state.cpp:57] Recovering state from '/tmp/Endpoint_SlaveEndpointTest_NoAuthorizer_0_pErpbz/meta'
I0930 20:01:49.647184 29121 process.cpp:3377] Handling HTTP event for process 'slave(612)'
with path: '/slave(612)/monitor/statistics'
I0930 20:01:49.647590 29116 status_update_manager.cpp:203] Recovering status update manager
I0930 20:01:49.647794 29117 containerizer.cpp:580] Recovering containerizer
I0930 20:01:49.647964 29120 http.cpp:835] Authorizing principal 'test-principal' to GET the
'/monitor/statistics' endpoint
I0930 20:01:49.648934 29129 provisioner.cpp:253] Provisioner recovery complete
I0930 20:01:49.649343 29127 slave.cpp:5256] Finished recovery
I0930 20:01:49.649740 29127 slave.cpp:5428] Querying resource estimator for oversubscribable
resources
I0930 20:01:49.649919 29122 slave.cpp:5442] Received oversubscribable resources {} from the
resource estimator
I0930 20:01:49.651021 29129 slave.cpp:787] Agent terminating
[       OK ] Endpoint/SlaveEndpointTest.NoAuthorizer/0 (18 ms)
[ RUN      ] Endpoint/SlaveEndpointTest.NoAuthorizer/1
I0930 20:01:49.663080 29096 containerizer.cpp:226] Using isolation: posix/cpu,posix/mem,filesystem/posix,network/cni
W0930 20:01:49.663776 29096 backend.cpp:75] Failed to create 'aufs' backend: AufsBackend requires
root privileges, but is running as user mesos
W0930 20:01:49.663954 29096 backend.cpp:75] Failed to create 'bind' backend: BindBackend requires
root privileges
I0930 20:01:49.665350 29096 cluster.cpp:435] Creating default 'local' authorizer
I0930 20:01:49.666884 29118 slave.cpp:208] Mesos agent started on (613)@172.17.0.2:55430
I0930 20:01:49.666965 29118 slave.cpp:209] Flags at startup: --acls="" --appc_simple_discovery_uri_prefix="http://"
--appc_store_dir="/tmp/mesos/store/appc" --authenticate_http_readonly="true" --authenticate_http_readwrite="true"
--authenticatee="crammd5" --authentication_backoff_factor="1secs" --authorizer="local" --cgroups_cpu_enable_pids_and_tids_count="false"
--cgroups_enable_cfs="false" --cgroups_hierarchy="/sys/fs/cgroup" --cgroups_limit_swap="false"
--cgroups_root="mesos" --container_disk_watch_interval="15secs" --containerizers="mesos" --credential="/tmp/Endpoint_SlaveEndpointTest_NoAuthorizer_1_h1KMoT/credential"
--default_role="*" --disk_watch_interval="1mins" --docker="docker" --docker_kill_orphans="true"
--docker_registry="https://registry-1.docker.io" --docker_remove_delay="6hrs" --docker_socket="/var/run/docker.sock"
--docker_stop_timeout="0ns" --docker_store_dir="/tmp/mesos/store/docker" --docker_volume_checkpoint_dir="/var/run/mesos/isolators/docker/volume"
--enforce_container_disk_quota="false" --executor_registration_timeout="1mins" --executor_shutdown_grace_period="5secs"
--fetcher_cache_dir="/tmp/Endpoint_SlaveEndpointTest_NoAuthorizer_1_h1KMoT/fetch" --fetcher_cache_size="2GB"
--frameworks_home="" --gc_delay="1weeks" --gc_disk_headroom="0.1" --hadoop_home="" --help="false"
--hostname_lookup="true" --http_authenticators="basic" --http_command_executor="false" --http_credentials="/tmp/Endpoint_SlaveEndpointTest_NoAuthorizer_1_h1KMoT/http_credentials"
--image_provisioner_backend="copy" --initialize_driver_logging="true" --isolation="posix/cpu,posix/mem"
--launcher="posix" --launcher_dir="/mesos/mesos-1.1.0/_build/src" --logbufsecs="0" --logging_level="INFO"
--oversubscribed_resources_interval="15secs" --perf_duration="10secs" --perf_interval="1mins"
--qos_correction_interval_min="0ns" --quiet="false" --recover="reconnect" --recovery_timeout="15mins"
--registration_backoff_factor="10ms" --resources="cpus:2;gpus:0;mem:1024;disk:1024;ports:[31000-32000]"
--revocable_cpu_low_priority="true" --runtime_dir="/tmp/Endpoint_SlaveEndpointTest_NoAuthorizer_1_h1KMoT"
--sandbox_directory="/mnt/mesos/sandbox" --strict="true" --switch_user="true" --systemd_enable_support="true"
--systemd_runtime_directory="/run/systemd/system" --version="false" --work_dir="/tmp/Endpoint_SlaveEndpointTest_NoAuthorizer_1_94Loxq"
I0930 20:01:49.667413 29118 credentials.hpp:86] Loading credential for authentication from
'/tmp/Endpoint_SlaveEndpointTest_NoAuthorizer_1_h1KMoT/credential'
I0930 20:01:49.667546 29118 slave.cpp:346] Agent using credential for: test-principal
I0930 20:01:49.667572 29118 credentials.hpp:37] Loading credentials for authentication from
'/tmp/Endpoint_SlaveEndpointTest_NoAuthorizer_1_h1KMoT/http_credentials'
I0930 20:01:49.667824 29118 http.cpp:883] Using default 'basic' HTTP authenticator for realm
'mesos-agent-readonly'
I0930 20:01:49.667965 29118 http.cpp:883] Using default 'basic' HTTP authenticator for realm
'mesos-agent-readwrite'
I0930 20:01:49.669134 29118 slave.cpp:533] Agent resources: cpus(*):2; mem(*):1024; disk(*):1024;
ports(*):[31000-32000]
I0930 20:01:49.669239 29118 slave.cpp:541] Agent attributes: [  ]
I0930 20:01:49.669262 29118 slave.cpp:546] Agent hostname: 9c819b452782
I0930 20:01:49.670748 29127 state.cpp:57] Recovering state from '/tmp/Endpoint_SlaveEndpointTest_NoAuthorizer_1_94Loxq/meta'
I0930 20:01:49.670805 29118 process.cpp:3377] Handling HTTP event for process 'slave(613)'
with path: '/slave(613)/monitor/statistics.json'
I0930 20:01:49.671432 29129 status_update_manager.cpp:203] Recovering status update manager
I0930 20:01:49.671663 29130 containerizer.cpp:580] Recovering containerizer
I0930 20:01:49.671988 29125 http.cpp:835] Authorizing principal 'test-principal' to GET the
'/monitor/statistics.json' endpoint
I0930 20:01:49.672979 29118 provisioner.cpp:253] Provisioner recovery complete
I0930 20:01:49.673647 29117 slave.cpp:5256] Finished recovery
I0930 20:01:49.674135 29117 slave.cpp:5428] Querying resource estimator for oversubscribable
resources
I0930 20:01:49.674352 29117 slave.cpp:5442] Received oversubscribable resources {} from the
resource estimator
I0930 20:01:49.675643 29115 slave.cpp:787] Agent terminating
[       OK ] Endpoint/SlaveEndpointTest.NoAuthorizer/1 (21 ms)
[ RUN      ] Endpoint/SlaveEndpointTest.NoAuthorizer/2
I0930 20:01:49.684413 29096 containerizer.cpp:226] Using isolation: posix/cpu,posix/mem,filesystem/posix,network/cni
W0930 20:01:49.685047 29096 backend.cpp:75] Failed to create 'aufs' backend: AufsBackend requires
root privileges, but is running as user mesos
W0930 20:01:49.685195 29096 backend.cpp:75] Failed to create 'bind' backend: BindBackend requires
root privileges
I0930 20:01:49.686447 29096 cluster.cpp:435] Creating default 'local' authorizer
I0930 20:01:49.688060 29122 slave.cpp:208] Mesos agent started on (614)@172.17.0.2:55430
I0930 20:01:49.688086 29122 slave.cpp:209] Flags at startup: --acls="" --appc_simple_discovery_uri_prefix="http://"
--appc_store_dir="/tmp/mesos/store/appc" --authenticate_http_readonly="true" --authenticate_http_readwrite="true"
--authenticatee="crammd5" --authentication_backoff_factor="1secs" --authorizer="local" --cgroups_cpu_enable_pids_and_tids_count="false"
--cgroups_enable_cfs="false" --cgroups_hierarchy="/sys/fs/cgroup" --cgroups_limit_swap="false"
--cgroups_root="mesos" --container_disk_watch_interval="15secs" --containerizers="mesos" --credential="/tmp/Endpoint_SlaveEndpointTest_NoAuthorizer_2_V9PU2K/credential"
--default_role="*" --disk_watch_interval="1mins" --docker="docker" --docker_kill_orphans="true"
--docker_registry="https://registry-1.docker.io" --docker_remove_delay="6hrs" --docker_socket="/var/run/docker.sock"
--docker_stop_timeout="0ns" --docker_store_dir="/tmp/mesos/store/docker" --docker_volume_checkpoint_dir="/var/run/mesos/isolators/docker/volume"
--enforce_container_disk_quota="false" --executor_registration_timeout="1mins" --executor_shutdown_grace_period="5secs"
--fetcher_cache_dir="/tmp/Endpoint_SlaveEndpointTest_NoAuthorizer_2_V9PU2K/fetch" --fetcher_cache_size="2GB"
--frameworks_home="" --gc_delay="1weeks" --gc_disk_headroom="0.1" --hadoop_home="" --help="false"
--hostname_lookup="true" --http_authenticators="basic" --http_command_executor="false" --http_credentials="/tmp/Endpoint_SlaveEndpointTest_NoAuthorizer_2_V9PU2K/http_credentials"
--image_provisioner_backend="copy" --initialize_driver_logging="true" --isolation="posix/cpu,posix/mem"
--launcher="posix" --launcher_dir="/mesos/mesos-1.1.0/_build/src" --logbufsecs="0" --logging_level="INFO"
--oversubscribed_resources_interval="15secs" --perf_duration="10secs" --perf_interval="1mins"
--qos_correction_interval_min="0ns" --quiet="false" --recover="reconnect" --recovery_timeout="15mins"
--registration_backoff_factor="10ms" --resources="cpus:2;gpus:0;mem:1024;disk:1024;ports:[31000-32000]"
--revocable_cpu_low_priority="true" --runtime_dir="/tmp/Endpoint_SlaveEndpointTest_NoAuthorizer_2_V9PU2K"
--sandbox_directory="/mnt/mesos/sandbox" --strict="true" --switch_user="true" --systemd_enable_support="true"
--systemd_runtime_directory="/run/systemd/system" --version="false" --work_dir="/tmp/Endpoint_SlaveEndpointTest_NoAuthorizer_2_3o6Y7h"
I0930 20:01:49.688920 29122 credentials.hpp:86] Loading credential for authentication from
'/tmp/Endpoint_SlaveEndpointTest_NoAuthorizer_2_V9PU2K/credential'
I0930 20:01:49.689095 29122 slave.cpp:346] Agent using credential for: test-principal
I0930 20:01:49.689270 29122 credentials.hpp:37] Loading credentials for authentication from
'/tmp/Endpoint_SlaveEndpointTest_NoAuthorizer_2_V9PU2K/http_credentials'
I0930 20:01:49.689584 29122 http.cpp:883] Using default 'basic' HTTP authenticator for realm
'mesos-agent-readonly'
I0930 20:01:49.689750 29122 http.cpp:883] Using default 'basic' HTTP authenticator for realm
'mesos-agent-readwrite'
I0930 20:01:49.690806 29122 slave.cpp:533] Agent resources: cpus(*):2; mem(*):1024; disk(*):1024;
ports(*):[31000-32000]
I0930 20:01:49.690887 29122 slave.cpp:541] Agent attributes: [  ]
I0930 20:01:49.690901 29122 slave.cpp:546] Agent hostname: 9c819b452782
I0930 20:01:49.692095 29119 state.cpp:57] Recovering state from '/tmp/Endpoint_SlaveEndpointTest_NoAuthorizer_2_3o6Y7h/meta'
I0930 20:01:49.692183 29122 process.cpp:3377] Handling HTTP event for process 'slave(614)'
with path: '/slave(614)/containers'
I0930 20:01:49.692615 29124 status_update_manager.cpp:203] Recovering status update manager
I0930 20:01:49.692781 29125 containerizer.cpp:580] Recovering containerizer
I0930 20:01:49.693104 29115 http.cpp:835] Authorizing principal 'test-principal' to GET the
'/containers' endpoint
I0930 20:01:49.693930 29119 provisioner.cpp:253] Provisioner recovery complete
I0930 20:01:49.694206 29127 slave.cpp:5256] Finished recovery
I0930 20:01:49.694723 29127 slave.cpp:5428] Querying resource estimator for oversubscribable
resources
I0930 20:01:49.695001 29127 slave.cpp:5442] Received oversubscribable resources {} from the
resource estimator
I0930 20:01:49.696712 29128 slave.cpp:787] Agent terminating
[       OK ] Endpoint/SlaveEndpointTest.NoAuthorizer/2 (21 ms)
[----------] 9 tests from Endpoint/SlaveEndpointTest (235 ms total)

[----------] Global test environment tear-down
[==========] 1339 tests from 152 test cases ran. (995409 ms total)
[  PASSED  ] 1338 tests.
[  FAILED  ] 1 test, listed below:
[  FAILED  ] DiskResource/PersistentVolumeTest.SlaveRecovery/0, where GetParam() = 0

 1 FAILED TEST
  YOU HAVE 6 DISABLED TESTS

make[4]: *** [check-local] Error 1
make[4]: Leaving directory `/mesos/mesos-1.1.0/_build/src'
make[3]: *** [check-am] Error 2
make[3]: Leaving directory `/mesos/mesos-1.1.0/_build/src'
make[2]: *** [check] Error 2
make[2]: Leaving directory `/mesos/mesos-1.1.0/_build/src'
make[1]: *** [check-recursive] Error 1
make[1]: Leaving directory `/mesos/mesos-1.1.0/_build'
make: *** [distcheck] Error 1
+ docker rmi mesos-1475262227-30718
Untagged: mesos-1475262227-30718:latest
Deleted: sha256:c3b14aba9e03184969a41147681fd718623c381c8e5ad4c132a9298b97715c47
Deleted: sha256:41f99f5e6d0394c49b644d94d5d8aed69654baccf1617d2b33fda4f1818095c8
Deleted: sha256:151878bbe5134d9470d3d4b293496e7c60ed3270bff1bc3bd10d87951ec03b03
Deleted: sha256:d9c63d78e974529adedda257e50afe13d04311a82650a814372157a9578ccc52
Deleted: sha256:2e5fc3d13d366a455c2ddb2896203a2e98bbbd3c221ececc85a0c0e93ac36009
Deleted: sha256:755d8797463a405e650c6b251a69d954a5a0a4ea6cc46297748921b7d99ac8ec
Deleted: sha256:785fb3708d7dd24534c5e4b5e6c758151a53544fd0ca1e594710b9617f5c2af9
Deleted: sha256:5987e75531059129c303a839371fb75279de5fb96c87b91eca15fcd7ccd4940c
Deleted: sha256:f78b80d30fbe671927119db7c692c9f6bff3d5dac841aaad5ee6bc4769b9fccf
Deleted: sha256:fcfec672e758e37e0fc0245daf696553018325f03351dcb4fe2d6f946084db67
Deleted: sha256:6abc4ff94d69c53459c30cf3d5d8bb8b3e6d9a1549099d81e635af2f418ca783
Deleted: sha256:48b6df3d2b44075d61d8aec0eea8b93927c6c95c352e5a31166da9d0891f2e54
Deleted: sha256:434891e65750ac446d60fb0dd37d8e3a725bf3cfc408755d8df77d2bf524b240
Deleted: sha256:4880799a8fae767b5d42ca8be023b2fcdbcc0a4ce4011003b433faf2c20d30c6
Deleted: sha256:bae2b653bdd247d64a1cbe6206175084aa660a54cdc4502302ffea0a30ab1045
Deleted: sha256:a81f8e58e39ffad4c4d1a54dd7038e02f59f02a25d7cc47b07238147105557f4
Deleted: sha256:51b92468fcde9d77f8e05e47c3e8bdee20e947710891ced4029e7067a887c1f1
Deleted: sha256:eff5dbce28524ea2bdbbd4844d0f141baf3b1abc55a12667d3168a652f3d3eff
Deleted: sha256:c024b636c01d35a210200c92add195bf8b40279a83291f13f9c44ca49d16fddc
Deleted: sha256:e5b8fffacf505dc44d60415e54e677ad8fe8eb3c28549edd2052527034739609
Deleted: sha256:3bfea096c2fc57ee06e65afc6a95e929984e7e058cd1497b4b7fc085a2b779d0
Deleted: sha256:1404c16b32f1820c1d7db29705660d4a7331ac25a852e6544413552b9ab0f4f2
Deleted: sha256:02985a8f36f2137a185330e41331c6b44168e1822e12e9660312d11cf5e687c4
Deleted: sha256:df7b32992cb10e9ca68b0eb2edf771513be64e05c25f25c35c92148cd1622181
Build step 'Execute shell' marked build as failure

Mime
View raw message