mesos-builds mailing list archives

Site index · List index
Message view « Date » · « Thread »
Top « Date » · « Thread »
From Apache Jenkins Server <jenk...@builds.apache.org>
Subject Build failed in Jenkins: mesos-reviewbot #14928
Date Tue, 23 Aug 2016 06:53:57 GMT
See <https://builds.apache.org/job/mesos-reviewbot/14928/>

------------------------------------------
[...truncated 9588 lines...]
Downloading: http://repo.maven.apache.org/maven2/commons-validator/commons-validator/1.2.0/commons-validator-1.2.0.pom
Downloaded: http://repo.maven.apache.org/maven2/commons-validator/commons-validator/1.2.0/commons-validator-1.2.0.pom (9 KB at 167.4 KB/sec)
Downloading: http://repo.maven.apache.org/maven2/xml-apis/xml-apis/2.0.2/xml-apis-2.0.2.pom
Downloaded: http://repo.maven.apache.org/maven2/xml-apis/xml-apis/2.0.2/xml-apis-2.0.2.pom (346 B at 6.4 KB/sec)
Downloading: http://repo.maven.apache.org/maven2/org/codehaus/plexus/plexus-archiver/2.3/plexus-archiver-2.3.pom
Downloaded: http://repo.maven.apache.org/maven2/org/codehaus/plexus/plexus-archiver/2.3/plexus-archiver-2.3.pom (4 KB at 60.9 KB/sec)
Downloading: http://repo.maven.apache.org/maven2/org/codehaus/plexus/plexus-components/1.3/plexus-components-1.3.pom
Downloaded: http://repo.maven.apache.org/maven2/org/codehaus/plexus/plexus-components/1.3/plexus-components-1.3.pom (3 KB at 56.3 KB/sec)
Downloading: http://repo.maven.apache.org/maven2/org/codehaus/plexus/plexus/3.3/plexus-3.3.pom
Downloaded: http://repo.maven.apache.org/maven2/org/codehaus/plexus/plexus/3.3/plexus-3.3.pom (20 KB at 359.9 KB/sec)
Downloading: http://repo.maven.apache.org/maven2/org/codehaus/plexus/plexus-utils/3.0.10/plexus-utils-3.0.10.pom
Downloaded: http://repo.maven.apache.org/maven2/org/codehaus/plexus/plexus-utils/3.0.10/plexus-utils-3.0.10.pom (4 KB at 56.9 KB/sec)
Downloading: http://repo.maven.apache.org/maven2/org/codehaus/plexus/plexus-io/2.0.6/plexus-io-2.0.6.pom
Downloaded: http://repo.maven.apache.org/maven2/org/codehaus/plexus/plexus-io/2.0.6/plexus-io-2.0.6.pom (3 KB at 40.7 KB/sec)
Downloading: http://repo.maven.apache.org/maven2/org/codehaus/plexus/plexus-components/1.2/plexus-components-1.2.pom
Downloaded: http://repo.maven.apache.org/maven2/org/codehaus/plexus/plexus-components/1.2/plexus-components-1.2.pom (3 KB at 56.3 KB/sec)
Downloading: http://repo.maven.apache.org/maven2/org/codehaus/plexus/plexus/3.2/plexus-3.2.pom
Downloaded: http://repo.maven.apache.org/maven2/org/codehaus/plexus/plexus/3.2/plexus-3.2.pom (19 KB at 345.4 KB/sec)
Downloading: http://repo.maven.apache.org/maven2/org/codehaus/plexus/plexus-utils/3.0.8/plexus-utils-3.0.8.pom
Downloaded: http://repo.maven.apache.org/maven2/org/codehaus/plexus/plexus-utils/3.0.8/plexus-utils-3.0.8.pom (4 KB at 57.9 KB/sec)
Downloading: http://repo.maven.apache.org/maven2/org/codehaus/plexus/plexus-utils/3.0.9/plexus-utils-3.0.9.pom
Downloaded: http://repo.maven.apache.org/maven2/org/codehaus/plexus/plexus-utils/3.0.9/plexus-utils-3.0.9.pom (4 KB at 57.9 KB/sec)
Downloading: http://repo.maven.apache.org/maven2/org/apache/maven/shared/file-management/1.2.1/file-management-1.2.1.pom
Downloaded: http://repo.maven.apache.org/maven2/org/apache/maven/shared/file-management/1.2.1/file-management-1.2.1.pom (4 KB at 71.5 KB/sec)
Downloading: http://repo.maven.apache.org/maven2/org/apache/maven/shared/maven-shared-components/10/maven-shared-components-10.pom
Downloaded: http://repo.maven.apache.org/maven2/org/apache/maven/shared/maven-shared-components/10/maven-shared-components-10.pom (9 KB at 155.4 KB/sec)
Downloading: http://repo.maven.apache.org/maven2/org/apache/maven/maven-parent/9/maven-parent-9.pom
Downloaded: http://repo.maven.apache.org/maven2/org/apache/maven/maven-parent/9/maven-parent-9.pom (33 KB at 593.8 KB/sec)
Downloading: http://repo.maven.apache.org/maven2/org/apache/maven/shared/maven-shared-io/1.1/maven-shared-io-1.1.pom
Downloaded: http://repo.maven.apache.org/maven2/org/apache/maven/shared/maven-shared-io/1.1/maven-shared-io-1.1.pom (4 KB at 74.8 KB/sec)
Downloading: http://repo.maven.apache.org/maven2/org/apache/maven/maven-artifact/2.0.2/maven-artifact-2.0.2.pom
Downloaded: http://repo.maven.apache.org/maven2/org/apache/maven/maven-artifact/2.0.2/maven-artifact-2.0.2.pom (765 B at 14.1 KB/sec)
Downloading: http://repo.maven.apache.org/maven2/org/apache/maven/maven/2.0.2/maven-2.0.2.pom
Downloaded: http://repo.maven.apache.org/maven2/org/apache/maven/maven/2.0.2/maven-2.0.2.pom (13 KB at 242.7 KB/sec)
Downloading: http://repo.maven.apache.org/maven2/org/codehaus/plexus/plexus-utils/1.1/plexus-utils-1.1.pom
Downloaded: http://repo.maven.apache.org/maven2/org/codehaus/plexus/plexus-utils/1.1/plexus-utils-1.1.pom (767 B at 14.1 KB/sec)
Downloading: http://repo.maven.apache.org/maven2/org/apache/maven/maven-artifact-manager/2.0.2/maven-artifact-manager-2.0.2.pom
Downloaded: http://repo.maven.apache.org/maven2/org/apache/maven/maven-artifact-manager/2.0.2/maven-artifact-manager-2.0.2.pom (2 KB at 25.7 KB/sec)
Downloading: http://repo.maven.apache.org/maven2/org/apache/maven/maven-repository-metadata/2.0.2/maven-repository-metadata-2.0.2.pom
Downloaded: http://repo.maven.apache.org/maven2/org/apache/maven/maven-repository-metadata/2.0.2/maven-repository-metadata-2.0.2.pom (2 KB at 24.1 KB/sec)
Downloading: http://repo.maven.apache.org/maven2/org/apache/maven/wagon/wagon-provider-api/1.0-alpha-6/wagon-provider-api-1.0-alpha-6.pom
Downloaded: http://repo.maven.apache.org/maven2/org/apache/maven/wagon/wagon-provider-api/1.0-alpha-6/wagon-provider-api-1.0-alpha-6.pom (588 B at 10.8 KB/sec)
Downloading: http://repo.maven.apache.org/maven2/org/apache/maven/wagon/wagon/1.0-alpha-6/wagon-1.0-alpha-6.pom
Downloaded: http://repo.maven.apache.org/maven2/org/apache/maven/wagon/wagon/1.0-alpha-6/wagon-1.0-alpha-6.pom (7 KB at 118.0 KB/sec)
Downloading: http://repo.maven.apache.org/maven2/org/apache/maven/shared/maven-dependency-analyzer/1.4/maven-dependency-analyzer-1.4.pom
Downloaded: http://repo.maven.apache.org/maven2/org/apache/maven/shared/maven-dependency-analyzer/1.4/maven-dependency-analyzer-1.4.pom (6 KB at 96.8 KB/sec)
Downloading: http://repo.maven.apache.org/maven2/org/apache/maven/maven-project/2.0.5/maven-project-2.0.5.pom
Downloaded: http://repo.maven.apache.org/maven2/org/apache/maven/maven-project/2.0.5/maven-project-2.0.5.pom (2 KB at 33.9 KB/sec)
Downloading: http://repo.maven.apache.org/maven2/org/apache/maven/maven/2.0.5/maven-2.0.5.pom
Downloaded: http://repo.maven.apache.org/maven2/org/apache/maven/maven/2.0.5/maven-2.0.5.pom (6 KB at 105.1 KB/sec)
Downloading: http://repo.maven.apache.org/maven2/org/apache/maven/maven-settings/2.0.5/maven-settings-2.0.5.pom
Downloaded: http://repo.maven.apache.org/maven2/org/apache/maven/maven-settings/2.0.5/maven-settings-2.0.5.pom (2 KB at 30.9 KB/sec)
Downloading: http://repo.maven.apache.org/maven2/org/apache/maven/maven-model/2.0.5/maven-model-2.0.5.pom
Downloaded: http://repo.maven.apache.org/maven2/org/apache/maven/maven-model/2.0.5/maven-model-2.0.5.pom (3 KB at 51.1 KB/sec)
Downloading: http://repo.maven.apache.org/maven2/org/apache/maven/maven-profile/2.0.5/maven-profile-2.0.5.pom
Downloaded: http://repo.maven.apache.org/maven2/org/apache/maven/maven-profile/2.0.5/maven-profile-2.0.5.pom (2 KB at 30.5 KB/sec)
Downloading: http://repo.maven.apache.org/maven2/org/apache/maven/maven-artifact-manager/2.0.5/maven-artifact-manager-2.0.5.pom
Downloaded: http://repo.maven.apache.org/maven2/org/apache/maven/maven-artifact-manager/2.0.5/maven-artifact-manager-2.0.5.pom (2 KB at 33.8 KB/sec)
Downloading: http://repo.maven.apache.org/maven2/org/apache/maven/maven-repository-metadata/2.0.5/maven-repository-metadata-2.0.5.pom
Downloaded: http://repo.maven.apache.org/maven2/org/apache/maven/maven-repository-metadata/2.0.5/maven-repository-metadata-2.0.5.pom (2 KB at 27.4 KB/sec)
Downloading: http://repo.maven.apache.org/maven2/org/apache/maven/maven-artifact/2.0.5/maven-artifact-2.0.5.pom
Downloaded: http://repo.maven.apache.org/maven2/org/apache/maven/maven-artifact/2.0.5/maven-artifact-2.0.5.pom (727 B at 13.4 KB/sec)
Downloading: http://repo.maven.apache.org/maven2/org/apache/maven/shared/maven-common-artifact-filters/1.4/maven-common-artifact-filters-1.4.pom
Downloaded: http://repo.maven.apache.org/maven2/org/apache/maven/shared/maven-common-artifact-filters/1.4/maven-common-artifact-filters-1.4.pom (4 KB at 69.3 KB/sec)
Downloading: http://repo.maven.apache.org/maven2/org/codehaus/plexus/plexus-container-default/1.5.5/plexus-container-default-1.5.5.pom
Downloaded: http://repo.maven.apache.org/maven2/org/codehaus/plexus/plexus-container-default/1.5.5/plexus-container-default-1.5.5.pom (3 KB at 50.8 KB/sec)
Downloading: http://repo.maven.apache.org/maven2/org/codehaus/plexus/plexus-classworlds/2.2.2/plexus-classworlds-2.2.2.pom
Downloaded: http://repo.maven.apache.org/maven2/org/codehaus/plexus/plexus-classworlds/2.2.2/plexus-classworlds-2.2.2.pom (4 KB at 74.3 KB/sec)
Downloading: http://repo.maven.apache.org/maven2/org/apache/xbean/xbean-reflect/3.4/xbean-reflect-3.4.pom
Downloaded: http://repo.maven.apache.org/maven2/org/apache/xbean/xbean-reflect/3.4/xbean-reflect-3.4.pom (3 KB at 51.8 KB/sec)
Downloading: http://repo.maven.apache.org/maven2/org/apache/xbean/xbean/3.4/xbean-3.4.pom
Downloaded: http://repo.maven.apache.org/maven2/org/apache/xbean/xbean/3.4/xbean-3.4.pom (19 KB at 341.5 KB/sec)
Downloading: http://repo.maven.apache.org/maven2/commons-logging/commons-logging-api/1.1/commons-logging-api-1.1.pom
Downloaded: http://repo.maven.apache.org/maven2/commons-logging/commons-logging-api/1.1/commons-logging-api-1.1.pom (6 KB at 98.5 KB/sec)
Downloading: http://repo.maven.apache.org/maven2/com/google/collections/google-collections/1.0/google-collections-1.0.pom
Downloaded: http://repo.maven.apache.org/maven2/com/google/collections/google-collections/1.0/google-collections-1.0.pom (3 KB at 45.7 KB/sec)
Downloading: http://repo.maven.apache.org/maven2/junit/junit/3.8.2/junit-3.8.2.pom
Downloaded: http://repo.maven.apache.org/maven2/junit/junit/3.8.2/junit-3.8.2.pom (747 B at 14.0 KB/sec)
Downloading: http://repo.maven.apache.org/maven2/org/codehaus/plexus/plexus-utils/2.1/plexus-utils-2.1.pom
Downloaded: http://repo.maven.apache.org/maven2/org/codehaus/plexus/plexus-utils/2.1/plexus-utils-2.1.pom (4 KB at 74.3 KB/sec)
Downloading: http://repo.maven.apache.org/maven2/org/apache/maven/shared/maven-invoker/2.0.11/maven-invoker-2.0.11.pom
Downloaded: http://repo.maven.apache.org/maven2/org/apache/maven/shared/maven-invoker/2.0.11/maven-invoker-2.0.11.pom (5 KB at 93.5 KB/sec)
Downloading: http://repo.maven.apache.org/maven2/commons-lang/commons-lang/2.6/commons-lang-2.6.pom
Downloaded: http://repo.maven.apache.org/maven2/commons-lang/commons-lang/2.6/commons-lang-2.6.pom (18 KB at 322.3 KB/sec)
Downloading: http://repo.maven.apache.org/maven2/org/apache/commons/commons-parent/17/commons-parent-17.pom
Downloaded: http://repo.maven.apache.org/maven2/org/apache/commons/commons-parent/17/commons-parent-17.pom (31 KB at 564.0 KB/sec)
Downloading: http://repo.maven.apache.org/maven2/org/apache/maven/reporting/maven-reporting-impl/2.0.5/maven-reporting-impl-2.0.5.jar
Downloading: http://repo.maven.apache.org/maven2/org/apache/maven/shared/maven-doxia-tools/1.0.2/maven-doxia-tools-1.0.2.jar
Downloading: http://repo.maven.apache.org/maven2/commons-validator/commons-validator/1.2.0/commons-validator-1.2.0.jar
Downloading: http://repo.maven.apache.org/maven2/commons-digester/commons-digester/1.6/commons-digester-1.6.jar
Downloading: http://repo.maven.apache.org/maven2/commons-logging/commons-logging/1.0.4/commons-logging-1.0.4.jar
Downloaded: http://repo.maven.apache.org/maven2/org/apache/maven/reporting/maven-reporting-impl/2.0.5/maven-reporting-impl-2.0.5.jar (21 KB at 379.8 KB/sec)
Downloading: http://repo.maven.apache.org/maven2/xml-apis/xml-apis/1.0.b2/xml-apis-1.0.b2.jar
Downloaded: http://repo.maven.apache.org/maven2/commons-logging/commons-logging/1.0.4/commons-logging-1.0.4.jar (38 KB at 700.5 KB/sec)
Downloading: http://repo.maven.apache.org/maven2/org/codehaus/plexus/plexus-archiver/2.3/plexus-archiver-2.3.jar
Downloaded: http://repo.maven.apache.org/maven2/org/apache/maven/shared/maven-doxia-tools/1.0.2/maven-doxia-tools-1.0.2.jar (41 KB at 716.4 KB/sec)
Downloading: http://repo.maven.apache.org/maven2/org/codehaus/plexus/plexus-utils/3.0.9/plexus-utils-3.0.9.jar
Downloaded: http://repo.maven.apache.org/maven2/commons-validator/commons-validator/1.2.0/commons-validator-1.2.0.jar (89 KB at 1617.8 KB/sec)
Downloading: http://repo.maven.apache.org/maven2/org/apache/maven/shared/file-management/1.2.1/file-management-1.2.1.jar
Downloaded: http://repo.maven.apache.org/maven2/commons-digester/commons-digester/1.6/commons-digester-1.6.jar (165 KB at 2937.5 KB/sec)
Downloading: http://repo.maven.apache.org/maven2/org/apache/maven/shared/maven-shared-io/1.1/maven-shared-io-1.1.jar
Downloaded: http://repo.maven.apache.org/maven2/xml-apis/xml-apis/1.0.b2/xml-apis-1.0.b2.jar (107 KB at 1941.0 KB/sec)
Downloading: http://repo.maven.apache.org/maven2/org/codehaus/plexus/plexus-io/2.0.6/plexus-io-2.0.6.jar
Downloaded: http://repo.maven.apache.org/maven2/org/apache/maven/shared/file-management/1.2.1/file-management-1.2.1.jar (37 KB at 692.4 KB/sec)
Downloading: http://repo.maven.apache.org/maven2/org/apache/maven/shared/maven-dependency-analyzer/1.4/maven-dependency-analyzer-1.4.jar
Downloaded: http://repo.maven.apache.org/maven2/org/apache/maven/shared/maven-shared-io/1.1/maven-shared-io-1.1.jar (39 KB at 714.0 KB/sec)
Downloading: http://repo.maven.apache.org/maven2/org/apache/maven/shared/maven-common-artifact-filters/1.4/maven-common-artifact-filters-1.4.jar
Downloaded: http://repo.maven.apache.org/maven2/org/codehaus/plexus/plexus-archiver/2.3/plexus-archiver-2.3.jar (183 KB at 3139.6 KB/sec)
Downloading: http://repo.maven.apache.org/maven2/org/apache/maven/shared/maven-invoker/2.0.11/maven-invoker-2.0.11.jar
Downloaded: http://repo.maven.apache.org/maven2/org/codehaus/plexus/plexus-utils/3.0.9/plexus-utils-3.0.9.jar (227 KB at 3839.0 KB/sec)
Downloading: http://repo.maven.apache.org/maven2/commons-lang/commons-lang/2.6/commons-lang-2.6.jar
Downloaded: http://repo.maven.apache.org/maven2/org/apache/maven/shared/maven-dependency-analyzer/1.4/maven-dependency-analyzer-1.4.jar (27 KB at 515.2 KB/sec)
Downloaded: http://repo.maven.apache.org/maven2/org/codehaus/plexus/plexus-io/2.0.6/plexus-io-2.0.6.jar (57 KB at 1062.6 KB/sec)
Downloaded: http://repo.maven.apache.org/maven2/org/apache/maven/shared/maven-common-artifact-filters/1.4/maven-common-artifact-filters-1.4.jar (31 KB at 593.4 KB/sec)
Downloaded: http://repo.maven.apache.org/maven2/org/apache/maven/shared/maven-invoker/2.0.11/maven-invoker-2.0.11.jar (29 KB at 532.7 KB/sec)
Downloaded: http://repo.maven.apache.org/maven2/commons-lang/commons-lang/2.6/commons-lang-2.6.jar (278 KB at 4626.0 KB/sec)
[INFO] Copying protobuf-java-2.6.1.jar to /mesos/mesos-1.1.0/_build/src/java/target/protobuf-java-2.6.1.jar
[INFO] ------------------------------------------------------------------------
[INFO] BUILD SUCCESS
[INFO] ------------------------------------------------------------------------
[INFO] Total time: 4:32.064s
[INFO] Finished at: Tue Aug 23 06:53:33 UTC 2016
[INFO] Final Memory: 35M/1180M
[INFO] ------------------------------------------------------------------------
/usr/lib/jvm/java-7-openjdk-amd64/bin/javah -d java/jni				\
	-classpath java/target/mesos-1.1.0.jar:/mesos/mesos-1.1.0/_build/src/java/target/protobuf-java-2.6.1.jar				\
	  org.apache.mesos.Log
/usr/lib/jvm/java-7-openjdk-amd64/bin/javah -d java/jni				\
	-classpath java/target/mesos-1.1.0.jar:/mesos/mesos-1.1.0/_build/src/java/target/protobuf-java-2.6.1.jar				\
          org.apache.mesos.MesosExecutorDriver
/usr/lib/jvm/java-7-openjdk-amd64/bin/javah -d java/jni				\
	-classpath java/target/mesos-1.1.0.jar:/mesos/mesos-1.1.0/_build/src/java/target/protobuf-java-2.6.1.jar				\
	  org.apache.mesos.MesosSchedulerDriver
/usr/lib/jvm/java-7-openjdk-amd64/bin/javah -d java/jni				\
	-classpath java/target/mesos-1.1.0.jar:/mesos/mesos-1.1.0/_build/src/java/target/protobuf-java-2.6.1.jar				\
	  org.apache.mesos.state.AbstractState
/usr/lib/jvm/java-7-openjdk-amd64/bin/javah -d java/jni				\
	-classpath java/target/mesos-1.1.0.jar:/mesos/mesos-1.1.0/_build/src/java/target/protobuf-java-2.6.1.jar				\
	  org.apache.mesos.state.LevelDBState
/usr/lib/jvm/java-7-openjdk-amd64/bin/javah -d java/jni				\
	-classpath java/target/mesos-1.1.0.jar:/mesos/mesos-1.1.0/_build/src/java/target/protobuf-java-2.6.1.jar				\
	  org.apache.mesos.state.LogState
/usr/lib/jvm/java-7-openjdk-amd64/bin/javah -d java/jni				\
	-classpath java/target/mesos-1.1.0.jar:/mesos/mesos-1.1.0/_build/src/java/target/protobuf-java-2.6.1.jar				\
	  org.apache.mesos.state.Variable
/usr/lib/jvm/java-7-openjdk-amd64/bin/javah -d java/jni				\
	-classpath java/target/mesos-1.1.0.jar:/mesos/mesos-1.1.0/_build/src/java/target/protobuf-java-2.6.1.jar				\
	  org.apache.mesos.state.ZooKeeperState
/usr/lib/jvm/java-7-openjdk-amd64/bin/javah -d java/jni				\
	-classpath java/target/mesos-1.1.0.jar:/mesos/mesos-1.1.0/_build/src/java/target/protobuf-java-2.6.1.jar				\
	  org.apache.mesos.v1.scheduler.V1Mesos
/usr/lib/jvm/java-7-openjdk-amd64/bin/javah -d java/jni				\
	-classpath java/target/mesos-1.1.0.jar:/mesos/mesos-1.1.0/_build/src/java/target/protobuf-java-2.6.1.jar				\
	  org.apache.mesos.v1.scheduler.V0Mesos
make  all-am
make[3]: Entering directory `/mesos/mesos-1.1.0/_build/src'
/bin/bash ../libtool  --tag=CXX   --mode=compile g++ -DPACKAGE_NAME=\"mesos\" -DPACKAGE_TARNAME=\"mesos\" -DPACKAGE_VERSION=\"1.1.0\" -DPACKAGE_STRING=\"mesos\ 1.1.0\" -DPACKAGE_BUGREPORT=\"\" -DPACKAGE_URL=\"\" -DPACKAGE=\"mesos\" -DVERSION=\"1.1.0\" -DSTDC_HEADERS=1 -DHAVE_SYS_TYPES_H=1 -DHAVE_SYS_STAT_H=1 -DHAVE_STDLIB_H=1 -DHAVE_STRING_H=1 -DHAVE_MEMORY_H=1 -DHAVE_STRINGS_H=1 -DHAVE_INTTYPES_H=1 -DHAVE_STDINT_H=1 -DHAVE_UNISTD_H=1 -DHAVE_DLFCN_H=1 -DLT_OBJDIR=\".libs/\" -DHAVE_CXX11=1 -DHAVE_PTHREAD_PRIO_INHERIT=1 -DHAVE_PTHREAD=1 -DHAVE_LIBZ=1 -DHAVE_FTS_H=1 -DHAVE_APR_POOLS_H=1 -DHAVE_LIBAPR_1=1 -DHAVE_LIBCURL=1 -DMESOS_HAS_JAVA=1 -DHAVE_PYTHON=\"2.7\" -DMESOS_HAS_PYTHON=1 -DHAVE_LIBSASL2=1 -DHAVE_SVN_VERSION_H=1 -DHAVE_LIBSVN_SUBR_1=1 -DHAVE_SVN_DELTA_H=1 -DHAVE_LIBSVN_DELTA_1=1 -DHAVE_LIBZ=1 -I. -I../../src   -Wall -Werror -Wsign-compare -DLIBDIR=\"/mesos/mesos-1.1.0/_inst/lib\" -DPKGLIBEXECDIR=\"/mesos/mesos-1.1.0/_inst/libexec/mesos\" -DPKGDATADIR=\"/mesos/mesos-1.1.0/_inst/share/mesos\" -DPKGMODULEDIR=\"/mesos/mesos-1.1.0/_inst/lib/mesos/modules\" -I../../include -I../include -I../include/mesos -DPICOJSON_USE_INT64 -D__STDC_FORMAT_MACROS -isystem ../3rdparty/boost-1.53.0 -I../3rdparty/elfio-3.2 -I../3rdparty/glog-0.3.3/src -I../3rdparty/leveldb-1.4/include -I../../3rdparty/libprocess/include -I../3rdparty/nvml-352.79 -I../3rdparty/picojson-1.3.0 -I../3rdparty/protobuf-2.6.1/src -I../../3rdparty/stout/include -I../3rdparty/zookeeper-3.4.8/src/c/include -I../3rdparty/zookeeper-3.4.8/src/c/generated -DHAS_AUTHENTICATION=1 -I/usr/include/subversion-1 -I/usr/include/apr-1 -I/usr/include/apr-1.0  -pthread -g1 -O0 -Wno-unused-local-typedefs -std=c++11 -MT slave/containerizer/mesos/libmesos_no_3rdparty_la-linux_launcher.lo -MD -MP -MF slave/containerizer/mesos/.deps/libmesos_no_3rdparty_la-linux_launcher.Tpo -c -o slave/containerizer/mesos/libmesos_no_3rdparty_la-linux_launcher.lo `test -f 'slave/containerizer/mesos/linux_launcher.cpp' || echo '../../src/'`slave/containerizer/mesos/linux_launcher.cpp
/bin/bash ../libtool  --tag=CXX   --mode=compile g++ -DPACKAGE_NAME=\"mesos\" -DPACKAGE_TARNAME=\"mesos\" -DPACKAGE_VERSION=\"1.1.0\" -DPACKAGE_STRING=\"mesos\ 1.1.0\" -DPACKAGE_BUGREPORT=\"\" -DPACKAGE_URL=\"\" -DPACKAGE=\"mesos\" -DVERSION=\"1.1.0\" -DSTDC_HEADERS=1 -DHAVE_SYS_TYPES_H=1 -DHAVE_SYS_STAT_H=1 -DHAVE_STDLIB_H=1 -DHAVE_STRING_H=1 -DHAVE_MEMORY_H=1 -DHAVE_STRINGS_H=1 -DHAVE_INTTYPES_H=1 -DHAVE_STDINT_H=1 -DHAVE_UNISTD_H=1 -DHAVE_DLFCN_H=1 -DLT_OBJDIR=\".libs/\" -DHAVE_CXX11=1 -DHAVE_PTHREAD_PRIO_INHERIT=1 -DHAVE_PTHREAD=1 -DHAVE_LIBZ=1 -DHAVE_FTS_H=1 -DHAVE_APR_POOLS_H=1 -DHAVE_LIBAPR_1=1 -DHAVE_LIBCURL=1 -DMESOS_HAS_JAVA=1 -DHAVE_PYTHON=\"2.7\" -DMESOS_HAS_PYTHON=1 -DHAVE_LIBSASL2=1 -DHAVE_SVN_VERSION_H=1 -DHAVE_LIBSVN_SUBR_1=1 -DHAVE_SVN_DELTA_H=1 -DHAVE_LIBSVN_DELTA_1=1 -DHAVE_LIBZ=1 -I. -I../../src   -Wall -Werror -Wsign-compare -DLIBDIR=\"/mesos/mesos-1.1.0/_inst/lib\" -DPKGLIBEXECDIR=\"/mesos/mesos-1.1.0/_inst/libexec/mesos\" -DPKGDATADIR=\"/mesos/mesos-1.1.0/_inst/share/mesos\" -DPKGMODULEDIR=\"/mesos/mesos-1.1.0/_inst/lib/mesos/modules\" -I../../include -I../include -I../include/mesos -DPICOJSON_USE_INT64 -D__STDC_FORMAT_MACROS -isystem ../3rdparty/boost-1.53.0 -I../3rdparty/elfio-3.2 -I../3rdparty/glog-0.3.3/src -I../3rdparty/leveldb-1.4/include -I../../3rdparty/libprocess/include -I../3rdparty/nvml-352.79 -I../3rdparty/picojson-1.3.0 -I../3rdparty/protobuf-2.6.1/src -I../../3rdparty/stout/include -I../3rdparty/zookeeper-3.4.8/src/c/include -I../3rdparty/zookeeper-3.4.8/src/c/generated -DHAS_AUTHENTICATION=1 -I/usr/include/subversion-1 -I/usr/include/apr-1 -I/usr/include/apr-1.0  -pthread -g1 -O0 -Wno-unused-local-typedefs -std=c++11 -MT slave/containerizer/mesos/isolators/docker/volume/libmesos_no_3rdparty_la-isolator.lo -MD -MP -MF slave/containerizer/mesos/isolators/docker/volume/.deps/libmesos_no_3rdparty_la-isolator.Tpo -c -o slave/containerizer/mesos/isolators/docker/volume/libmesos_no_3rdparty_la-isolator.lo `test -f 'slave/containerizer/mesos/isolators/docker/volume/isolator.cpp' || echo '../../src/'`slave/containerizer/mesos/isolators/docker/volume/isolator.cpp
/bin/bash ../libtool  --tag=CXX   --mode=compile g++ -DPACKAGE_NAME=\"mesos\" -DPACKAGE_TARNAME=\"mesos\" -DPACKAGE_VERSION=\"1.1.0\" -DPACKAGE_STRING=\"mesos\ 1.1.0\" -DPACKAGE_BUGREPORT=\"\" -DPACKAGE_URL=\"\" -DPACKAGE=\"mesos\" -DVERSION=\"1.1.0\" -DSTDC_HEADERS=1 -DHAVE_SYS_TYPES_H=1 -DHAVE_SYS_STAT_H=1 -DHAVE_STDLIB_H=1 -DHAVE_STRING_H=1 -DHAVE_MEMORY_H=1 -DHAVE_STRINGS_H=1 -DHAVE_INTTYPES_H=1 -DHAVE_STDINT_H=1 -DHAVE_UNISTD_H=1 -DHAVE_DLFCN_H=1 -DLT_OBJDIR=\".libs/\" -DHAVE_CXX11=1 -DHAVE_PTHREAD_PRIO_INHERIT=1 -DHAVE_PTHREAD=1 -DHAVE_LIBZ=1 -DHAVE_FTS_H=1 -DHAVE_APR_POOLS_H=1 -DHAVE_LIBAPR_1=1 -DHAVE_LIBCURL=1 -DMESOS_HAS_JAVA=1 -DHAVE_PYTHON=\"2.7\" -DMESOS_HAS_PYTHON=1 -DHAVE_LIBSASL2=1 -DHAVE_SVN_VERSION_H=1 -DHAVE_LIBSVN_SUBR_1=1 -DHAVE_SVN_DELTA_H=1 -DHAVE_LIBSVN_DELTA_1=1 -DHAVE_LIBZ=1 -I. -I../../src   -Wall -Werror -Wsign-compare -DLIBDIR=\"/mesos/mesos-1.1.0/_inst/lib\" -DPKGLIBEXECDIR=\"/mesos/mesos-1.1.0/_inst/libexec/mesos\" -DPKGDATADIR=\"/mesos/mesos-1.1.0/_inst/share/mesos\" -DPKGMODULEDIR=\"/mesos/mesos-1.1.0/_inst/lib/mesos/modules\" -I../../include -I../include -I../include/mesos -DPICOJSON_USE_INT64 -D__STDC_FORMAT_MACROS -isystem ../3rdparty/boost-1.53.0 -I../3rdparty/elfio-3.2 -I../3rdparty/glog-0.3.3/src -I../3rdparty/leveldb-1.4/include -I../../3rdparty/libprocess/include -I../3rdparty/nvml-352.79 -I../3rdparty/picojson-1.3.0 -I../3rdparty/protobuf-2.6.1/src -I../../3rdparty/stout/include -I../3rdparty/zookeeper-3.4.8/src/c/include -I../3rdparty/zookeeper-3.4.8/src/c/generated -DHAS_AUTHENTICATION=1 -I/usr/include/subversion-1 -I/usr/include/apr-1 -I/usr/include/apr-1.0  -pthread -g1 -O0 -Wno-unused-local-typedefs -std=c++11 -MT slave/containerizer/mesos/isolators/filesystem/libmesos_no_3rdparty_la-linux.lo -MD -MP -MF slave/containerizer/mesos/isolators/filesystem/.deps/libmesos_no_3rdparty_la-linux.Tpo -c -o slave/containerizer/mesos/isolators/filesystem/libmesos_no_3rdparty_la-linux.lo `test -f 'slave/containerizer/mesos/isolators/filesystem/linux.cpp' || echo '../../src/'`slave/containerizer/mesos/isolators/filesystem/linux.cpp
/bin/bash ../libtool  --tag=CXX   --mode=compile g++ -DPACKAGE_NAME=\"mesos\" -DPACKAGE_TARNAME=\"mesos\" -DPACKAGE_VERSION=\"1.1.0\" -DPACKAGE_STRING=\"mesos\ 1.1.0\" -DPACKAGE_BUGREPORT=\"\" -DPACKAGE_URL=\"\" -DPACKAGE=\"mesos\" -DVERSION=\"1.1.0\" -DSTDC_HEADERS=1 -DHAVE_SYS_TYPES_H=1 -DHAVE_SYS_STAT_H=1 -DHAVE_STDLIB_H=1 -DHAVE_STRING_H=1 -DHAVE_MEMORY_H=1 -DHAVE_STRINGS_H=1 -DHAVE_INTTYPES_H=1 -DHAVE_STDINT_H=1 -DHAVE_UNISTD_H=1 -DHAVE_DLFCN_H=1 -DLT_OBJDIR=\".libs/\" -DHAVE_CXX11=1 -DHAVE_PTHREAD_PRIO_INHERIT=1 -DHAVE_PTHREAD=1 -DHAVE_LIBZ=1 -DHAVE_FTS_H=1 -DHAVE_APR_POOLS_H=1 -DHAVE_LIBAPR_1=1 -DHAVE_LIBCURL=1 -DMESOS_HAS_JAVA=1 -DHAVE_PYTHON=\"2.7\" -DMESOS_HAS_PYTHON=1 -DHAVE_LIBSASL2=1 -DHAVE_SVN_VERSION_H=1 -DHAVE_LIBSVN_SUBR_1=1 -DHAVE_SVN_DELTA_H=1 -DHAVE_LIBSVN_DELTA_1=1 -DHAVE_LIBZ=1 -I. -I../../src   -Wall -Werror -Wsign-compare -DLIBDIR=\"/mesos/mesos-1.1.0/_inst/lib\" -DPKGLIBEXECDIR=\"/mesos/mesos-1.1.0/_inst/libexec/mesos\" -DPKGDATADIR=\"/mesos/mesos-1.1.0/_inst/share/mesos\" -DPKGMODULEDIR=\"/mesos/mesos-1.1.0/_inst/lib/mesos/modules\" -I../../include -I../include -I../include/mesos -DPICOJSON_USE_INT64 -D__STDC_FORMAT_MACROS -isystem ../3rdparty/boost-1.53.0 -I../3rdparty/elfio-3.2 -I../3rdparty/glog-0.3.3/src -I../3rdparty/leveldb-1.4/include -I../../3rdparty/libprocess/include -I../3rdparty/nvml-352.79 -I../3rdparty/picojson-1.3.0 -I../3rdparty/protobuf-2.6.1/src -I../../3rdparty/stout/include -I../3rdparty/zookeeper-3.4.8/src/c/include -I../3rdparty/zookeeper-3.4.8/src/c/generated -DHAS_AUTHENTICATION=1 -I/usr/include/subversion-1 -I/usr/include/apr-1 -I/usr/include/apr-1.0  -pthread -g1 -O0 -Wno-unused-local-typedefs -std=c++11 -MT slave/containerizer/mesos/isolators/filesystem/libmesos_no_3rdparty_la-shared.lo -MD -MP -MF slave/containerizer/mesos/isolators/filesystem/.deps/libmesos_no_3rdparty_la-shared.Tpo -c -o slave/containerizer/mesos/isolators/filesystem/libmesos_no_3rdparty_la-shared.lo `test -f 'slave/containerizer/mesos/isolators/filesystem/shared.cpp' || echo '../../src/'`slave/containerizer/mesos/isolators/filesystem/shared.cpp
/bin/bash ../libtool  --tag=CXX   --mode=compile g++ -DPACKAGE_NAME=\"mesos\" -DPACKAGE_TARNAME=\"mesos\" -DPACKAGE_VERSION=\"1.1.0\" -DPACKAGE_STRING=\"mesos\ 1.1.0\" -DPACKAGE_BUGREPORT=\"\" -DPACKAGE_URL=\"\" -DPACKAGE=\"mesos\" -DVERSION=\"1.1.0\" -DSTDC_HEADERS=1 -DHAVE_SYS_TYPES_H=1 -DHAVE_SYS_STAT_H=1 -DHAVE_STDLIB_H=1 -DHAVE_STRING_H=1 -DHAVE_MEMORY_H=1 -DHAVE_STRINGS_H=1 -DHAVE_INTTYPES_H=1 -DHAVE_STDINT_H=1 -DHAVE_UNISTD_H=1 -DHAVE_DLFCN_H=1 -DLT_OBJDIR=\".libs/\" -DHAVE_CXX11=1 -DHAVE_PTHREAD_PRIO_INHERIT=1 -DHAVE_PTHREAD=1 -DHAVE_LIBZ=1 -DHAVE_FTS_H=1 -DHAVE_APR_POOLS_H=1 -DHAVE_LIBAPR_1=1 -DHAVE_LIBCURL=1 -DMESOS_HAS_JAVA=1 -DHAVE_PYTHON=\"2.7\" -DMESOS_HAS_PYTHON=1 -DHAVE_LIBSASL2=1 -DHAVE_SVN_VERSION_H=1 -DHAVE_LIBSVN_SUBR_1=1 -DHAVE_SVN_DELTA_H=1 -DHAVE_LIBSVN_DELTA_1=1 -DHAVE_LIBZ=1 -I. -I../../src   -Wall -Werror -Wsign-compare -DLIBDIR=\"/mesos/mesos-1.1.0/_inst/lib\" -DPKGLIBEXECDIR=\"/mesos/mesos-1.1.0/_inst/libexec/mesos\" -DPKGDATADIR=\"/mesos/mesos-1.1.0/_inst/share/mesos\" -DPKGMODULEDIR=\"/mesos/mesos-1.1.0/_inst/lib/mesos/modules\" -I../../include -I../include -I../include/mesos -DPICOJSON_USE_INT64 -D__STDC_FORMAT_MACROS -isystem ../3rdparty/boost-1.53.0 -I../3rdparty/elfio-3.2 -I../3rdparty/glog-0.3.3/src -I../3rdparty/leveldb-1.4/include -I../../3rdparty/libprocess/include -I../3rdparty/nvml-352.79 -I../3rdparty/picojson-1.3.0 -I../3rdparty/protobuf-2.6.1/src -I../../3rdparty/stout/include -I../3rdparty/zookeeper-3.4.8/src/c/include -I../3rdparty/zookeeper-3.4.8/src/c/generated -DHAS_AUTHENTICATION=1 -I/usr/include/subversion-1 -I/usr/include/apr-1 -I/usr/include/apr-1.0  -pthread -g1 -O0 -Wno-unused-local-typedefs -std=c++11 -MT slave/containerizer/mesos/isolators/network/cni/libmesos_no_3rdparty_la-cni.lo -MD -MP -MF slave/containerizer/mesos/isolators/network/cni/.deps/libmesos_no_3rdparty_la-cni.Tpo -c -o slave/containerizer/mesos/isolators/network/cni/libmesos_no_3rdparty_la-cni.lo `test -f 'slave/containerizer/mesos/isolators/network/cni/cni.cpp' || echo '../../src/'`slave/containerizer/mesos/isolators/network/cni/cni.cpp
/bin/bash ../libtool  --tag=CXX   --mode=compile g++ -DPACKAGE_NAME=\"mesos\" -DPACKAGE_TARNAME=\"mesos\" -DPACKAGE_VERSION=\"1.1.0\" -DPACKAGE_STRING=\"mesos\ 1.1.0\" -DPACKAGE_BUGREPORT=\"\" -DPACKAGE_URL=\"\" -DPACKAGE=\"mesos\" -DVERSION=\"1.1.0\" -DSTDC_HEADERS=1 -DHAVE_SYS_TYPES_H=1 -DHAVE_SYS_STAT_H=1 -DHAVE_STDLIB_H=1 -DHAVE_STRING_H=1 -DHAVE_MEMORY_H=1 -DHAVE_STRINGS_H=1 -DHAVE_INTTYPES_H=1 -DHAVE_STDINT_H=1 -DHAVE_UNISTD_H=1 -DHAVE_DLFCN_H=1 -DLT_OBJDIR=\".libs/\" -DHAVE_CXX11=1 -DHAVE_PTHREAD_PRIO_INHERIT=1 -DHAVE_PTHREAD=1 -DHAVE_LIBZ=1 -DHAVE_FTS_H=1 -DHAVE_APR_POOLS_H=1 -DHAVE_LIBAPR_1=1 -DHAVE_LIBCURL=1 -DMESOS_HAS_JAVA=1 -DHAVE_PYTHON=\"2.7\" -DMESOS_HAS_PYTHON=1 -DHAVE_LIBSASL2=1 -DHAVE_SVN_VERSION_H=1 -DHAVE_LIBSVN_SUBR_1=1 -DHAVE_SVN_DELTA_H=1 -DHAVE_LIBSVN_DELTA_1=1 -DHAVE_LIBZ=1 -I. -I../../src   -Wall -Werror -Wsign-compare -DLIBDIR=\"/mesos/mesos-1.1.0/_inst/lib\" -DPKGLIBEXECDIR=\"/mesos/mesos-1.1.0/_inst/libexec/mesos\" -DPKGDATADIR=\"/mesos/mesos-1.1.0/_inst/share/mesos\" -DPKGMODULEDIR=\"/mesos/mesos-1.1.0/_inst/lib/mesos/modules\" -I../../include -I../include -I../include/mesos -DPICOJSON_USE_INT64 -D__STDC_FORMAT_MACROS -isystem ../3rdparty/boost-1.53.0 -I../3rdparty/elfio-3.2 -I../3rdparty/glog-0.3.3/src -I../3rdparty/leveldb-1.4/include -I../../3rdparty/libprocess/include -I../3rdparty/nvml-352.79 -I../3rdparty/picojson-1.3.0 -I../3rdparty/protobuf-2.6.1/src -I../../3rdparty/stout/include -I../3rdparty/zookeeper-3.4.8/src/c/include -I../3rdparty/zookeeper-3.4.8/src/c/generated -DHAS_AUTHENTICATION=1 -I/usr/include/subversion-1 -I/usr/include/apr-1 -I/usr/include/apr-1.0  -pthread -g1 -O0 -Wno-unused-local-typedefs -std=c++11 -MT slave/containerizer/mesos/provisioner/backends/libmesos_no_3rdparty_la-aufs.lo -MD -MP -MF slave/containerizer/mesos/provisioner/backends/.deps/libmesos_no_3rdparty_la-aufs.Tpo -c -o slave/containerizer/mesos/provisioner/backends/libmesos_no_3rdparty_la-aufs.lo `test -f 'slave/containerizer/mesos/provisioner/backends/aufs.cpp' || echo '../../src/'`slave/containerizer/mesos/provisioner/backends/aufs.cpp
/bin/bash ../libtool  --tag=CXX   --mode=compile g++ -DPACKAGE_NAME=\"mesos\" -DPACKAGE_TARNAME=\"mesos\" -DPACKAGE_VERSION=\"1.1.0\" -DPACKAGE_STRING=\"mesos\ 1.1.0\" -DPACKAGE_BUGREPORT=\"\" -DPACKAGE_URL=\"\" -DPACKAGE=\"mesos\" -DVERSION=\"1.1.0\" -DSTDC_HEADERS=1 -DHAVE_SYS_TYPES_H=1 -DHAVE_SYS_STAT_H=1 -DHAVE_STDLIB_H=1 -DHAVE_STRING_H=1 -DHAVE_MEMORY_H=1 -DHAVE_STRINGS_H=1 -DHAVE_INTTYPES_H=1 -DHAVE_STDINT_H=1 -DHAVE_UNISTD_H=1 -DHAVE_DLFCN_H=1 -DLT_OBJDIR=\".libs/\" -DHAVE_CXX11=1 -DHAVE_PTHREAD_PRIO_INHERIT=1 -DHAVE_PTHREAD=1 -DHAVE_LIBZ=1 -DHAVE_FTS_H=1 -DHAVE_APR_POOLS_H=1 -DHAVE_LIBAPR_1=1 -DHAVE_LIBCURL=1 -DMESOS_HAS_JAVA=1 -DHAVE_PYTHON=\"2.7\" -DMESOS_HAS_PYTHON=1 -DHAVE_LIBSASL2=1 -DHAVE_SVN_VERSION_H=1 -DHAVE_LIBSVN_SUBR_1=1 -DHAVE_SVN_DELTA_H=1 -DHAVE_LIBSVN_DELTA_1=1 -DHAVE_LIBZ=1 -I. -I../../src   -Wall -Werror -Wsign-compare -DLIBDIR=\"/mesos/mesos-1.1.0/_inst/lib\" -DPKGLIBEXECDIR=\"/mesos/mesos-1.1.0/_inst/libexec/mesos\" -DPKGDATADIR=\"/mesos/mesos-1.1.0/_inst/share/mesos\" -DPKGMODULEDIR=\"/mesos/mesos-1.1.0/_inst/lib/mesos/modules\" -I../../include -I../include -I../include/mesos -DPICOJSON_USE_INT64 -D__STDC_FORMAT_MACROS -isystem ../3rdparty/boost-1.53.0 -I../3rdparty/elfio-3.2 -I../3rdparty/glog-0.3.3/src -I../3rdparty/leveldb-1.4/include -I../../3rdparty/libprocess/include -I../3rdparty/nvml-352.79 -I../3rdparty/picojson-1.3.0 -I../3rdparty/protobuf-2.6.1/src -I../../3rdparty/stout/include -I../3rdparty/zookeeper-3.4.8/src/c/include -I../3rdparty/zookeeper-3.4.8/src/c/generated -DHAS_AUTHENTICATION=1 -I/usr/include/subversion-1 -I/usr/include/apr-1 -I/usr/include/apr-1.0  -pthread -g1 -O0 -Wno-unused-local-typedefs -std=c++11 -MT slave/containerizer/mesos/provisioner/backends/libmesos_no_3rdparty_la-bind.lo -MD -MP -MF slave/containerizer/mesos/provisioner/backends/.deps/libmesos_no_3rdparty_la-bind.Tpo -c -o slave/containerizer/mesos/provisioner/backends/libmesos_no_3rdparty_la-bind.lo `test -f 'slave/containerizer/mesos/provisioner/backends/bind.cpp' || echo '../../src/'`slave/containerizer/mesos/provisioner/backends/bind.cpp
/bin/bash ../libtool  --tag=CXX   --mode=compile g++ -DPACKAGE_NAME=\"mesos\" -DPACKAGE_TARNAME=\"mesos\" -DPACKAGE_VERSION=\"1.1.0\" -DPACKAGE_STRING=\"mesos\ 1.1.0\" -DPACKAGE_BUGREPORT=\"\" -DPACKAGE_URL=\"\" -DPACKAGE=\"mesos\" -DVERSION=\"1.1.0\" -DSTDC_HEADERS=1 -DHAVE_SYS_TYPES_H=1 -DHAVE_SYS_STAT_H=1 -DHAVE_STDLIB_H=1 -DHAVE_STRING_H=1 -DHAVE_MEMORY_H=1 -DHAVE_STRINGS_H=1 -DHAVE_INTTYPES_H=1 -DHAVE_STDINT_H=1 -DHAVE_UNISTD_H=1 -DHAVE_DLFCN_H=1 -DLT_OBJDIR=\".libs/\" -DHAVE_CXX11=1 -DHAVE_PTHREAD_PRIO_INHERIT=1 -DHAVE_PTHREAD=1 -DHAVE_LIBZ=1 -DHAVE_FTS_H=1 -DHAVE_APR_POOLS_H=1 -DHAVE_LIBAPR_1=1 -DHAVE_LIBCURL=1 -DMESOS_HAS_JAVA=1 -DHAVE_PYTHON=\"2.7\" -DMESOS_HAS_PYTHON=1 -DHAVE_LIBSASL2=1 -DHAVE_SVN_VERSION_H=1 -DHAVE_LIBSVN_SUBR_1=1 -DHAVE_SVN_DELTA_H=1 -DHAVE_LIBSVN_DELTA_1=1 -DHAVE_LIBZ=1 -I. -I../../src   -Wall -Werror -Wsign-compare -DLIBDIR=\"/mesos/mesos-1.1.0/_inst/lib\" -DPKGLIBEXECDIR=\"/mesos/mesos-1.1.0/_inst/libexec/mesos\" -DPKGDATADIR=\"/mesos/mesos-1.1.0/_inst/share/mesos\" -DPKGMODULEDIR=\"/mesos/mesos-1.1.0/_inst/lib/mesos/modules\" -I../../include -I../include -I../include/mesos -DPICOJSON_USE_INT64 -D__STDC_FORMAT_MACROS -isystem ../3rdparty/boost-1.53.0 -I../3rdparty/elfio-3.2 -I../3rdparty/glog-0.3.3/src -I../3rdparty/leveldb-1.4/include -I../../3rdparty/libprocess/include -I../3rdparty/nvml-352.79 -I../3rdparty/picojson-1.3.0 -I../3rdparty/protobuf-2.6.1/src -I../../3rdparty/stout/include -I../3rdparty/zookeeper-3.4.8/src/c/include -I../3rdparty/zookeeper-3.4.8/src/c/generated -DHAS_AUTHENTICATION=1 -I/usr/include/subversion-1 -I/usr/include/apr-1 -I/usr/include/apr-1.0  -pthread -g1 -O0 -Wno-unused-local-typedefs -std=c++11 -MT slave/containerizer/mesos/provisioner/backends/libmesos_no_3rdparty_la-overlay.lo -MD -MP -MF slave/containerizer/mesos/provisioner/backends/.deps/libmesos_no_3rdparty_la-overlay.Tpo -c -o slave/containerizer/mesos/provisioner/backends/libmesos_no_3rdparty_la-overlay.lo `test -f 'slave/containerizer/mesos/provisioner/backends/overlay.cpp' || echo '../../src/'`slave/containerizer/mesos/provisioner/backends/overlay.cpp
libtool: compile:  g++ -DPACKAGE_NAME=\"mesos\" -DPACKAGE_TARNAME=\"mesos\" -DPACKAGE_VERSION=\"1.1.0\" "-DPACKAGE_STRING=\"mesos 1.1.0\"" -DPACKAGE_BUGREPORT=\"\" -DPACKAGE_URL=\"\" -DPACKAGE=\"mesos\" -DVERSION=\"1.1.0\" -DSTDC_HEADERS=1 -DHAVE_SYS_TYPES_H=1 -DHAVE_SYS_STAT_H=1 -DHAVE_STDLIB_H=1 -DHAVE_STRING_H=1 -DHAVE_MEMORY_H=1 -DHAVE_STRINGS_H=1 -DHAVE_INTTYPES_H=1 -DHAVE_STDINT_H=1 -DHAVE_UNISTD_H=1 -DHAVE_DLFCN_H=1 -DLT_OBJDIR=\".libs/\" -DHAVE_CXX11=1 -DHAVE_PTHREAD_PRIO_INHERIT=1 -DHAVE_PTHREAD=1 -DHAVE_LIBZ=1 -DHAVE_FTS_H=1 -DHAVE_APR_POOLS_H=1 -DHAVE_LIBAPR_1=1 -DHAVE_LIBCURL=1 -DMESOS_HAS_JAVA=1 -DHAVE_PYTHON=\"2.7\" -DMESOS_HAS_PYTHON=1 -DHAVE_LIBSASL2=1 -DHAVE_SVN_VERSION_H=1 -DHAVE_LIBSVN_SUBR_1=1 -DHAVE_SVN_DELTA_H=1 -DHAVE_LIBSVN_DELTA_1=1 -DHAVE_LIBZ=1 -I. -I../../src -Wall -Werror -Wsign-compare -DLIBDIR=\"/mesos/mesos-1.1.0/_inst/lib\" -DPKGLIBEXECDIR=\"/mesos/mesos-1.1.0/_inst/libexec/mesos\" -DPKGDATADIR=\"/mesos/mesos-1.1.0/_inst/share/mesos\" -DPKGMODULEDIR=\"/mesos/mesos-1.1.0/_inst/lib/mesos/modules\" -I../../include -I../include -I../include/mesos -DPICOJSON_USE_INT64 -D__STDC_FORMAT_MACROS -isystem ../3rdparty/boost-1.53.0 -I../3rdparty/elfio-3.2 -I../3rdparty/glog-0.3.3/src -I../3rdparty/leveldb-1.4/include -I../../3rdparty/libprocess/include -I../3rdparty/nvml-352.79 -I../3rdparty/picojson-1.3.0 -I../3rdparty/protobuf-2.6.1/src -I../../3rdparty/stout/include -I../3rdparty/zookeeper-3.4.8/src/c/include -I../3rdparty/zookeeper-3.4.8/src/c/generated -DHAS_AUTHENTICATION=1 -I/usr/include/subversion-1 -I/usr/include/apr-1 -I/usr/include/apr-1.0 -pthread -g1 -O0 -Wno-unused-local-typedefs -std=c++11 -MT slave/containerizer/mesos/libmesos_no_3rdparty_la-linux_launcher.lo -MD -MP -MF slave/containerizer/mesos/.deps/libmesos_no_3rdparty_la-linux_launcher.Tpo -c ../../src/slave/containerizer/mesos/linux_launcher.cpp  -fPIC -DPIC -o slave/containerizer/mesos/.libs/libmesos_no_3rdparty_la-linux_launcher.o
libtool: compile:  g++ -DPACKAGE_NAME=\"mesos\" -DPACKAGE_TARNAME=\"mesos\" -DPACKAGE_VERSION=\"1.1.0\" "-DPACKAGE_STRING=\"mesos 1.1.0\"" -DPACKAGE_BUGREPORT=\"\" -DPACKAGE_URL=\"\" -DPACKAGE=\"mesos\" -DVERSION=\"1.1.0\" -DSTDC_HEADERS=1 -DHAVE_SYS_TYPES_H=1 -DHAVE_SYS_STAT_H=1 -DHAVE_STDLIB_H=1 -DHAVE_STRING_H=1 -DHAVE_MEMORY_H=1 -DHAVE_STRINGS_H=1 -DHAVE_INTTYPES_H=1 -DHAVE_STDINT_H=1 -DHAVE_UNISTD_H=1 -DHAVE_DLFCN_H=1 -DLT_OBJDIR=\".libs/\" -DHAVE_CXX11=1 -DHAVE_PTHREAD_PRIO_INHERIT=1 -DHAVE_PTHREAD=1 -DHAVE_LIBZ=1 -DHAVE_FTS_H=1 -DHAVE_APR_POOLS_H=1 -DHAVE_LIBAPR_1=1 -DHAVE_LIBCURL=1 -DMESOS_HAS_JAVA=1 -DHAVE_PYTHON=\"2.7\" -DMESOS_HAS_PYTHON=1 -DHAVE_LIBSASL2=1 -DHAVE_SVN_VERSION_H=1 -DHAVE_LIBSVN_SUBR_1=1 -DHAVE_SVN_DELTA_H=1 -DHAVE_LIBSVN_DELTA_1=1 -DHAVE_LIBZ=1 -I. -I../../src -Wall -Werror -Wsign-compare -DLIBDIR=\"/mesos/mesos-1.1.0/_inst/lib\" -DPKGLIBEXECDIR=\"/mesos/mesos-1.1.0/_inst/libexec/mesos\" -DPKGDATADIR=\"/mesos/mesos-1.1.0/_inst/share/mesos\" -DPKGMODULEDIR=\"/mesos/mesos-1.1.0/_inst/lib/mesos/modules\" -I../../include -I../include -I../include/mesos -DPICOJSON_USE_INT64 -D__STDC_FORMAT_MACROS -isystem ../3rdparty/boost-1.53.0 -I../3rdparty/elfio-3.2 -I../3rdparty/glog-0.3.3/src -I../3rdparty/leveldb-1.4/include -I../../3rdparty/libprocess/include -I../3rdparty/nvml-352.79 -I../3rdparty/picojson-1.3.0 -I../3rdparty/protobuf-2.6.1/src -I../../3rdparty/stout/include -I../3rdparty/zookeeper-3.4.8/src/c/include -I../3rdparty/zookeeper-3.4.8/src/c/generated -DHAS_AUTHENTICATION=1 -I/usr/include/subversion-1 -I/usr/include/apr-1 -I/usr/include/apr-1.0 -pthread -g1 -O0 -Wno-unused-local-typedefs -std=c++11 -MT slave/containerizer/mesos/isolators/docker/volume/libmesos_no_3rdparty_la-isolator.lo -MD -MP -MF slave/containerizer/mesos/isolators/docker/volume/.deps/libmesos_no_3rdparty_la-isolator.Tpo -c ../../src/slave/containerizer/mesos/isolators/docker/volume/isolator.cpp  -fPIC -DPIC -o slave/containerizer/mesos/isolators/docker/volume/.libs/libmesos_no_3rdparty_la-isolator.o
libtool: compile:  g++ -DPACKAGE_NAME=\"mesos\" -DPACKAGE_TARNAME=\"mesos\" -DPACKAGE_VERSION=\"1.1.0\" "-DPACKAGE_STRING=\"mesos 1.1.0\"" -DPACKAGE_BUGREPORT=\"\" -DPACKAGE_URL=\"\" -DPACKAGE=\"mesos\" -DVERSION=\"1.1.0\" -DSTDC_HEADERS=1 -DHAVE_SYS_TYPES_H=1 -DHAVE_SYS_STAT_H=1 -DHAVE_STDLIB_H=1 -DHAVE_STRING_H=1 -DHAVE_MEMORY_H=1 -DHAVE_STRINGS_H=1 -DHAVE_INTTYPES_H=1 -DHAVE_STDINT_H=1 -DHAVE_UNISTD_H=1 -DHAVE_DLFCN_H=1 -DLT_OBJDIR=\".libs/\" -DHAVE_CXX11=1 -DHAVE_PTHREAD_PRIO_INHERIT=1 -DHAVE_PTHREAD=1 -DHAVE_LIBZ=1 -DHAVE_FTS_H=1 -DHAVE_APR_POOLS_H=1 -DHAVE_LIBAPR_1=1 -DHAVE_LIBCURL=1 -DMESOS_HAS_JAVA=1 -DHAVE_PYTHON=\"2.7\" -DMESOS_HAS_PYTHON=1 -DHAVE_LIBSASL2=1 -DHAVE_SVN_VERSION_H=1 -DHAVE_LIBSVN_SUBR_1=1 -DHAVE_SVN_DELTA_H=1 -DHAVE_LIBSVN_DELTA_1=1 -DHAVE_LIBZ=1 -I. -I../../src -Wall -Werror -Wsign-compare -DLIBDIR=\"/mesos/mesos-1.1.0/_inst/lib\" -DPKGLIBEXECDIR=\"/mesos/mesos-1.1.0/_inst/libexec/mesos\" -DPKGDATADIR=\"/mesos/mesos-1.1.0/_inst/share/mesos\" -DPKGMODULEDIR=\"/mesos/mesos-1.1.0/_inst/lib/mesos/modules\" -I../../include -I../include -I../include/mesos -DPICOJSON_USE_INT64 -D__STDC_FORMAT_MACROS -isystem ../3rdparty/boost-1.53.0 -I../3rdparty/elfio-3.2 -I../3rdparty/glog-0.3.3/src -I../3rdparty/leveldb-1.4/include -I../../3rdparty/libprocess/include -I../3rdparty/nvml-352.79 -I../3rdparty/picojson-1.3.0 -I../3rdparty/protobuf-2.6.1/src -I../../3rdparty/stout/include -I../3rdparty/zookeeper-3.4.8/src/c/include -I../3rdparty/zookeeper-3.4.8/src/c/generated -DHAS_AUTHENTICATION=1 -I/usr/include/subversion-1 -I/usr/include/apr-1 -I/usr/include/apr-1.0 -pthread -g1 -O0 -Wno-unused-local-typedefs -std=c++11 -MT slave/containerizer/mesos/isolators/filesystem/libmesos_no_3rdparty_la-linux.lo -MD -MP -MF slave/containerizer/mesos/isolators/filesystem/.deps/libmesos_no_3rdparty_la-linux.Tpo -c ../../src/slave/containerizer/mesos/isolators/filesystem/linux.cpp  -fPIC -DPIC -o slave/containerizer/mesos/isolators/filesystem/.libs/libmesos_no_3rdparty_la-linux.o
libtool: compile:  g++ -DPACKAGE_NAME=\"mesos\" -DPACKAGE_TARNAME=\"mesos\" -DPACKAGE_VERSION=\"1.1.0\" "-DPACKAGE_STRING=\"mesos 1.1.0\"" -DPACKAGE_BUGREPORT=\"\" -DPACKAGE_URL=\"\" -DPACKAGE=\"mesos\" -DVERSION=\"1.1.0\" -DSTDC_HEADERS=1 -DHAVE_SYS_TYPES_H=1 -DHAVE_SYS_STAT_H=1 -DHAVE_STDLIB_H=1 -DHAVE_STRING_H=1 -DHAVE_MEMORY_H=1 -DHAVE_STRINGS_H=1 -DHAVE_INTTYPES_H=1 -DHAVE_STDINT_H=1 -DHAVE_UNISTD_H=1 -DHAVE_DLFCN_H=1 -DLT_OBJDIR=\".libs/\" -DHAVE_CXX11=1 -DHAVE_PTHREAD_PRIO_INHERIT=1 -DHAVE_PTHREAD=1 -DHAVE_LIBZ=1 -DHAVE_FTS_H=1 -DHAVE_APR_POOLS_H=1 -DHAVE_LIBAPR_1=1 -DHAVE_LIBCURL=1 -DMESOS_HAS_JAVA=1 -DHAVE_PYTHON=\"2.7\" -DMESOS_HAS_PYTHON=1 -DHAVE_LIBSASL2=1 -DHAVE_SVN_VERSION_H=1 -DHAVE_LIBSVN_SUBR_1=1 -DHAVE_SVN_DELTA_H=1 -DHAVE_LIBSVN_DELTA_1=1 -DHAVE_LIBZ=1 -I. -I../../src -Wall -Werror -Wsign-compare -DLIBDIR=\"/mesos/mesos-1.1.0/_inst/lib\" -DPKGLIBEXECDIR=\"/mesos/mesos-1.1.0/_inst/libexec/mesos\" -DPKGDATADIR=\"/mesos/mesos-1.1.0/_inst/share/mesos\" -DPKGMODULEDIR=\"/mesos/mesos-1.1.0/_inst/lib/mesos/modules\" -I../../include -I../include -I../include/mesos -DPICOJSON_USE_INT64 -D__STDC_FORMAT_MACROS -isystem ../3rdparty/boost-1.53.0 -I../3rdparty/elfio-3.2 -I../3rdparty/glog-0.3.3/src -I../3rdparty/leveldb-1.4/include -I../../3rdparty/libprocess/include -I../3rdparty/nvml-352.79 -I../3rdparty/picojson-1.3.0 -I../3rdparty/protobuf-2.6.1/src -I../../3rdparty/stout/include -I../3rdparty/zookeeper-3.4.8/src/c/include -I../3rdparty/zookeeper-3.4.8/src/c/generated -DHAS_AUTHENTICATION=1 -I/usr/include/subversion-1 -I/usr/include/apr-1 -I/usr/include/apr-1.0 -pthread -g1 -O0 -Wno-unused-local-typedefs -std=c++11 -MT slave/containerizer/mesos/isolators/filesystem/libmesos_no_3rdparty_la-shared.lo -MD -MP -MF slave/containerizer/mesos/isolators/filesystem/.deps/libmesos_no_3rdparty_la-shared.Tpo -c ../../src/slave/containerizer/mesos/isolators/filesystem/shared.cpp  -fPIC -DPIC -o slave/containerizer/mesos/isolators/filesystem/.libs/libmesos_no_3rdparty_la-shared.o
libtool: compile:  g++ -DPACKAGE_NAME=\"mesos\" -DPACKAGE_TARNAME=\"mesos\" -DPACKAGE_VERSION=\"1.1.0\" "-DPACKAGE_STRING=\"mesos 1.1.0\"" -DPACKAGE_BUGREPORT=\"\" -DPACKAGE_URL=\"\" -DPACKAGE=\"mesos\" -DVERSION=\"1.1.0\" -DSTDC_HEADERS=1 -DHAVE_SYS_TYPES_H=1 -DHAVE_SYS_STAT_H=1 -DHAVE_STDLIB_H=1 -DHAVE_STRING_H=1 -DHAVE_MEMORY_H=1 -DHAVE_STRINGS_H=1 -DHAVE_INTTYPES_H=1 -DHAVE_STDINT_H=1 -DHAVE_UNISTD_H=1 -DHAVE_DLFCN_H=1 -DLT_OBJDIR=\".libs/\" -DHAVE_CXX11=1 -DHAVE_PTHREAD_PRIO_INHERIT=1 -DHAVE_PTHREAD=1 -DHAVE_LIBZ=1 -DHAVE_FTS_H=1 -DHAVE_APR_POOLS_H=1 -DHAVE_LIBAPR_1=1 -DHAVE_LIBCURL=1 -DMESOS_HAS_JAVA=1 -DHAVE_PYTHON=\"2.7\" -DMESOS_HAS_PYTHON=1 -DHAVE_LIBSASL2=1 -DHAVE_SVN_VERSION_H=1 -DHAVE_LIBSVN_SUBR_1=1 -DHAVE_SVN_DELTA_H=1 -DHAVE_LIBSVN_DELTA_1=1 -DHAVE_LIBZ=1 -I. -I../../src -Wall -Werror -Wsign-compare -DLIBDIR=\"/mesos/mesos-1.1.0/_inst/lib\" -DPKGLIBEXECDIR=\"/mesos/mesos-1.1.0/_inst/libexec/mesos\" -DPKGDATADIR=\"/mesos/mesos-1.1.0/_inst/share/mesos\" -DPKGMODULEDIR=\"/mesos/mesos-1.1.0/_inst/lib/mesos/modules\" -I../../include -I../include -I../include/mesos -DPICOJSON_USE_INT64 -D__STDC_FORMAT_MACROS -isystem ../3rdparty/boost-1.53.0 -I../3rdparty/elfio-3.2 -I../3rdparty/glog-0.3.3/src -I../3rdparty/leveldb-1.4/include -I../../3rdparty/libprocess/include -I../3rdparty/nvml-352.79 -I../3rdparty/picojson-1.3.0 -I../3rdparty/protobuf-2.6.1/src -I../../3rdparty/stout/include -I../3rdparty/zookeeper-3.4.8/src/c/include -I../3rdparty/zookeeper-3.4.8/src/c/generated -DHAS_AUTHENTICATION=1 -I/usr/include/subversion-1 -I/usr/include/apr-1 -I/usr/include/apr-1.0 -pthread -g1 -O0 -Wno-unused-local-typedefs -std=c++11 -MT slave/containerizer/mesos/provisioner/backends/libmesos_no_3rdparty_la-aufs.lo -MD -MP -MF slave/containerizer/mesos/provisioner/backends/.deps/libmesos_no_3rdparty_la-aufs.Tpo -c ../../src/slave/containerizer/mesos/provisioner/backends/aufs.cpp  -fPIC -DPIC -o slave/containerizer/mesos/provisioner/backends/.libs/libmesos_no_3rdparty_la-aufs.o
libtool: compile:  g++ -DPACKAGE_NAME=\"mesos\" -DPACKAGE_TARNAME=\"mesos\" -DPACKAGE_VERSION=\"1.1.0\" "-DPACKAGE_STRING=\"mesos 1.1.0\"" -DPACKAGE_BUGREPORT=\"\" -DPACKAGE_URL=\"\" -DPACKAGE=\"mesos\" -DVERSION=\"1.1.0\" -DSTDC_HEADERS=1 -DHAVE_SYS_TYPES_H=1 -DHAVE_SYS_STAT_H=1 -DHAVE_STDLIB_H=1 -DHAVE_STRING_H=1 -DHAVE_MEMORY_H=1 -DHAVE_STRINGS_H=1 -DHAVE_INTTYPES_H=1 -DHAVE_STDINT_H=1 -DHAVE_UNISTD_H=1 -DHAVE_DLFCN_H=1 -DLT_OBJDIR=\".libs/\" -DHAVE_CXX11=1 -DHAVE_PTHREAD_PRIO_INHERIT=1 -DHAVE_PTHREAD=1 -DHAVE_LIBZ=1 -DHAVE_FTS_H=1 -DHAVE_APR_POOLS_H=1 -DHAVE_LIBAPR_1=1 -DHAVE_LIBCURL=1 -DMESOS_HAS_JAVA=1 -DHAVE_PYTHON=\"2.7\" -DMESOS_HAS_PYTHON=1 -DHAVE_LIBSASL2=1 -DHAVE_SVN_VERSION_H=1 -DHAVE_LIBSVN_SUBR_1=1 -DHAVE_SVN_DELTA_H=1 -DHAVE_LIBSVN_DELTA_1=1 -DHAVE_LIBZ=1 -I. -I../../src -Wall -Werror -Wsign-compare -DLIBDIR=\"/mesos/mesos-1.1.0/_inst/lib\" -DPKGLIBEXECDIR=\"/mesos/mesos-1.1.0/_inst/libexec/mesos\" -DPKGDATADIR=\"/mesos/mesos-1.1.0/_inst/share/mesos\" -DPKGMODULEDIR=\"/mesos/mesos-1.1.0/_inst/lib/mesos/modules\" -I../../include -I../include -I../include/mesos -DPICOJSON_USE_INT64 -D__STDC_FORMAT_MACROS -isystem ../3rdparty/boost-1.53.0 -I../3rdparty/elfio-3.2 -I../3rdparty/glog-0.3.3/src -I../3rdparty/leveldb-1.4/include -I../../3rdparty/libprocess/include -I../3rdparty/nvml-352.79 -I../3rdparty/picojson-1.3.0 -I../3rdparty/protobuf-2.6.1/src -I../../3rdparty/stout/include -I../3rdparty/zookeeper-3.4.8/src/c/include -I../3rdparty/zookeeper-3.4.8/src/c/generated -DHAS_AUTHENTICATION=1 -I/usr/include/subversion-1 -I/usr/include/apr-1 -I/usr/include/apr-1.0 -pthread -g1 -O0 -Wno-unused-local-typedefs -std=c++11 -MT slave/containerizer/mesos/isolators/network/cni/libmesos_no_3rdparty_la-cni.lo -MD -MP -MF slave/containerizer/mesos/isolators/network/cni/.deps/libmesos_no_3rdparty_la-cni.Tpo -c ../../src/slave/containerizer/mesos/isolators/network/cni/cni.cpp  -fPIC -DPIC -o slave/containerizer/mesos/isolators/network/cni/.libs/libmesos_no_3rdparty_la-cni.o
libtool: compile:  g++ -DPACKAGE_NAME=\"mesos\" -DPACKAGE_TARNAME=\"mesos\" -DPACKAGE_VERSION=\"1.1.0\" "-DPACKAGE_STRING=\"mesos 1.1.0\"" -DPACKAGE_BUGREPORT=\"\" -DPACKAGE_URL=\"\" -DPACKAGE=\"mesos\" -DVERSION=\"1.1.0\" -DSTDC_HEADERS=1 -DHAVE_SYS_TYPES_H=1 -DHAVE_SYS_STAT_H=1 -DHAVE_STDLIB_H=1 -DHAVE_STRING_H=1 -DHAVE_MEMORY_H=1 -DHAVE_STRINGS_H=1 -DHAVE_INTTYPES_H=1 -DHAVE_STDINT_H=1 -DHAVE_UNISTD_H=1 -DHAVE_DLFCN_H=1 -DLT_OBJDIR=\".libs/\" -DHAVE_CXX11=1 -DHAVE_PTHREAD_PRIO_INHERIT=1 -DHAVE_PTHREAD=1 -DHAVE_LIBZ=1 -DHAVE_FTS_H=1 -DHAVE_APR_POOLS_H=1 -DHAVE_LIBAPR_1=1 -DHAVE_LIBCURL=1 -DMESOS_HAS_JAVA=1 -DHAVE_PYTHON=\"2.7\" -DMESOS_HAS_PYTHON=1 -DHAVE_LIBSASL2=1 -DHAVE_SVN_VERSION_H=1 -DHAVE_LIBSVN_SUBR_1=1 -DHAVE_SVN_DELTA_H=1 -DHAVE_LIBSVN_DELTA_1=1 -DHAVE_LIBZ=1 -I. -I../../src -Wall -Werror -Wsign-compare -DLIBDIR=\"/mesos/mesos-1.1.0/_inst/lib\" -DPKGLIBEXECDIR=\"/mesos/mesos-1.1.0/_inst/libexec/mesos\" -DPKGDATADIR=\"/mesos/mesos-1.1.0/_inst/share/mesos\" -DPKGMODULEDIR=\"/mesos/mesos-1.1.0/_inst/lib/mesos/modules\" -I../../include -I../include -I../include/mesos -DPICOJSON_USE_INT64 -D__STDC_FORMAT_MACROS -isystem ../3rdparty/boost-1.53.0 -I../3rdparty/elfio-3.2 -I../3rdparty/glog-0.3.3/src -I../3rdparty/leveldb-1.4/include -I../../3rdparty/libprocess/include -I../3rdparty/nvml-352.79 -I../3rdparty/picojson-1.3.0 -I../3rdparty/protobuf-2.6.1/src -I../../3rdparty/stout/include -I../3rdparty/zookeeper-3.4.8/src/c/include -I../3rdparty/zookeeper-3.4.8/src/c/generated -DHAS_AUTHENTICATION=1 -I/usr/include/subversion-1 -I/usr/include/apr-1 -I/usr/include/apr-1.0 -pthread -g1 -O0 -Wno-unused-local-typedefs -std=c++11 -MT slave/containerizer/mesos/provisioner/backends/libmesos_no_3rdparty_la-bind.lo -MD -MP -MF slave/containerizer/mesos/provisioner/backends/.deps/libmesos_no_3rdparty_la-bind.Tpo -c ../../src/slave/containerizer/mesos/provisioner/backends/bind.cpp  -fPIC -DPIC -o slave/containerizer/mesos/provisioner/backends/.libs/libmesos_no_3rdparty_la-bind.o
libtool: compile:  g++ -DPACKAGE_NAME=\"mesos\" -DPACKAGE_TARNAME=\"mesos\" -DPACKAGE_VERSION=\"1.1.0\" "-DPACKAGE_STRING=\"mesos 1.1.0\"" -DPACKAGE_BUGREPORT=\"\" -DPACKAGE_URL=\"\" -DPACKAGE=\"mesos\" -DVERSION=\"1.1.0\" -DSTDC_HEADERS=1 -DHAVE_SYS_TYPES_H=1 -DHAVE_SYS_STAT_H=1 -DHAVE_STDLIB_H=1 -DHAVE_STRING_H=1 -DHAVE_MEMORY_H=1 -DHAVE_STRINGS_H=1 -DHAVE_INTTYPES_H=1 -DHAVE_STDINT_H=1 -DHAVE_UNISTD_H=1 -DHAVE_DLFCN_H=1 -DLT_OBJDIR=\".libs/\" -DHAVE_CXX11=1 -DHAVE_PTHREAD_PRIO_INHERIT=1 -DHAVE_PTHREAD=1 -DHAVE_LIBZ=1 -DHAVE_FTS_H=1 -DHAVE_APR_POOLS_H=1 -DHAVE_LIBAPR_1=1 -DHAVE_LIBCURL=1 -DMESOS_HAS_JAVA=1 -DHAVE_PYTHON=\"2.7\" -DMESOS_HAS_PYTHON=1 -DHAVE_LIBSASL2=1 -DHAVE_SVN_VERSION_H=1 -DHAVE_LIBSVN_SUBR_1=1 -DHAVE_SVN_DELTA_H=1 -DHAVE_LIBSVN_DELTA_1=1 -DHAVE_LIBZ=1 -I. -I../../src -Wall -Werror -Wsign-compare -DLIBDIR=\"/mesos/mesos-1.1.0/_inst/lib\" -DPKGLIBEXECDIR=\"/mesos/mesos-1.1.0/_inst/libexec/mesos\" -DPKGDATADIR=\"/mesos/mesos-1.1.0/_inst/share/mesos\" -DPKGMODULEDIR=\"/mesos/mesos-1.1.0/_inst/lib/mesos/modules\" -I../../include -I../include -I../include/mesos -DPICOJSON_USE_INT64 -D__STDC_FORMAT_MACROS -isystem ../3rdparty/boost-1.53.0 -I../3rdparty/elfio-3.2 -I../3rdparty/glog-0.3.3/src -I../3rdparty/leveldb-1.4/include -I../../3rdparty/libprocess/include -I../3rdparty/nvml-352.79 -I../3rdparty/picojson-1.3.0 -I../3rdparty/protobuf-2.6.1/src -I../../3rdparty/stout/include -I../3rdparty/zookeeper-3.4.8/src/c/include -I../3rdparty/zookeeper-3.4.8/src/c/generated -DHAS_AUTHENTICATION=1 -I/usr/include/subversion-1 -I/usr/include/apr-1 -I/usr/include/apr-1.0 -pthread -g1 -O0 -Wno-unused-local-typedefs -std=c++11 -MT slave/containerizer/mesos/provisioner/backends/libmesos_no_3rdparty_la-overlay.lo -MD -MP -MF slave/containerizer/mesos/provisioner/backends/.deps/libmesos_no_3rdparty_la-overlay.Tpo -c ../../src/slave/containerizer/mesos/provisioner/backends/overlay.cpp  -fPIC -DPIC -o slave/containerizer/mesos/provisioner/backends/.libs/libmesos_no_3rdparty_la-overlay.o
In file included from ../../src/slave/containerizer/mesos/launcher.hpp:28:0,
                 from ../../src/slave/containerizer/mesos/linux_launcher.hpp:20,
                 from ../../src/slave/containerizer/mesos/linux_launcher.cpp:39:
../../include/mesos/slave/isolator.hpp:25:41: fatal error: mesos/slave/containerizer.hpp: No such file or directory
 #include <mesos/slave/containerizer.hpp>
                                         ^
compilation terminated.
In file included from ../../src/slave/containerizer/mesos/isolator.hpp:20:0,
                 from ../../src/slave/containerizer/mesos/isolators/filesystem/shared.hpp:22,
                 from ../../src/slave/containerizer/mesos/isolators/filesystem/shared.cpp:25:
../../include/mesos/slave/isolator.hpp:25:41: fatal error: mesos/slave/containerizer.hpp: No such file or directory
 #include <mesos/slave/containerizer.hpp>
                                         ^
compilation terminated.
In file included from ../../src/slave/containerizer/mesos/isolator.hpp:20:0,
                 from ../../src/slave/containerizer/mesos/isolators/filesystem/linux.hpp:32,
                 from ../../src/slave/containerizer/mesos/isolators/filesystem/linux.cpp:46:
../../include/mesos/slave/isolator.hpp:25:41: fatal error: mesos/slave/containerizer.hpp: No such file or directory
 #include <mesos/slave/containerizer.hpp>
                                         ^
compilation terminated.
In file included from ../../src/slave/containerizer/mesos/isolator.hpp:20:0,
                 from ../../src/slave/containerizer/mesos/isolators/docker/volume/isolator.hpp:31,
                 from ../../src/slave/containerizer/mesos/isolators/docker/volume/isolator.cpp:25:
../../include/mesos/slave/isolator.hpp:25:41: fatal error: mesos/slave/containerizer.hpp: No such file or directory
 #include <mesos/slave/containerizer.hpp>
                                         ^
compilation terminated.
In file included from ../../src/slave/containerizer/mesos/isolator.hpp:20:0,
                 from ../../src/slave/containerizer/mesos/isolators/network/cni/cni.hpp:27,
                 from ../../src/slave/containerizer/mesos/isolators/network/cni/cni.cpp:33:
../../include/mesos/slave/isolator.hpp:25:41: fatal error: mesos/slave/containerizer.hpp: No such file or directory
 #include <mesos/slave/containerizer.hpp>
                                         ^
compilation terminated.
make[3]: *** [slave/containerizer/mesos/libmesos_no_3rdparty_la-linux_launcher.lo] Error 1
make[3]: *** Waiting for unfinished jobs....
make[3]: *** [slave/containerizer/mesos/isolators/filesystem/libmesos_no_3rdparty_la-shared.lo] Error 1
make[3]: *** [slave/containerizer/mesos/isolators/docker/volume/libmesos_no_3rdparty_la-isolator.lo] Error 1
make[3]: *** [slave/containerizer/mesos/isolators/network/cni/libmesos_no_3rdparty_la-cni.lo] Error 1
make[3]: *** [slave/containerizer/mesos/isolators/filesystem/libmesos_no_3rdparty_la-linux.lo] Error 1
mv -f slave/containerizer/mesos/provisioner/backends/.deps/libmesos_no_3rdparty_la-overlay.Tpo slave/containerizer/mesos/provisioner/backends/.deps/libmesos_no_3rdparty_la-overlay.Plo
mv -f slave/containerizer/mesos/provisioner/backends/.deps/libmesos_no_3rdparty_la-aufs.Tpo slave/containerizer/mesos/provisioner/backends/.deps/libmesos_no_3rdparty_la-aufs.Plo
mv -f slave/containerizer/mesos/provisioner/backends/.deps/libmesos_no_3rdparty_la-bind.Tpo slave/containerizer/mesos/provisioner/backends/.deps/libmesos_no_3rdparty_la-bind.Plo
make[3]: Leaving directory `/mesos/mesos-1.1.0/_build/src'
make[2]: *** [all] Error 2
make[2]: Leaving directory `/mesos/mesos-1.1.0/_build/src'
make[1]: *** [all-recursive] Error 1
make[1]: Leaving directory `/mesos/mesos-1.1.0/_build'
make: *** [distcheck] Error 1
+ docker rmi mesos-1471934573-22355
Untagged: mesos-1471934573-22355:latest
Deleted: sha256:8c1c3a2060e9927575b9261eb422180f30602602a9e9e280c199eb747015829f
Deleted: sha256:2ac35c44e4080263a057ba8701f53f3852bf76aecd5d3f5b91b9f71b237a3ef9
Deleted: sha256:61f5df7100d20dfbc79f46ee762893d0f29eff26db00b56efa87b3f063b103fe
Deleted: sha256:6ac1d18945d40b1fa1f57966adba39023e9b4384588609c752f40ef5a25bdb5a
Deleted: sha256:6aa7cc178a97ae0d007b27b32dda4c1e8d7182d797dbbbd0053cdcc6b66b722c
Deleted: sha256:ae3086375d02128124ebad6ccf1e7896bd667b8c19e7c1ef60cd0a36dfe9aa13
Deleted: sha256:66e57dc59bc130c64508e6340f06910640b9988820fbb7d442da9a072f9dd841
Deleted: sha256:9a99e97edd4a4cbd3244b2c6550f98d28c8c8144e03c3742e8dfa35cb61ed271
Deleted: sha256:abd0b198ff85aca31f7a39eb411490e3f6df6728ca22cc92173fe8c3dcbdb47a
Deleted: sha256:6cdb25420c0e96a54358390af0258ff8dd984d86f1e34b717e40c78b1baae179
Deleted: sha256:a262913fd5f30a263c08a5092b1e2d40e0a12e97f24453137124768c9fb5e93e
Deleted: sha256:ed4ee4d98e1ba6643a423fb00e7fa2c6ac62fea4f31252f27d0ef0eb6d4fe523
Deleted: sha256:fe149a20ca9567ed35634615aee34bbb179234647775326c0a72bc6ba1e50d3b
Deleted: sha256:22f15461616c79ca39bd32b7199e16e5dff9b5bf1c599dc83cbdf0e95e81d9dc
Deleted: sha256:5d376f286ff1154a7e108193616ef0ecbbc29157a3e4c3ab9d8802252d4f817f
Deleted: sha256:6eaa79137fe017158f71f6ba8f6ca9f218951f064b592561ee81a3f69bc9a5df
Deleted: sha256:9fe1a24425fb3b798d5118b7e3ce8c2949ebe1c06f967c8d2f928eb3c7694045
Deleted: sha256:7a7925adfa40d65b4e2e82493beaa5201aed1222683f03a97a19db0345f88c91
Deleted: sha256:407f026a9062d7fc619c49138379bc3709a5a49d11b1d8a8ac6d5514279d75a2
Deleted: sha256:8bbdf15b14033182f1078ff24158f07d91d81ae20eef89f9816241dc7835c287
Deleted: sha256:1b55d79f9292d58c6703dda3198725cab3e9d6b6d870dea67ef299a8d8973dd1
Deleted: sha256:a80719882d57f09530cf966bf87f364dd59b26296a370a2760bb138757b3a02a
Deleted: sha256:7e6cc049c6064dfc14af6e0bf163d50120b63c983be9cb137170fe5a7b8d7c9b
Deleted: sha256:5f9dc9db132e1175558ceed2a4e7d8f53a97831a6596e8e8829a608268d52d4d
Build step 'Execute shell' marked build as failure

Mime
View raw message