mesos-builds mailing list archives

Site index · List index
Message view « Date » · « Thread »
Top « Date » · « Thread »
From Apache Jenkins Server <jenk...@builds.apache.org>
Subject Build failed in Jenkins: mesos-reviewbot #14930
Date Tue, 23 Aug 2016 08:42:40 GMT
See <https://builds.apache.org/job/mesos-reviewbot/14930/>

------------------------------------------
[...truncated 9633 lines...]
Downloading: http://repo.maven.apache.org/maven2/commons-validator/commons-validator/1.2.0/commons-validator-1.2.0.pom
Downloaded: http://repo.maven.apache.org/maven2/commons-validator/commons-validator/1.2.0/commons-validator-1.2.0.pom (9 KB at 170.6 KB/sec)
Downloading: http://repo.maven.apache.org/maven2/xml-apis/xml-apis/2.0.2/xml-apis-2.0.2.pom
Downloaded: http://repo.maven.apache.org/maven2/xml-apis/xml-apis/2.0.2/xml-apis-2.0.2.pom (346 B at 6.5 KB/sec)
Downloading: http://repo.maven.apache.org/maven2/org/codehaus/plexus/plexus-archiver/2.3/plexus-archiver-2.3.pom
Downloaded: http://repo.maven.apache.org/maven2/org/codehaus/plexus/plexus-archiver/2.3/plexus-archiver-2.3.pom (4 KB at 62.1 KB/sec)
Downloading: http://repo.maven.apache.org/maven2/org/codehaus/plexus/plexus-components/1.3/plexus-components-1.3.pom
Downloaded: http://repo.maven.apache.org/maven2/org/codehaus/plexus/plexus-components/1.3/plexus-components-1.3.pom (3 KB at 56.3 KB/sec)
Downloading: http://repo.maven.apache.org/maven2/org/codehaus/plexus/plexus/3.3/plexus-3.3.pom
Downloaded: http://repo.maven.apache.org/maven2/org/codehaus/plexus/plexus/3.3/plexus-3.3.pom (20 KB at 366.7 KB/sec)
Downloading: http://repo.maven.apache.org/maven2/org/codehaus/plexus/plexus-utils/3.0.10/plexus-utils-3.0.10.pom
Downloaded: http://repo.maven.apache.org/maven2/org/codehaus/plexus/plexus-utils/3.0.10/plexus-utils-3.0.10.pom (4 KB at 57.9 KB/sec)
Downloading: http://repo.maven.apache.org/maven2/org/codehaus/plexus/plexus-io/2.0.6/plexus-io-2.0.6.pom
Downloaded: http://repo.maven.apache.org/maven2/org/codehaus/plexus/plexus-io/2.0.6/plexus-io-2.0.6.pom (3 KB at 40.7 KB/sec)
Downloading: http://repo.maven.apache.org/maven2/org/codehaus/plexus/plexus-components/1.2/plexus-components-1.2.pom
Downloaded: http://repo.maven.apache.org/maven2/org/codehaus/plexus/plexus-components/1.2/plexus-components-1.2.pom (3 KB at 56.3 KB/sec)
Downloading: http://repo.maven.apache.org/maven2/org/codehaus/plexus/plexus/3.2/plexus-3.2.pom
Downloaded: http://repo.maven.apache.org/maven2/org/codehaus/plexus/plexus/3.2/plexus-3.2.pom (19 KB at 345.4 KB/sec)
Downloading: http://repo.maven.apache.org/maven2/org/codehaus/plexus/plexus-utils/3.0.8/plexus-utils-3.0.8.pom
Downloaded: http://repo.maven.apache.org/maven2/org/codehaus/plexus/plexus-utils/3.0.8/plexus-utils-3.0.8.pom (4 KB at 57.9 KB/sec)
Downloading: http://repo.maven.apache.org/maven2/org/codehaus/plexus/plexus-utils/3.0.9/plexus-utils-3.0.9.pom
Downloaded: http://repo.maven.apache.org/maven2/org/codehaus/plexus/plexus-utils/3.0.9/plexus-utils-3.0.9.pom (4 KB at 59.0 KB/sec)
Downloading: http://repo.maven.apache.org/maven2/org/apache/maven/shared/file-management/1.2.1/file-management-1.2.1.pom
Downloaded: http://repo.maven.apache.org/maven2/org/apache/maven/shared/file-management/1.2.1/file-management-1.2.1.pom (4 KB at 72.9 KB/sec)
Downloading: http://repo.maven.apache.org/maven2/org/apache/maven/shared/maven-shared-components/10/maven-shared-components-10.pom
Downloaded: http://repo.maven.apache.org/maven2/org/apache/maven/shared/maven-shared-components/10/maven-shared-components-10.pom (9 KB at 155.4 KB/sec)
Downloading: http://repo.maven.apache.org/maven2/org/apache/maven/maven-parent/9/maven-parent-9.pom
Downloaded: http://repo.maven.apache.org/maven2/org/apache/maven/maven-parent/9/maven-parent-9.pom (33 KB at 605.0 KB/sec)
Downloading: http://repo.maven.apache.org/maven2/org/apache/maven/shared/maven-shared-io/1.1/maven-shared-io-1.1.pom
Downloaded: http://repo.maven.apache.org/maven2/org/apache/maven/shared/maven-shared-io/1.1/maven-shared-io-1.1.pom (4 KB at 76.2 KB/sec)
Downloading: http://repo.maven.apache.org/maven2/org/apache/maven/maven-artifact/2.0.2/maven-artifact-2.0.2.pom
Downloaded: http://repo.maven.apache.org/maven2/org/apache/maven/maven-artifact/2.0.2/maven-artifact-2.0.2.pom (765 B at 14.1 KB/sec)
Downloading: http://repo.maven.apache.org/maven2/org/apache/maven/maven/2.0.2/maven-2.0.2.pom
Downloaded: http://repo.maven.apache.org/maven2/org/apache/maven/maven/2.0.2/maven-2.0.2.pom (13 KB at 238.2 KB/sec)
Downloading: http://repo.maven.apache.org/maven2/org/codehaus/plexus/plexus-utils/1.1/plexus-utils-1.1.pom
Downloaded: http://repo.maven.apache.org/maven2/org/codehaus/plexus/plexus-utils/1.1/plexus-utils-1.1.pom (767 B at 14.1 KB/sec)
Downloading: http://repo.maven.apache.org/maven2/org/apache/maven/maven-artifact-manager/2.0.2/maven-artifact-manager-2.0.2.pom
Downloaded: http://repo.maven.apache.org/maven2/org/apache/maven/maven-artifact-manager/2.0.2/maven-artifact-manager-2.0.2.pom (2 KB at 17.5 KB/sec)
Downloading: http://repo.maven.apache.org/maven2/org/apache/maven/maven-repository-metadata/2.0.2/maven-repository-metadata-2.0.2.pom
Downloaded: http://repo.maven.apache.org/maven2/org/apache/maven/maven-repository-metadata/2.0.2/maven-repository-metadata-2.0.2.pom (2 KB at 24.1 KB/sec)
Downloading: http://repo.maven.apache.org/maven2/org/apache/maven/wagon/wagon-provider-api/1.0-alpha-6/wagon-provider-api-1.0-alpha-6.pom
Downloaded: http://repo.maven.apache.org/maven2/org/apache/maven/wagon/wagon-provider-api/1.0-alpha-6/wagon-provider-api-1.0-alpha-6.pom (588 B at 10.6 KB/sec)
Downloading: http://repo.maven.apache.org/maven2/org/apache/maven/wagon/wagon/1.0-alpha-6/wagon-1.0-alpha-6.pom
Downloaded: http://repo.maven.apache.org/maven2/org/apache/maven/wagon/wagon/1.0-alpha-6/wagon-1.0-alpha-6.pom (7 KB at 88.1 KB/sec)
Downloading: http://repo.maven.apache.org/maven2/org/apache/maven/shared/maven-dependency-analyzer/1.4/maven-dependency-analyzer-1.4.pom
Downloaded: http://repo.maven.apache.org/maven2/org/apache/maven/shared/maven-dependency-analyzer/1.4/maven-dependency-analyzer-1.4.pom (6 KB at 93.2 KB/sec)
Downloading: http://repo.maven.apache.org/maven2/org/apache/maven/maven-project/2.0.5/maven-project-2.0.5.pom
Downloaded: http://repo.maven.apache.org/maven2/org/apache/maven/maven-project/2.0.5/maven-project-2.0.5.pom (2 KB at 25.7 KB/sec)
Downloading: http://repo.maven.apache.org/maven2/org/apache/maven/maven/2.0.5/maven-2.0.5.pom
Downloaded: http://repo.maven.apache.org/maven2/org/apache/maven/maven/2.0.5/maven-2.0.5.pom (6 KB at 105.1 KB/sec)
Downloading: http://repo.maven.apache.org/maven2/org/apache/maven/maven-settings/2.0.5/maven-settings-2.0.5.pom
Downloaded: http://repo.maven.apache.org/maven2/org/apache/maven/maven-settings/2.0.5/maven-settings-2.0.5.pom (2 KB at 23.7 KB/sec)
Downloading: http://repo.maven.apache.org/maven2/org/apache/maven/maven-model/2.0.5/maven-model-2.0.5.pom
Downloaded: http://repo.maven.apache.org/maven2/org/apache/maven/maven-model/2.0.5/maven-model-2.0.5.pom (3 KB at 38.5 KB/sec)
Downloading: http://repo.maven.apache.org/maven2/org/apache/maven/maven-profile/2.0.5/maven-profile-2.0.5.pom
Downloaded: http://repo.maven.apache.org/maven2/org/apache/maven/maven-profile/2.0.5/maven-profile-2.0.5.pom (2 KB at 25.3 KB/sec)
Downloading: http://repo.maven.apache.org/maven2/org/apache/maven/maven-artifact-manager/2.0.5/maven-artifact-manager-2.0.5.pom
Downloaded: http://repo.maven.apache.org/maven2/org/apache/maven/maven-artifact-manager/2.0.5/maven-artifact-manager-2.0.5.pom (2 KB at 20.1 KB/sec)
Downloading: http://repo.maven.apache.org/maven2/org/apache/maven/maven-repository-metadata/2.0.5/maven-repository-metadata-2.0.5.pom
Downloaded: http://repo.maven.apache.org/maven2/org/apache/maven/maven-repository-metadata/2.0.5/maven-repository-metadata-2.0.5.pom (2 KB at 17.5 KB/sec)
Downloading: http://repo.maven.apache.org/maven2/org/apache/maven/maven-artifact/2.0.5/maven-artifact-2.0.5.pom
Downloaded: http://repo.maven.apache.org/maven2/org/apache/maven/maven-artifact/2.0.5/maven-artifact-2.0.5.pom (727 B at 10.4 KB/sec)
Downloading: http://repo.maven.apache.org/maven2/org/apache/maven/shared/maven-common-artifact-filters/1.4/maven-common-artifact-filters-1.4.pom
Downloaded: http://repo.maven.apache.org/maven2/org/apache/maven/shared/maven-common-artifact-filters/1.4/maven-common-artifact-filters-1.4.pom (4 KB at 64.4 KB/sec)
Downloading: http://repo.maven.apache.org/maven2/org/codehaus/plexus/plexus-container-default/1.5.5/plexus-container-default-1.5.5.pom
Downloaded: http://repo.maven.apache.org/maven2/org/codehaus/plexus/plexus-container-default/1.5.5/plexus-container-default-1.5.5.pom (3 KB at 28.6 KB/sec)
Downloading: http://repo.maven.apache.org/maven2/org/codehaus/plexus/plexus-classworlds/2.2.2/plexus-classworlds-2.2.2.pom
Downloaded: http://repo.maven.apache.org/maven2/org/codehaus/plexus/plexus-classworlds/2.2.2/plexus-classworlds-2.2.2.pom (4 KB at 32.8 KB/sec)
Downloading: http://repo.maven.apache.org/maven2/org/apache/xbean/xbean-reflect/3.4/xbean-reflect-3.4.pom
Downloaded: http://repo.maven.apache.org/maven2/org/apache/xbean/xbean-reflect/3.4/xbean-reflect-3.4.pom (3 KB at 28.6 KB/sec)
Downloading: http://repo.maven.apache.org/maven2/org/apache/xbean/xbean/3.4/xbean-3.4.pom
Downloaded: http://repo.maven.apache.org/maven2/org/apache/xbean/xbean/3.4/xbean-3.4.pom (19 KB at 247.9 KB/sec)
Downloading: http://repo.maven.apache.org/maven2/commons-logging/commons-logging-api/1.1/commons-logging-api-1.1.pom
Downloaded: http://repo.maven.apache.org/maven2/commons-logging/commons-logging-api/1.1/commons-logging-api-1.1.pom (6 KB at 77.9 KB/sec)
Downloading: http://repo.maven.apache.org/maven2/com/google/collections/google-collections/1.0/google-collections-1.0.pom
Downloaded: http://repo.maven.apache.org/maven2/com/google/collections/google-collections/1.0/google-collections-1.0.pom (3 KB at 37.2 KB/sec)
Downloading: http://repo.maven.apache.org/maven2/junit/junit/3.8.2/junit-3.8.2.pom
Downloaded: http://repo.maven.apache.org/maven2/junit/junit/3.8.2/junit-3.8.2.pom (747 B at 6.5 KB/sec)
Downloading: http://repo.maven.apache.org/maven2/org/codehaus/plexus/plexus-utils/2.1/plexus-utils-2.1.pom
Downloaded: http://repo.maven.apache.org/maven2/org/codehaus/plexus/plexus-utils/2.1/plexus-utils-2.1.pom (4 KB at 74.3 KB/sec)
Downloading: http://repo.maven.apache.org/maven2/org/apache/maven/shared/maven-invoker/2.0.11/maven-invoker-2.0.11.pom
Downloaded: http://repo.maven.apache.org/maven2/org/apache/maven/shared/maven-invoker/2.0.11/maven-invoker-2.0.11.pom (5 KB at 78.7 KB/sec)
Downloading: http://repo.maven.apache.org/maven2/commons-lang/commons-lang/2.6/commons-lang-2.6.pom
Downloaded: http://repo.maven.apache.org/maven2/commons-lang/commons-lang/2.6/commons-lang-2.6.pom (18 KB at 183.7 KB/sec)
Downloading: http://repo.maven.apache.org/maven2/org/apache/commons/commons-parent/17/commons-parent-17.pom
Downloaded: http://repo.maven.apache.org/maven2/org/apache/commons/commons-parent/17/commons-parent-17.pom (31 KB at 406.1 KB/sec)
Downloading: http://repo.maven.apache.org/maven2/org/apache/maven/reporting/maven-reporting-impl/2.0.5/maven-reporting-impl-2.0.5.jar
Downloading: http://repo.maven.apache.org/maven2/org/apache/maven/shared/maven-doxia-tools/1.0.2/maven-doxia-tools-1.0.2.jar
Downloading: http://repo.maven.apache.org/maven2/commons-validator/commons-validator/1.2.0/commons-validator-1.2.0.jar
Downloading: http://repo.maven.apache.org/maven2/commons-digester/commons-digester/1.6/commons-digester-1.6.jar
Downloading: http://repo.maven.apache.org/maven2/commons-logging/commons-logging/1.0.4/commons-logging-1.0.4.jar
Downloaded: http://repo.maven.apache.org/maven2/commons-logging/commons-logging/1.0.4/commons-logging-1.0.4.jar (38 KB at 589.3 KB/sec)
Downloading: http://repo.maven.apache.org/maven2/xml-apis/xml-apis/1.0.b2/xml-apis-1.0.b2.jar
Downloaded: http://repo.maven.apache.org/maven2/org/apache/maven/shared/maven-doxia-tools/1.0.2/maven-doxia-tools-1.0.2.jar (41 KB at 617.2 KB/sec)
Downloaded: http://repo.maven.apache.org/maven2/org/apache/maven/reporting/maven-reporting-impl/2.0.5/maven-reporting-impl-2.0.5.jar (21 KB at 309.7 KB/sec)
Downloading: http://repo.maven.apache.org/maven2/org/codehaus/plexus/plexus-archiver/2.3/plexus-archiver-2.3.jar
Downloading: http://repo.maven.apache.org/maven2/org/codehaus/plexus/plexus-utils/3.0.9/plexus-utils-3.0.9.jar
Downloaded: http://repo.maven.apache.org/maven2/commons-validator/commons-validator/1.2.0/commons-validator-1.2.0.jar (89 KB at 1368.9 KB/sec)
Downloading: http://repo.maven.apache.org/maven2/org/apache/maven/shared/file-management/1.2.1/file-management-1.2.1.jar
Downloaded: http://repo.maven.apache.org/maven2/commons-digester/commons-digester/1.6/commons-digester-1.6.jar (165 KB at 2492.4 KB/sec)
Downloading: http://repo.maven.apache.org/maven2/org/apache/maven/shared/maven-shared-io/1.1/maven-shared-io-1.1.jar
Downloaded: http://repo.maven.apache.org/maven2/org/apache/maven/shared/file-management/1.2.1/file-management-1.2.1.jar (37 KB at 692.4 KB/sec)
Downloaded: http://repo.maven.apache.org/maven2/xml-apis/xml-apis/1.0.b2/xml-apis-1.0.b2.jar (107 KB at 1941.0 KB/sec)
Downloading: http://repo.maven.apache.org/maven2/org/codehaus/plexus/plexus-io/2.0.6/plexus-io-2.0.6.jar
Downloading: http://repo.maven.apache.org/maven2/org/apache/maven/shared/maven-dependency-analyzer/1.4/maven-dependency-analyzer-1.4.jar
Downloaded: http://repo.maven.apache.org/maven2/org/apache/maven/shared/maven-shared-io/1.1/maven-shared-io-1.1.jar (39 KB at 701.0 KB/sec)
Downloading: http://repo.maven.apache.org/maven2/org/apache/maven/shared/maven-common-artifact-filters/1.4/maven-common-artifact-filters-1.4.jar
Downloaded: http://repo.maven.apache.org/maven2/org/codehaus/plexus/plexus-archiver/2.3/plexus-archiver-2.3.jar (183 KB at 3194.7 KB/sec)
Downloading: http://repo.maven.apache.org/maven2/org/apache/maven/shared/maven-invoker/2.0.11/maven-invoker-2.0.11.jar
Downloaded: http://repo.maven.apache.org/maven2/org/codehaus/plexus/plexus-utils/3.0.9/plexus-utils-3.0.9.jar (227 KB at 3775.0 KB/sec)
Downloading: http://repo.maven.apache.org/maven2/commons-lang/commons-lang/2.6/commons-lang-2.6.jar
Downloaded: http://repo.maven.apache.org/maven2/org/codehaus/plexus/plexus-io/2.0.6/plexus-io-2.0.6.jar (57 KB at 880.0 KB/sec)
Downloaded: http://repo.maven.apache.org/maven2/org/apache/maven/shared/maven-dependency-analyzer/1.4/maven-dependency-analyzer-1.4.jar (27 KB at 418.6 KB/sec)
Downloaded: http://repo.maven.apache.org/maven2/org/apache/maven/shared/maven-invoker/2.0.11/maven-invoker-2.0.11.jar (29 KB at 470.5 KB/sec)
Downloaded: http://repo.maven.apache.org/maven2/org/apache/maven/shared/maven-common-artifact-filters/1.4/maven-common-artifact-filters-1.4.jar (31 KB at 505.9 KB/sec)
Downloaded: http://repo.maven.apache.org/maven2/commons-lang/commons-lang/2.6/commons-lang-2.6.jar (278 KB at 4550.1 KB/sec)
[INFO] Copying protobuf-java-2.6.1.jar to /mesos/mesos-1.1.0/_build/src/java/target/protobuf-java-2.6.1.jar
[INFO] ------------------------------------------------------------------------
[INFO] BUILD SUCCESS
[INFO] ------------------------------------------------------------------------
[INFO] Total time: 5:12.796s
[INFO] Finished at: Tue Aug 23 08:41:54 UTC 2016
[INFO] Final Memory: 34M/1134M
[INFO] ------------------------------------------------------------------------
/usr/lib/jvm/java-7-openjdk-amd64/bin/javah -d java/jni				\
	-classpath java/target/mesos-1.1.0.jar:/mesos/mesos-1.1.0/_build/src/java/target/protobuf-java-2.6.1.jar				\
	  org.apache.mesos.Log
/usr/lib/jvm/java-7-openjdk-amd64/bin/javah -d java/jni				\
	-classpath java/target/mesos-1.1.0.jar:/mesos/mesos-1.1.0/_build/src/java/target/protobuf-java-2.6.1.jar				\
          org.apache.mesos.MesosExecutorDriver
/usr/lib/jvm/java-7-openjdk-amd64/bin/javah -d java/jni				\
	-classpath java/target/mesos-1.1.0.jar:/mesos/mesos-1.1.0/_build/src/java/target/protobuf-java-2.6.1.jar				\
	  org.apache.mesos.MesosSchedulerDriver
/usr/lib/jvm/java-7-openjdk-amd64/bin/javah -d java/jni				\
	-classpath java/target/mesos-1.1.0.jar:/mesos/mesos-1.1.0/_build/src/java/target/protobuf-java-2.6.1.jar				\
	  org.apache.mesos.state.AbstractState
/usr/lib/jvm/java-7-openjdk-amd64/bin/javah -d java/jni				\
	-classpath java/target/mesos-1.1.0.jar:/mesos/mesos-1.1.0/_build/src/java/target/protobuf-java-2.6.1.jar				\
	  org.apache.mesos.state.LevelDBState
/usr/lib/jvm/java-7-openjdk-amd64/bin/javah -d java/jni				\
	-classpath java/target/mesos-1.1.0.jar:/mesos/mesos-1.1.0/_build/src/java/target/protobuf-java-2.6.1.jar				\
	  org.apache.mesos.state.LogState
/usr/lib/jvm/java-7-openjdk-amd64/bin/javah -d java/jni				\
	-classpath java/target/mesos-1.1.0.jar:/mesos/mesos-1.1.0/_build/src/java/target/protobuf-java-2.6.1.jar				\
	  org.apache.mesos.state.Variable
/usr/lib/jvm/java-7-openjdk-amd64/bin/javah -d java/jni				\
	-classpath java/target/mesos-1.1.0.jar:/mesos/mesos-1.1.0/_build/src/java/target/protobuf-java-2.6.1.jar				\
	  org.apache.mesos.state.ZooKeeperState
/usr/lib/jvm/java-7-openjdk-amd64/bin/javah -d java/jni				\
	-classpath java/target/mesos-1.1.0.jar:/mesos/mesos-1.1.0/_build/src/java/target/protobuf-java-2.6.1.jar				\
	  org.apache.mesos.v1.scheduler.V1Mesos
/usr/lib/jvm/java-7-openjdk-amd64/bin/javah -d java/jni				\
	-classpath java/target/mesos-1.1.0.jar:/mesos/mesos-1.1.0/_build/src/java/target/protobuf-java-2.6.1.jar				\
	  org.apache.mesos.v1.scheduler.V0Mesos
make  all-am
make[3]: Entering directory `/mesos/mesos-1.1.0/_build/src'
/bin/bash ../libtool  --tag=CXX   --mode=compile g++ -DPACKAGE_NAME=\"mesos\" -DPACKAGE_TARNAME=\"mesos\" -DPACKAGE_VERSION=\"1.1.0\" -DPACKAGE_STRING=\"mesos\ 1.1.0\" -DPACKAGE_BUGREPORT=\"\" -DPACKAGE_URL=\"\" -DPACKAGE=\"mesos\" -DVERSION=\"1.1.0\" -DSTDC_HEADERS=1 -DHAVE_SYS_TYPES_H=1 -DHAVE_SYS_STAT_H=1 -DHAVE_STDLIB_H=1 -DHAVE_STRING_H=1 -DHAVE_MEMORY_H=1 -DHAVE_STRINGS_H=1 -DHAVE_INTTYPES_H=1 -DHAVE_STDINT_H=1 -DHAVE_UNISTD_H=1 -DHAVE_DLFCN_H=1 -DLT_OBJDIR=\".libs/\" -DHAVE_CXX11=1 -DHAVE_PTHREAD_PRIO_INHERIT=1 -DHAVE_PTHREAD=1 -DHAVE_LIBZ=1 -DHAVE_FTS_H=1 -DHAVE_APR_POOLS_H=1 -DHAVE_LIBAPR_1=1 -DHAVE_LIBCURL=1 -DMESOS_HAS_JAVA=1 -DHAVE_PYTHON=\"2.7\" -DMESOS_HAS_PYTHON=1 -DHAVE_LIBSASL2=1 -DHAVE_SVN_VERSION_H=1 -DHAVE_LIBSVN_SUBR_1=1 -DHAVE_SVN_DELTA_H=1 -DHAVE_LIBSVN_DELTA_1=1 -DHAVE_LIBZ=1 -I. -I../../src   -Wall -Werror -Wsign-compare -DLIBDIR=\"/mesos/mesos-1.1.0/_inst/lib\" -DPKGLIBEXECDIR=\"/mesos/mesos-1.1.0/_inst/libexec/mesos\" -DPKGDATADIR=\"/mesos/mesos-1.1.0/_inst/share/mesos\" -DPKGMODULEDIR=\"/mesos/mesos-1.1.0/_inst/lib/mesos/modules\" -I../../include -I../include -I../include/mesos -DPICOJSON_USE_INT64 -D__STDC_FORMAT_MACROS -isystem ../3rdparty/boost-1.53.0 -I../3rdparty/elfio-3.2 -I../3rdparty/glog-0.3.3/src -I../3rdparty/leveldb-1.4/include -I../../3rdparty/libprocess/include -I../3rdparty/nvml-352.79 -I../3rdparty/picojson-1.3.0 -I../3rdparty/protobuf-2.6.1/src -I../../3rdparty/stout/include -I../3rdparty/zookeeper-3.4.8/src/c/include -I../3rdparty/zookeeper-3.4.8/src/c/generated -DHAS_AUTHENTICATION=1 -I/usr/include/subversion-1 -I/usr/include/apr-1 -I/usr/include/apr-1.0  -pthread -g1 -O0 -Wno-unused-local-typedefs -std=c++11 -MT slave/containerizer/mesos/libmesos_no_3rdparty_la-linux_launcher.lo -MD -MP -MF slave/containerizer/mesos/.deps/libmesos_no_3rdparty_la-linux_launcher.Tpo -c -o slave/containerizer/mesos/libmesos_no_3rdparty_la-linux_launcher.lo `test -f 'slave/containerizer/mesos/linux_launcher.cpp' || echo '../../src/'`slave/containerizer/mesos/linux_launcher.cpp
/bin/bash ../libtool  --tag=CXX   --mode=compile g++ -DPACKAGE_NAME=\"mesos\" -DPACKAGE_TARNAME=\"mesos\" -DPACKAGE_VERSION=\"1.1.0\" -DPACKAGE_STRING=\"mesos\ 1.1.0\" -DPACKAGE_BUGREPORT=\"\" -DPACKAGE_URL=\"\" -DPACKAGE=\"mesos\" -DVERSION=\"1.1.0\" -DSTDC_HEADERS=1 -DHAVE_SYS_TYPES_H=1 -DHAVE_SYS_STAT_H=1 -DHAVE_STDLIB_H=1 -DHAVE_STRING_H=1 -DHAVE_MEMORY_H=1 -DHAVE_STRINGS_H=1 -DHAVE_INTTYPES_H=1 -DHAVE_STDINT_H=1 -DHAVE_UNISTD_H=1 -DHAVE_DLFCN_H=1 -DLT_OBJDIR=\".libs/\" -DHAVE_CXX11=1 -DHAVE_PTHREAD_PRIO_INHERIT=1 -DHAVE_PTHREAD=1 -DHAVE_LIBZ=1 -DHAVE_FTS_H=1 -DHAVE_APR_POOLS_H=1 -DHAVE_LIBAPR_1=1 -DHAVE_LIBCURL=1 -DMESOS_HAS_JAVA=1 -DHAVE_PYTHON=\"2.7\" -DMESOS_HAS_PYTHON=1 -DHAVE_LIBSASL2=1 -DHAVE_SVN_VERSION_H=1 -DHAVE_LIBSVN_SUBR_1=1 -DHAVE_SVN_DELTA_H=1 -DHAVE_LIBSVN_DELTA_1=1 -DHAVE_LIBZ=1 -I. -I../../src   -Wall -Werror -Wsign-compare -DLIBDIR=\"/mesos/mesos-1.1.0/_inst/lib\" -DPKGLIBEXECDIR=\"/mesos/mesos-1.1.0/_inst/libexec/mesos\" -DPKGDATADIR=\"/mesos/mesos-1.1.0/_inst/share/mesos\" -DPKGMODULEDIR=\"/mesos/mesos-1.1.0/_inst/lib/mesos/modules\" -I../../include -I../include -I../include/mesos -DPICOJSON_USE_INT64 -D__STDC_FORMAT_MACROS -isystem ../3rdparty/boost-1.53.0 -I../3rdparty/elfio-3.2 -I../3rdparty/glog-0.3.3/src -I../3rdparty/leveldb-1.4/include -I../../3rdparty/libprocess/include -I../3rdparty/nvml-352.79 -I../3rdparty/picojson-1.3.0 -I../3rdparty/protobuf-2.6.1/src -I../../3rdparty/stout/include -I../3rdparty/zookeeper-3.4.8/src/c/include -I../3rdparty/zookeeper-3.4.8/src/c/generated -DHAS_AUTHENTICATION=1 -I/usr/include/subversion-1 -I/usr/include/apr-1 -I/usr/include/apr-1.0  -pthread -g1 -O0 -Wno-unused-local-typedefs -std=c++11 -MT slave/containerizer/mesos/isolators/docker/volume/libmesos_no_3rdparty_la-isolator.lo -MD -MP -MF slave/containerizer/mesos/isolators/docker/volume/.deps/libmesos_no_3rdparty_la-isolator.Tpo -c -o slave/containerizer/mesos/isolators/docker/volume/libmesos_no_3rdparty_la-isolator.lo `test -f 'slave/containerizer/mesos/isolators/docker/volume/isolator.cpp' || echo '../../src/'`slave/containerizer/mesos/isolators/docker/volume/isolator.cpp
/bin/bash ../libtool  --tag=CXX   --mode=compile g++ -DPACKAGE_NAME=\"mesos\" -DPACKAGE_TARNAME=\"mesos\" -DPACKAGE_VERSION=\"1.1.0\" -DPACKAGE_STRING=\"mesos\ 1.1.0\" -DPACKAGE_BUGREPORT=\"\" -DPACKAGE_URL=\"\" -DPACKAGE=\"mesos\" -DVERSION=\"1.1.0\" -DSTDC_HEADERS=1 -DHAVE_SYS_TYPES_H=1 -DHAVE_SYS_STAT_H=1 -DHAVE_STDLIB_H=1 -DHAVE_STRING_H=1 -DHAVE_MEMORY_H=1 -DHAVE_STRINGS_H=1 -DHAVE_INTTYPES_H=1 -DHAVE_STDINT_H=1 -DHAVE_UNISTD_H=1 -DHAVE_DLFCN_H=1 -DLT_OBJDIR=\".libs/\" -DHAVE_CXX11=1 -DHAVE_PTHREAD_PRIO_INHERIT=1 -DHAVE_PTHREAD=1 -DHAVE_LIBZ=1 -DHAVE_FTS_H=1 -DHAVE_APR_POOLS_H=1 -DHAVE_LIBAPR_1=1 -DHAVE_LIBCURL=1 -DMESOS_HAS_JAVA=1 -DHAVE_PYTHON=\"2.7\" -DMESOS_HAS_PYTHON=1 -DHAVE_LIBSASL2=1 -DHAVE_SVN_VERSION_H=1 -DHAVE_LIBSVN_SUBR_1=1 -DHAVE_SVN_DELTA_H=1 -DHAVE_LIBSVN_DELTA_1=1 -DHAVE_LIBZ=1 -I. -I../../src   -Wall -Werror -Wsign-compare -DLIBDIR=\"/mesos/mesos-1.1.0/_inst/lib\" -DPKGLIBEXECDIR=\"/mesos/mesos-1.1.0/_inst/libexec/mesos\" -DPKGDATADIR=\"/mesos/mesos-1.1.0/_inst/share/mesos\" -DPKGMODULEDIR=\"/mesos/mesos-1.1.0/_inst/lib/mesos/modules\" -I../../include -I../include -I../include/mesos -DPICOJSON_USE_INT64 -D__STDC_FORMAT_MACROS -isystem ../3rdparty/boost-1.53.0 -I../3rdparty/elfio-3.2 -I../3rdparty/glog-0.3.3/src -I../3rdparty/leveldb-1.4/include -I../../3rdparty/libprocess/include -I../3rdparty/nvml-352.79 -I../3rdparty/picojson-1.3.0 -I../3rdparty/protobuf-2.6.1/src -I../../3rdparty/stout/include -I../3rdparty/zookeeper-3.4.8/src/c/include -I../3rdparty/zookeeper-3.4.8/src/c/generated -DHAS_AUTHENTICATION=1 -I/usr/include/subversion-1 -I/usr/include/apr-1 -I/usr/include/apr-1.0  -pthread -g1 -O0 -Wno-unused-local-typedefs -std=c++11 -MT slave/containerizer/mesos/isolators/filesystem/libmesos_no_3rdparty_la-linux.lo -MD -MP -MF slave/containerizer/mesos/isolators/filesystem/.deps/libmesos_no_3rdparty_la-linux.Tpo -c -o slave/containerizer/mesos/isolators/filesystem/libmesos_no_3rdparty_la-linux.lo `test -f 'slave/containerizer/mesos/isolators/filesystem/linux.cpp' || echo '../../src/'`slave/containerizer/mesos/isolators/filesystem/linux.cpp
/bin/bash ../libtool  --tag=CXX   --mode=compile g++ -DPACKAGE_NAME=\"mesos\" -DPACKAGE_TARNAME=\"mesos\" -DPACKAGE_VERSION=\"1.1.0\" -DPACKAGE_STRING=\"mesos\ 1.1.0\" -DPACKAGE_BUGREPORT=\"\" -DPACKAGE_URL=\"\" -DPACKAGE=\"mesos\" -DVERSION=\"1.1.0\" -DSTDC_HEADERS=1 -DHAVE_SYS_TYPES_H=1 -DHAVE_SYS_STAT_H=1 -DHAVE_STDLIB_H=1 -DHAVE_STRING_H=1 -DHAVE_MEMORY_H=1 -DHAVE_STRINGS_H=1 -DHAVE_INTTYPES_H=1 -DHAVE_STDINT_H=1 -DHAVE_UNISTD_H=1 -DHAVE_DLFCN_H=1 -DLT_OBJDIR=\".libs/\" -DHAVE_CXX11=1 -DHAVE_PTHREAD_PRIO_INHERIT=1 -DHAVE_PTHREAD=1 -DHAVE_LIBZ=1 -DHAVE_FTS_H=1 -DHAVE_APR_POOLS_H=1 -DHAVE_LIBAPR_1=1 -DHAVE_LIBCURL=1 -DMESOS_HAS_JAVA=1 -DHAVE_PYTHON=\"2.7\" -DMESOS_HAS_PYTHON=1 -DHAVE_LIBSASL2=1 -DHAVE_SVN_VERSION_H=1 -DHAVE_LIBSVN_SUBR_1=1 -DHAVE_SVN_DELTA_H=1 -DHAVE_LIBSVN_DELTA_1=1 -DHAVE_LIBZ=1 -I. -I../../src   -Wall -Werror -Wsign-compare -DLIBDIR=\"/mesos/mesos-1.1.0/_inst/lib\" -DPKGLIBEXECDIR=\"/mesos/mesos-1.1.0/_inst/libexec/mesos\" -DPKGDATADIR=\"/mesos/mesos-1.1.0/_inst/share/mesos\" -DPKGMODULEDIR=\"/mesos/mesos-1.1.0/_inst/lib/mesos/modules\" -I../../include -I../include -I../include/mesos -DPICOJSON_USE_INT64 -D__STDC_FORMAT_MACROS -isystem ../3rdparty/boost-1.53.0 -I../3rdparty/elfio-3.2 -I../3rdparty/glog-0.3.3/src -I../3rdparty/leveldb-1.4/include -I../../3rdparty/libprocess/include -I../3rdparty/nvml-352.79 -I../3rdparty/picojson-1.3.0 -I../3rdparty/protobuf-2.6.1/src -I../../3rdparty/stout/include -I../3rdparty/zookeeper-3.4.8/src/c/include -I../3rdparty/zookeeper-3.4.8/src/c/generated -DHAS_AUTHENTICATION=1 -I/usr/include/subversion-1 -I/usr/include/apr-1 -I/usr/include/apr-1.0  -pthread -g1 -O0 -Wno-unused-local-typedefs -std=c++11 -MT slave/containerizer/mesos/isolators/filesystem/libmesos_no_3rdparty_la-shared.lo -MD -MP -MF slave/containerizer/mesos/isolators/filesystem/.deps/libmesos_no_3rdparty_la-shared.Tpo -c -o slave/containerizer/mesos/isolators/filesystem/libmesos_no_3rdparty_la-shared.lo `test -f 'slave/containerizer/mesos/isolators/filesystem/shared.cpp' || echo '../../src/'`slave/containerizer/mesos/isolators/filesystem/shared.cpp
/bin/bash ../libtool  --tag=CXX   --mode=compile g++ -DPACKAGE_NAME=\"mesos\" -DPACKAGE_TARNAME=\"mesos\" -DPACKAGE_VERSION=\"1.1.0\" -DPACKAGE_STRING=\"mesos\ 1.1.0\" -DPACKAGE_BUGREPORT=\"\" -DPACKAGE_URL=\"\" -DPACKAGE=\"mesos\" -DVERSION=\"1.1.0\" -DSTDC_HEADERS=1 -DHAVE_SYS_TYPES_H=1 -DHAVE_SYS_STAT_H=1 -DHAVE_STDLIB_H=1 -DHAVE_STRING_H=1 -DHAVE_MEMORY_H=1 -DHAVE_STRINGS_H=1 -DHAVE_INTTYPES_H=1 -DHAVE_STDINT_H=1 -DHAVE_UNISTD_H=1 -DHAVE_DLFCN_H=1 -DLT_OBJDIR=\".libs/\" -DHAVE_CXX11=1 -DHAVE_PTHREAD_PRIO_INHERIT=1 -DHAVE_PTHREAD=1 -DHAVE_LIBZ=1 -DHAVE_FTS_H=1 -DHAVE_APR_POOLS_H=1 -DHAVE_LIBAPR_1=1 -DHAVE_LIBCURL=1 -DMESOS_HAS_JAVA=1 -DHAVE_PYTHON=\"2.7\" -DMESOS_HAS_PYTHON=1 -DHAVE_LIBSASL2=1 -DHAVE_SVN_VERSION_H=1 -DHAVE_LIBSVN_SUBR_1=1 -DHAVE_SVN_DELTA_H=1 -DHAVE_LIBSVN_DELTA_1=1 -DHAVE_LIBZ=1 -I. -I../../src   -Wall -Werror -Wsign-compare -DLIBDIR=\"/mesos/mesos-1.1.0/_inst/lib\" -DPKGLIBEXECDIR=\"/mesos/mesos-1.1.0/_inst/libexec/mesos\" -DPKGDATADIR=\"/mesos/mesos-1.1.0/_inst/share/mesos\" -DPKGMODULEDIR=\"/mesos/mesos-1.1.0/_inst/lib/mesos/modules\" -I../../include -I../include -I../include/mesos -DPICOJSON_USE_INT64 -D__STDC_FORMAT_MACROS -isystem ../3rdparty/boost-1.53.0 -I../3rdparty/elfio-3.2 -I../3rdparty/glog-0.3.3/src -I../3rdparty/leveldb-1.4/include -I../../3rdparty/libprocess/include -I../3rdparty/nvml-352.79 -I../3rdparty/picojson-1.3.0 -I../3rdparty/protobuf-2.6.1/src -I../../3rdparty/stout/include -I../3rdparty/zookeeper-3.4.8/src/c/include -I../3rdparty/zookeeper-3.4.8/src/c/generated -DHAS_AUTHENTICATION=1 -I/usr/include/subversion-1 -I/usr/include/apr-1 -I/usr/include/apr-1.0  -pthread -g1 -O0 -Wno-unused-local-typedefs -std=c++11 -MT slave/containerizer/mesos/isolators/network/cni/libmesos_no_3rdparty_la-cni.lo -MD -MP -MF slave/containerizer/mesos/isolators/network/cni/.deps/libmesos_no_3rdparty_la-cni.Tpo -c -o slave/containerizer/mesos/isolators/network/cni/libmesos_no_3rdparty_la-cni.lo `test -f 'slave/containerizer/mesos/isolators/network/cni/cni.cpp' || echo '../../src/'`slave/containerizer/mesos/isolators/network/cni/cni.cpp
/bin/bash ../libtool  --tag=CXX   --mode=compile g++ -DPACKAGE_NAME=\"mesos\" -DPACKAGE_TARNAME=\"mesos\" -DPACKAGE_VERSION=\"1.1.0\" -DPACKAGE_STRING=\"mesos\ 1.1.0\" -DPACKAGE_BUGREPORT=\"\" -DPACKAGE_URL=\"\" -DPACKAGE=\"mesos\" -DVERSION=\"1.1.0\" -DSTDC_HEADERS=1 -DHAVE_SYS_TYPES_H=1 -DHAVE_SYS_STAT_H=1 -DHAVE_STDLIB_H=1 -DHAVE_STRING_H=1 -DHAVE_MEMORY_H=1 -DHAVE_STRINGS_H=1 -DHAVE_INTTYPES_H=1 -DHAVE_STDINT_H=1 -DHAVE_UNISTD_H=1 -DHAVE_DLFCN_H=1 -DLT_OBJDIR=\".libs/\" -DHAVE_CXX11=1 -DHAVE_PTHREAD_PRIO_INHERIT=1 -DHAVE_PTHREAD=1 -DHAVE_LIBZ=1 -DHAVE_FTS_H=1 -DHAVE_APR_POOLS_H=1 -DHAVE_LIBAPR_1=1 -DHAVE_LIBCURL=1 -DMESOS_HAS_JAVA=1 -DHAVE_PYTHON=\"2.7\" -DMESOS_HAS_PYTHON=1 -DHAVE_LIBSASL2=1 -DHAVE_SVN_VERSION_H=1 -DHAVE_LIBSVN_SUBR_1=1 -DHAVE_SVN_DELTA_H=1 -DHAVE_LIBSVN_DELTA_1=1 -DHAVE_LIBZ=1 -I. -I../../src   -Wall -Werror -Wsign-compare -DLIBDIR=\"/mesos/mesos-1.1.0/_inst/lib\" -DPKGLIBEXECDIR=\"/mesos/mesos-1.1.0/_inst/libexec/mesos\" -DPKGDATADIR=\"/mesos/mesos-1.1.0/_inst/share/mesos\" -DPKGMODULEDIR=\"/mesos/mesos-1.1.0/_inst/lib/mesos/modules\" -I../../include -I../include -I../include/mesos -DPICOJSON_USE_INT64 -D__STDC_FORMAT_MACROS -isystem ../3rdparty/boost-1.53.0 -I../3rdparty/elfio-3.2 -I../3rdparty/glog-0.3.3/src -I../3rdparty/leveldb-1.4/include -I../../3rdparty/libprocess/include -I../3rdparty/nvml-352.79 -I../3rdparty/picojson-1.3.0 -I../3rdparty/protobuf-2.6.1/src -I../../3rdparty/stout/include -I../3rdparty/zookeeper-3.4.8/src/c/include -I../3rdparty/zookeeper-3.4.8/src/c/generated -DHAS_AUTHENTICATION=1 -I/usr/include/subversion-1 -I/usr/include/apr-1 -I/usr/include/apr-1.0  -pthread -g1 -O0 -Wno-unused-local-typedefs -std=c++11 -MT slave/containerizer/mesos/provisioner/backends/libmesos_no_3rdparty_la-aufs.lo -MD -MP -MF slave/containerizer/mesos/provisioner/backends/.deps/libmesos_no_3rdparty_la-aufs.Tpo -c -o slave/containerizer/mesos/provisioner/backends/libmesos_no_3rdparty_la-aufs.lo `test -f 'slave/containerizer/mesos/provisioner/backends/aufs.cpp' || echo '../../src/'`slave/containerizer/mesos/provisioner/backends/aufs.cpp
/bin/bash ../libtool  --tag=CXX   --mode=compile g++ -DPACKAGE_NAME=\"mesos\" -DPACKAGE_TARNAME=\"mesos\" -DPACKAGE_VERSION=\"1.1.0\" -DPACKAGE_STRING=\"mesos\ 1.1.0\" -DPACKAGE_BUGREPORT=\"\" -DPACKAGE_URL=\"\" -DPACKAGE=\"mesos\" -DVERSION=\"1.1.0\" -DSTDC_HEADERS=1 -DHAVE_SYS_TYPES_H=1 -DHAVE_SYS_STAT_H=1 -DHAVE_STDLIB_H=1 -DHAVE_STRING_H=1 -DHAVE_MEMORY_H=1 -DHAVE_STRINGS_H=1 -DHAVE_INTTYPES_H=1 -DHAVE_STDINT_H=1 -DHAVE_UNISTD_H=1 -DHAVE_DLFCN_H=1 -DLT_OBJDIR=\".libs/\" -DHAVE_CXX11=1 -DHAVE_PTHREAD_PRIO_INHERIT=1 -DHAVE_PTHREAD=1 -DHAVE_LIBZ=1 -DHAVE_FTS_H=1 -DHAVE_APR_POOLS_H=1 -DHAVE_LIBAPR_1=1 -DHAVE_LIBCURL=1 -DMESOS_HAS_JAVA=1 -DHAVE_PYTHON=\"2.7\" -DMESOS_HAS_PYTHON=1 -DHAVE_LIBSASL2=1 -DHAVE_SVN_VERSION_H=1 -DHAVE_LIBSVN_SUBR_1=1 -DHAVE_SVN_DELTA_H=1 -DHAVE_LIBSVN_DELTA_1=1 -DHAVE_LIBZ=1 -I. -I../../src   -Wall -Werror -Wsign-compare -DLIBDIR=\"/mesos/mesos-1.1.0/_inst/lib\" -DPKGLIBEXECDIR=\"/mesos/mesos-1.1.0/_inst/libexec/mesos\" -DPKGDATADIR=\"/mesos/mesos-1.1.0/_inst/share/mesos\" -DPKGMODULEDIR=\"/mesos/mesos-1.1.0/_inst/lib/mesos/modules\" -I../../include -I../include -I../include/mesos -DPICOJSON_USE_INT64 -D__STDC_FORMAT_MACROS -isystem ../3rdparty/boost-1.53.0 -I../3rdparty/elfio-3.2 -I../3rdparty/glog-0.3.3/src -I../3rdparty/leveldb-1.4/include -I../../3rdparty/libprocess/include -I../3rdparty/nvml-352.79 -I../3rdparty/picojson-1.3.0 -I../3rdparty/protobuf-2.6.1/src -I../../3rdparty/stout/include -I../3rdparty/zookeeper-3.4.8/src/c/include -I../3rdparty/zookeeper-3.4.8/src/c/generated -DHAS_AUTHENTICATION=1 -I/usr/include/subversion-1 -I/usr/include/apr-1 -I/usr/include/apr-1.0  -pthread -g1 -O0 -Wno-unused-local-typedefs -std=c++11 -MT slave/containerizer/mesos/provisioner/backends/libmesos_no_3rdparty_la-bind.lo -MD -MP -MF slave/containerizer/mesos/provisioner/backends/.deps/libmesos_no_3rdparty_la-bind.Tpo -c -o slave/containerizer/mesos/provisioner/backends/libmesos_no_3rdparty_la-bind.lo `test -f 'slave/containerizer/mesos/provisioner/backends/bind.cpp' || echo '../../src/'`slave/containerizer/mesos/provisioner/backends/bind.cpp
/bin/bash ../libtool  --tag=CXX   --mode=compile g++ -DPACKAGE_NAME=\"mesos\" -DPACKAGE_TARNAME=\"mesos\" -DPACKAGE_VERSION=\"1.1.0\" -DPACKAGE_STRING=\"mesos\ 1.1.0\" -DPACKAGE_BUGREPORT=\"\" -DPACKAGE_URL=\"\" -DPACKAGE=\"mesos\" -DVERSION=\"1.1.0\" -DSTDC_HEADERS=1 -DHAVE_SYS_TYPES_H=1 -DHAVE_SYS_STAT_H=1 -DHAVE_STDLIB_H=1 -DHAVE_STRING_H=1 -DHAVE_MEMORY_H=1 -DHAVE_STRINGS_H=1 -DHAVE_INTTYPES_H=1 -DHAVE_STDINT_H=1 -DHAVE_UNISTD_H=1 -DHAVE_DLFCN_H=1 -DLT_OBJDIR=\".libs/\" -DHAVE_CXX11=1 -DHAVE_PTHREAD_PRIO_INHERIT=1 -DHAVE_PTHREAD=1 -DHAVE_LIBZ=1 -DHAVE_FTS_H=1 -DHAVE_APR_POOLS_H=1 -DHAVE_LIBAPR_1=1 -DHAVE_LIBCURL=1 -DMESOS_HAS_JAVA=1 -DHAVE_PYTHON=\"2.7\" -DMESOS_HAS_PYTHON=1 -DHAVE_LIBSASL2=1 -DHAVE_SVN_VERSION_H=1 -DHAVE_LIBSVN_SUBR_1=1 -DHAVE_SVN_DELTA_H=1 -DHAVE_LIBSVN_DELTA_1=1 -DHAVE_LIBZ=1 -I. -I../../src   -Wall -Werror -Wsign-compare -DLIBDIR=\"/mesos/mesos-1.1.0/_inst/lib\" -DPKGLIBEXECDIR=\"/mesos/mesos-1.1.0/_inst/libexec/mesos\" -DPKGDATADIR=\"/mesos/mesos-1.1.0/_inst/share/mesos\" -DPKGMODULEDIR=\"/mesos/mesos-1.1.0/_inst/lib/mesos/modules\" -I../../include -I../include -I../include/mesos -DPICOJSON_USE_INT64 -D__STDC_FORMAT_MACROS -isystem ../3rdparty/boost-1.53.0 -I../3rdparty/elfio-3.2 -I../3rdparty/glog-0.3.3/src -I../3rdparty/leveldb-1.4/include -I../../3rdparty/libprocess/include -I../3rdparty/nvml-352.79 -I../3rdparty/picojson-1.3.0 -I../3rdparty/protobuf-2.6.1/src -I../../3rdparty/stout/include -I../3rdparty/zookeeper-3.4.8/src/c/include -I../3rdparty/zookeeper-3.4.8/src/c/generated -DHAS_AUTHENTICATION=1 -I/usr/include/subversion-1 -I/usr/include/apr-1 -I/usr/include/apr-1.0  -pthread -g1 -O0 -Wno-unused-local-typedefs -std=c++11 -MT slave/containerizer/mesos/provisioner/backends/libmesos_no_3rdparty_la-overlay.lo -MD -MP -MF slave/containerizer/mesos/provisioner/backends/.deps/libmesos_no_3rdparty_la-overlay.Tpo -c -o slave/containerizer/mesos/provisioner/backends/libmesos_no_3rdparty_la-overlay.lo `test -f 'slave/containerizer/mesos/provisioner/backends/overlay.cpp' || echo '../../src/'`slave/containerizer/mesos/provisioner/backends/overlay.cpp
libtool: compile:  g++ -DPACKAGE_NAME=\"mesos\" -DPACKAGE_TARNAME=\"mesos\" -DPACKAGE_VERSION=\"1.1.0\" "-DPACKAGE_STRING=\"mesos 1.1.0\"" -DPACKAGE_BUGREPORT=\"\" -DPACKAGE_URL=\"\" -DPACKAGE=\"mesos\" -DVERSION=\"1.1.0\" -DSTDC_HEADERS=1 -DHAVE_SYS_TYPES_H=1 -DHAVE_SYS_STAT_H=1 -DHAVE_STDLIB_H=1 -DHAVE_STRING_H=1 -DHAVE_MEMORY_H=1 -DHAVE_STRINGS_H=1 -DHAVE_INTTYPES_H=1 -DHAVE_STDINT_H=1 -DHAVE_UNISTD_H=1 -DHAVE_DLFCN_H=1 -DLT_OBJDIR=\".libs/\" -DHAVE_CXX11=1 -DHAVE_PTHREAD_PRIO_INHERIT=1 -DHAVE_PTHREAD=1 -DHAVE_LIBZ=1 -DHAVE_FTS_H=1 -DHAVE_APR_POOLS_H=1 -DHAVE_LIBAPR_1=1 -DHAVE_LIBCURL=1 -DMESOS_HAS_JAVA=1 -DHAVE_PYTHON=\"2.7\" -DMESOS_HAS_PYTHON=1 -DHAVE_LIBSASL2=1 -DHAVE_SVN_VERSION_H=1 -DHAVE_LIBSVN_SUBR_1=1 -DHAVE_SVN_DELTA_H=1 -DHAVE_LIBSVN_DELTA_1=1 -DHAVE_LIBZ=1 -I. -I../../src -Wall -Werror -Wsign-compare -DLIBDIR=\"/mesos/mesos-1.1.0/_inst/lib\" -DPKGLIBEXECDIR=\"/mesos/mesos-1.1.0/_inst/libexec/mesos\" -DPKGDATADIR=\"/mesos/mesos-1.1.0/_inst/share/mesos\" -DPKGMODULEDIR=\"/mesos/mesos-1.1.0/_inst/lib/mesos/modules\" -I../../include -I../include -I../include/mesos -DPICOJSON_USE_INT64 -D__STDC_FORMAT_MACROS -isystem ../3rdparty/boost-1.53.0 -I../3rdparty/elfio-3.2 -I../3rdparty/glog-0.3.3/src -I../3rdparty/leveldb-1.4/include -I../../3rdparty/libprocess/include -I../3rdparty/nvml-352.79 -I../3rdparty/picojson-1.3.0 -I../3rdparty/protobuf-2.6.1/src -I../../3rdparty/stout/include -I../3rdparty/zookeeper-3.4.8/src/c/include -I../3rdparty/zookeeper-3.4.8/src/c/generated -DHAS_AUTHENTICATION=1 -I/usr/include/subversion-1 -I/usr/include/apr-1 -I/usr/include/apr-1.0 -pthread -g1 -O0 -Wno-unused-local-typedefs -std=c++11 -MT slave/containerizer/mesos/libmesos_no_3rdparty_la-linux_launcher.lo -MD -MP -MF slave/containerizer/mesos/.deps/libmesos_no_3rdparty_la-linux_launcher.Tpo -c ../../src/slave/containerizer/mesos/linux_launcher.cpp  -fPIC -DPIC -o slave/containerizer/mesos/.libs/libmesos_no_3rdparty_la-linux_launcher.o
libtool: compile:  g++ -DPACKAGE_NAME=\"mesos\" -DPACKAGE_TARNAME=\"mesos\" -DPACKAGE_VERSION=\"1.1.0\" "-DPACKAGE_STRING=\"mesos 1.1.0\"" -DPACKAGE_BUGREPORT=\"\" -DPACKAGE_URL=\"\" -DPACKAGE=\"mesos\" -DVERSION=\"1.1.0\" -DSTDC_HEADERS=1 -DHAVE_SYS_TYPES_H=1 -DHAVE_SYS_STAT_H=1 -DHAVE_STDLIB_H=1 -DHAVE_STRING_H=1 -DHAVE_MEMORY_H=1 -DHAVE_STRINGS_H=1 -DHAVE_INTTYPES_H=1 -DHAVE_STDINT_H=1 -DHAVE_UNISTD_H=1 -DHAVE_DLFCN_H=1 -DLT_OBJDIR=\".libs/\" -DHAVE_CXX11=1 -DHAVE_PTHREAD_PRIO_INHERIT=1 -DHAVE_PTHREAD=1 -DHAVE_LIBZ=1 -DHAVE_FTS_H=1 -DHAVE_APR_POOLS_H=1 -DHAVE_LIBAPR_1=1 -DHAVE_LIBCURL=1 -DMESOS_HAS_JAVA=1 -DHAVE_PYTHON=\"2.7\" -DMESOS_HAS_PYTHON=1 -DHAVE_LIBSASL2=1 -DHAVE_SVN_VERSION_H=1 -DHAVE_LIBSVN_SUBR_1=1 -DHAVE_SVN_DELTA_H=1 -DHAVE_LIBSVN_DELTA_1=1 -DHAVE_LIBZ=1 -I. -I../../src -Wall -Werror -Wsign-compare -DLIBDIR=\"/mesos/mesos-1.1.0/_inst/lib\" -DPKGLIBEXECDIR=\"/mesos/mesos-1.1.0/_inst/libexec/mesos\" -DPKGDATADIR=\"/mesos/mesos-1.1.0/_inst/share/mesos\" -DPKGMODULEDIR=\"/mesos/mesos-1.1.0/_inst/lib/mesos/modules\" -I../../include -I../include -I../include/mesos -DPICOJSON_USE_INT64 -D__STDC_FORMAT_MACROS -isystem ../3rdparty/boost-1.53.0 -I../3rdparty/elfio-3.2 -I../3rdparty/glog-0.3.3/src -I../3rdparty/leveldb-1.4/include -I../../3rdparty/libprocess/include -I../3rdparty/nvml-352.79 -I../3rdparty/picojson-1.3.0 -I../3rdparty/protobuf-2.6.1/src -I../../3rdparty/stout/include -I../3rdparty/zookeeper-3.4.8/src/c/include -I../3rdparty/zookeeper-3.4.8/src/c/generated -DHAS_AUTHENTICATION=1 -I/usr/include/subversion-1 -I/usr/include/apr-1 -I/usr/include/apr-1.0 -pthread -g1 -O0 -Wno-unused-local-typedefs -std=c++11 -MT slave/containerizer/mesos/provisioner/backends/libmesos_no_3rdparty_la-overlay.lo -MD -MP -MF slave/containerizer/mesos/provisioner/backends/.deps/libmesos_no_3rdparty_la-overlay.Tpo -c ../../src/slave/containerizer/mesos/provisioner/backends/overlay.cpp  -fPIC -DPIC -o slave/containerizer/mesos/provisioner/backends/.libs/libmesos_no_3rdparty_la-overlay.o
libtool: compile:  g++ -DPACKAGE_NAME=\"mesos\" -DPACKAGE_TARNAME=\"mesos\" -DPACKAGE_VERSION=\"1.1.0\" "-DPACKAGE_STRING=\"mesos 1.1.0\"" -DPACKAGE_BUGREPORT=\"\" -DPACKAGE_URL=\"\" -DPACKAGE=\"mesos\" -DVERSION=\"1.1.0\" -DSTDC_HEADERS=1 -DHAVE_SYS_TYPES_H=1 -DHAVE_SYS_STAT_H=1 -DHAVE_STDLIB_H=1 -DHAVE_STRING_H=1 -DHAVE_MEMORY_H=1 -DHAVE_STRINGS_H=1 -DHAVE_INTTYPES_H=1 -DHAVE_STDINT_H=1 -DHAVE_UNISTD_H=1 -DHAVE_DLFCN_H=1 -DLT_OBJDIR=\".libs/\" -DHAVE_CXX11=1 -DHAVE_PTHREAD_PRIO_INHERIT=1 -DHAVE_PTHREAD=1 -DHAVE_LIBZ=1 -DHAVE_FTS_H=1 -DHAVE_APR_POOLS_H=1 -DHAVE_LIBAPR_1=1 -DHAVE_LIBCURL=1 -DMESOS_HAS_JAVA=1 -DHAVE_PYTHON=\"2.7\" -DMESOS_HAS_PYTHON=1 -DHAVE_LIBSASL2=1 -DHAVE_SVN_VERSION_H=1 -DHAVE_LIBSVN_SUBR_1=1 -DHAVE_SVN_DELTA_H=1 -DHAVE_LIBSVN_DELTA_1=1 -DHAVE_LIBZ=1 -I. -I../../src -Wall -Werror -Wsign-compare -DLIBDIR=\"/mesos/mesos-1.1.0/_inst/lib\" -DPKGLIBEXECDIR=\"/mesos/mesos-1.1.0/_inst/libexec/mesos\" -DPKGDATADIR=\"/mesos/mesos-1.1.0/_inst/share/mesos\" -DPKGMODULEDIR=\"/mesos/mesos-1.1.0/_inst/lib/mesos/modules\" -I../../include -I../include -I../include/mesos -DPICOJSON_USE_INT64 -D__STDC_FORMAT_MACROS -isystem ../3rdparty/boost-1.53.0 -I../3rdparty/elfio-3.2 -I../3rdparty/glog-0.3.3/src -I../3rdparty/leveldb-1.4/include -I../../3rdparty/libprocess/include -I../3rdparty/nvml-352.79 -I../3rdparty/picojson-1.3.0 -I../3rdparty/protobuf-2.6.1/src -I../../3rdparty/stout/include -I../3rdparty/zookeeper-3.4.8/src/c/include -I../3rdparty/zookeeper-3.4.8/src/c/generated -DHAS_AUTHENTICATION=1 -I/usr/include/subversion-1 -I/usr/include/apr-1 -I/usr/include/apr-1.0 -pthread -g1 -O0 -Wno-unused-local-typedefs -std=c++11 -MT slave/containerizer/mesos/isolators/filesystem/libmesos_no_3rdparty_la-linux.lo -MD -MP -MF slave/containerizer/mesos/isolators/filesystem/.deps/libmesos_no_3rdparty_la-linux.Tpo -c ../../src/slave/containerizer/mesos/isolators/filesystem/linux.cpp  -fPIC -DPIC -o slave/containerizer/mesos/isolators/filesystem/.libs/libmesos_no_3rdparty_la-linux.o
libtool: compile:  g++ -DPACKAGE_NAME=\"mesos\" -DPACKAGE_TARNAME=\"mesos\" -DPACKAGE_VERSION=\"1.1.0\" "-DPACKAGE_STRING=\"mesos 1.1.0\"" -DPACKAGE_BUGREPORT=\"\" -DPACKAGE_URL=\"\" -DPACKAGE=\"mesos\" -DVERSION=\"1.1.0\" -DSTDC_HEADERS=1 -DHAVE_SYS_TYPES_H=1 -DHAVE_SYS_STAT_H=1 -DHAVE_STDLIB_H=1 -DHAVE_STRING_H=1 -DHAVE_MEMORY_H=1 -DHAVE_STRINGS_H=1 -DHAVE_INTTYPES_H=1 -DHAVE_STDINT_H=1 -DHAVE_UNISTD_H=1 -DHAVE_DLFCN_H=1 -DLT_OBJDIR=\".libs/\" -DHAVE_CXX11=1 -DHAVE_PTHREAD_PRIO_INHERIT=1 -DHAVE_PTHREAD=1 -DHAVE_LIBZ=1 -DHAVE_FTS_H=1 -DHAVE_APR_POOLS_H=1 -DHAVE_LIBAPR_1=1 -DHAVE_LIBCURL=1 -DMESOS_HAS_JAVA=1 -DHAVE_PYTHON=\"2.7\" -DMESOS_HAS_PYTHON=1 -DHAVE_LIBSASL2=1 -DHAVE_SVN_VERSION_H=1 -DHAVE_LIBSVN_SUBR_1=1 -DHAVE_SVN_DELTA_H=1 -DHAVE_LIBSVN_DELTA_1=1 -DHAVE_LIBZ=1 -I. -I../../src -Wall -Werror -Wsign-compare -DLIBDIR=\"/mesos/mesos-1.1.0/_inst/lib\" -DPKGLIBEXECDIR=\"/mesos/mesos-1.1.0/_inst/libexec/mesos\" -DPKGDATADIR=\"/mesos/mesos-1.1.0/_inst/share/mesos\" -DPKGMODULEDIR=\"/mesos/mesos-1.1.0/_inst/lib/mesos/modules\" -I../../include -I../include -I../include/mesos -DPICOJSON_USE_INT64 -D__STDC_FORMAT_MACROS -isystem ../3rdparty/boost-1.53.0 -I../3rdparty/elfio-3.2 -I../3rdparty/glog-0.3.3/src -I../3rdparty/leveldb-1.4/include -I../../3rdparty/libprocess/include -I../3rdparty/nvml-352.79 -I../3rdparty/picojson-1.3.0 -I../3rdparty/protobuf-2.6.1/src -I../../3rdparty/stout/include -I../3rdparty/zookeeper-3.4.8/src/c/include -I../3rdparty/zookeeper-3.4.8/src/c/generated -DHAS_AUTHENTICATION=1 -I/usr/include/subversion-1 -I/usr/include/apr-1 -I/usr/include/apr-1.0 -pthread -g1 -O0 -Wno-unused-local-typedefs -std=c++11 -MT slave/containerizer/mesos/isolators/docker/volume/libmesos_no_3rdparty_la-isolator.lo -MD -MP -MF slave/containerizer/mesos/isolators/docker/volume/.deps/libmesos_no_3rdparty_la-isolator.Tpo -c ../../src/slave/containerizer/mesos/isolators/docker/volume/isolator.cpp  -fPIC -DPIC -o slave/containerizer/mesos/isolators/docker/volume/.libs/libmesos_no_3rdparty_la-isolator.o
libtool: compile:  g++ -DPACKAGE_NAME=\"mesos\" -DPACKAGE_TARNAME=\"mesos\" -DPACKAGE_VERSION=\"1.1.0\" "-DPACKAGE_STRING=\"mesos 1.1.0\"" -DPACKAGE_BUGREPORT=\"\" -DPACKAGE_URL=\"\" -DPACKAGE=\"mesos\" -DVERSION=\"1.1.0\" -DSTDC_HEADERS=1 -DHAVE_SYS_TYPES_H=1 -DHAVE_SYS_STAT_H=1 -DHAVE_STDLIB_H=1 -DHAVE_STRING_H=1 -DHAVE_MEMORY_H=1 -DHAVE_STRINGS_H=1 -DHAVE_INTTYPES_H=1 -DHAVE_STDINT_H=1 -DHAVE_UNISTD_H=1 -DHAVE_DLFCN_H=1 -DLT_OBJDIR=\".libs/\" -DHAVE_CXX11=1 -DHAVE_PTHREAD_PRIO_INHERIT=1 -DHAVE_PTHREAD=1 -DHAVE_LIBZ=1 -DHAVE_FTS_H=1 -DHAVE_APR_POOLS_H=1 -DHAVE_LIBAPR_1=1 -DHAVE_LIBCURL=1 -DMESOS_HAS_JAVA=1 -DHAVE_PYTHON=\"2.7\" -DMESOS_HAS_PYTHON=1 -DHAVE_LIBSASL2=1 -DHAVE_SVN_VERSION_H=1 -DHAVE_LIBSVN_SUBR_1=1 -DHAVE_SVN_DELTA_H=1 -DHAVE_LIBSVN_DELTA_1=1 -DHAVE_LIBZ=1 -I. -I../../src -Wall -Werror -Wsign-compare -DLIBDIR=\"/mesos/mesos-1.1.0/_inst/lib\" -DPKGLIBEXECDIR=\"/mesos/mesos-1.1.0/_inst/libexec/mesos\" -DPKGDATADIR=\"/mesos/mesos-1.1.0/_inst/share/mesos\" -DPKGMODULEDIR=\"/mesos/mesos-1.1.0/_inst/lib/mesos/modules\" -I../../include -I../include -I../include/mesos -DPICOJSON_USE_INT64 -D__STDC_FORMAT_MACROS -isystem ../3rdparty/boost-1.53.0 -I../3rdparty/elfio-3.2 -I../3rdparty/glog-0.3.3/src -I../3rdparty/leveldb-1.4/include -I../../3rdparty/libprocess/include -I../3rdparty/nvml-352.79 -I../3rdparty/picojson-1.3.0 -I../3rdparty/protobuf-2.6.1/src -I../../3rdparty/stout/include -I../3rdparty/zookeeper-3.4.8/src/c/include -I../3rdparty/zookeeper-3.4.8/src/c/generated -DHAS_AUTHENTICATION=1 -I/usr/include/subversion-1 -I/usr/include/apr-1 -I/usr/include/apr-1.0 -pthread -g1 -O0 -Wno-unused-local-typedefs -std=c++11 -MT slave/containerizer/mesos/provisioner/backends/libmesos_no_3rdparty_la-aufs.lo -MD -MP -MF slave/containerizer/mesos/provisioner/backends/.deps/libmesos_no_3rdparty_la-aufs.Tpo -c ../../src/slave/containerizer/mesos/provisioner/backends/aufs.cpp  -fPIC -DPIC -o slave/containerizer/mesos/provisioner/backends/.libs/libmesos_no_3rdparty_la-aufs.o
libtool: compile:  g++ -DPACKAGE_NAME=\"mesos\" -DPACKAGE_TARNAME=\"mesos\" -DPACKAGE_VERSION=\"1.1.0\" "-DPACKAGE_STRING=\"mesos 1.1.0\"" -DPACKAGE_BUGREPORT=\"\" -DPACKAGE_URL=\"\" -DPACKAGE=\"mesos\" -DVERSION=\"1.1.0\" -DSTDC_HEADERS=1 -DHAVE_SYS_TYPES_H=1 -DHAVE_SYS_STAT_H=1 -DHAVE_STDLIB_H=1 -DHAVE_STRING_H=1 -DHAVE_MEMORY_H=1 -DHAVE_STRINGS_H=1 -DHAVE_INTTYPES_H=1 -DHAVE_STDINT_H=1 -DHAVE_UNISTD_H=1 -DHAVE_DLFCN_H=1 -DLT_OBJDIR=\".libs/\" -DHAVE_CXX11=1 -DHAVE_PTHREAD_PRIO_INHERIT=1 -DHAVE_PTHREAD=1 -DHAVE_LIBZ=1 -DHAVE_FTS_H=1 -DHAVE_APR_POOLS_H=1 -DHAVE_LIBAPR_1=1 -DHAVE_LIBCURL=1 -DMESOS_HAS_JAVA=1 -DHAVE_PYTHON=\"2.7\" -DMESOS_HAS_PYTHON=1 -DHAVE_LIBSASL2=1 -DHAVE_SVN_VERSION_H=1 -DHAVE_LIBSVN_SUBR_1=1 -DHAVE_SVN_DELTA_H=1 -DHAVE_LIBSVN_DELTA_1=1 -DHAVE_LIBZ=1 -I. -I../../src -Wall -Werror -Wsign-compare -DLIBDIR=\"/mesos/mesos-1.1.0/_inst/lib\" -DPKGLIBEXECDIR=\"/mesos/mesos-1.1.0/_inst/libexec/mesos\" -DPKGDATADIR=\"/mesos/mesos-1.1.0/_inst/share/mesos\" -DPKGMODULEDIR=\"/mesos/mesos-1.1.0/_inst/lib/mesos/modules\" -I../../include -I../include -I../include/mesos -DPICOJSON_USE_INT64 -D__STDC_FORMAT_MACROS -isystem ../3rdparty/boost-1.53.0 -I../3rdparty/elfio-3.2 -I../3rdparty/glog-0.3.3/src -I../3rdparty/leveldb-1.4/include -I../../3rdparty/libprocess/include -I../3rdparty/nvml-352.79 -I../3rdparty/picojson-1.3.0 -I../3rdparty/protobuf-2.6.1/src -I../../3rdparty/stout/include -I../3rdparty/zookeeper-3.4.8/src/c/include -I../3rdparty/zookeeper-3.4.8/src/c/generated -DHAS_AUTHENTICATION=1 -I/usr/include/subversion-1 -I/usr/include/apr-1 -I/usr/include/apr-1.0 -pthread -g1 -O0 -Wno-unused-local-typedefs -std=c++11 -MT slave/containerizer/mesos/isolators/network/cni/libmesos_no_3rdparty_la-cni.lo -MD -MP -MF slave/containerizer/mesos/isolators/network/cni/.deps/libmesos_no_3rdparty_la-cni.Tpo -c ../../src/slave/containerizer/mesos/isolators/network/cni/cni.cpp  -fPIC -DPIC -o slave/containerizer/mesos/isolators/network/cni/.libs/libmesos_no_3rdparty_la-cni.o
libtool: compile:  g++ -DPACKAGE_NAME=\"mesos\" -DPACKAGE_TARNAME=\"mesos\" -DPACKAGE_VERSION=\"1.1.0\" "-DPACKAGE_STRING=\"mesos 1.1.0\"" -DPACKAGE_BUGREPORT=\"\" -DPACKAGE_URL=\"\" -DPACKAGE=\"mesos\" -DVERSION=\"1.1.0\" -DSTDC_HEADERS=1 -DHAVE_SYS_TYPES_H=1 -DHAVE_SYS_STAT_H=1 -DHAVE_STDLIB_H=1 -DHAVE_STRING_H=1 -DHAVE_MEMORY_H=1 -DHAVE_STRINGS_H=1 -DHAVE_INTTYPES_H=1 -DHAVE_STDINT_H=1 -DHAVE_UNISTD_H=1 -DHAVE_DLFCN_H=1 -DLT_OBJDIR=\".libs/\" -DHAVE_CXX11=1 -DHAVE_PTHREAD_PRIO_INHERIT=1 -DHAVE_PTHREAD=1 -DHAVE_LIBZ=1 -DHAVE_FTS_H=1 -DHAVE_APR_POOLS_H=1 -DHAVE_LIBAPR_1=1 -DHAVE_LIBCURL=1 -DMESOS_HAS_JAVA=1 -DHAVE_PYTHON=\"2.7\" -DMESOS_HAS_PYTHON=1 -DHAVE_LIBSASL2=1 -DHAVE_SVN_VERSION_H=1 -DHAVE_LIBSVN_SUBR_1=1 -DHAVE_SVN_DELTA_H=1 -DHAVE_LIBSVN_DELTA_1=1 -DHAVE_LIBZ=1 -I. -I../../src -Wall -Werror -Wsign-compare -DLIBDIR=\"/mesos/mesos-1.1.0/_inst/lib\" -DPKGLIBEXECDIR=\"/mesos/mesos-1.1.0/_inst/libexec/mesos\" -DPKGDATADIR=\"/mesos/mesos-1.1.0/_inst/share/mesos\" -DPKGMODULEDIR=\"/mesos/mesos-1.1.0/_inst/lib/mesos/modules\" -I../../include -I../include -I../include/mesos -DPICOJSON_USE_INT64 -D__STDC_FORMAT_MACROS -isystem ../3rdparty/boost-1.53.0 -I../3rdparty/elfio-3.2 -I../3rdparty/glog-0.3.3/src -I../3rdparty/leveldb-1.4/include -I../../3rdparty/libprocess/include -I../3rdparty/nvml-352.79 -I../3rdparty/picojson-1.3.0 -I../3rdparty/protobuf-2.6.1/src -I../../3rdparty/stout/include -I../3rdparty/zookeeper-3.4.8/src/c/include -I../3rdparty/zookeeper-3.4.8/src/c/generated -DHAS_AUTHENTICATION=1 -I/usr/include/subversion-1 -I/usr/include/apr-1 -I/usr/include/apr-1.0 -pthread -g1 -O0 -Wno-unused-local-typedefs -std=c++11 -MT slave/containerizer/mesos/isolators/filesystem/libmesos_no_3rdparty_la-shared.lo -MD -MP -MF slave/containerizer/mesos/isolators/filesystem/.deps/libmesos_no_3rdparty_la-shared.Tpo -c ../../src/slave/containerizer/mesos/isolators/filesystem/shared.cpp  -fPIC -DPIC -o slave/containerizer/mesos/isolators/filesystem/.libs/libmesos_no_3rdparty_la-shared.o
libtool: compile:  g++ -DPACKAGE_NAME=\"mesos\" -DPACKAGE_TARNAME=\"mesos\" -DPACKAGE_VERSION=\"1.1.0\" "-DPACKAGE_STRING=\"mesos 1.1.0\"" -DPACKAGE_BUGREPORT=\"\" -DPACKAGE_URL=\"\" -DPACKAGE=\"mesos\" -DVERSION=\"1.1.0\" -DSTDC_HEADERS=1 -DHAVE_SYS_TYPES_H=1 -DHAVE_SYS_STAT_H=1 -DHAVE_STDLIB_H=1 -DHAVE_STRING_H=1 -DHAVE_MEMORY_H=1 -DHAVE_STRINGS_H=1 -DHAVE_INTTYPES_H=1 -DHAVE_STDINT_H=1 -DHAVE_UNISTD_H=1 -DHAVE_DLFCN_H=1 -DLT_OBJDIR=\".libs/\" -DHAVE_CXX11=1 -DHAVE_PTHREAD_PRIO_INHERIT=1 -DHAVE_PTHREAD=1 -DHAVE_LIBZ=1 -DHAVE_FTS_H=1 -DHAVE_APR_POOLS_H=1 -DHAVE_LIBAPR_1=1 -DHAVE_LIBCURL=1 -DMESOS_HAS_JAVA=1 -DHAVE_PYTHON=\"2.7\" -DMESOS_HAS_PYTHON=1 -DHAVE_LIBSASL2=1 -DHAVE_SVN_VERSION_H=1 -DHAVE_LIBSVN_SUBR_1=1 -DHAVE_SVN_DELTA_H=1 -DHAVE_LIBSVN_DELTA_1=1 -DHAVE_LIBZ=1 -I. -I../../src -Wall -Werror -Wsign-compare -DLIBDIR=\"/mesos/mesos-1.1.0/_inst/lib\" -DPKGLIBEXECDIR=\"/mesos/mesos-1.1.0/_inst/libexec/mesos\" -DPKGDATADIR=\"/mesos/mesos-1.1.0/_inst/share/mesos\" -DPKGMODULEDIR=\"/mesos/mesos-1.1.0/_inst/lib/mesos/modules\" -I../../include -I../include -I../include/mesos -DPICOJSON_USE_INT64 -D__STDC_FORMAT_MACROS -isystem ../3rdparty/boost-1.53.0 -I../3rdparty/elfio-3.2 -I../3rdparty/glog-0.3.3/src -I../3rdparty/leveldb-1.4/include -I../../3rdparty/libprocess/include -I../3rdparty/nvml-352.79 -I../3rdparty/picojson-1.3.0 -I../3rdparty/protobuf-2.6.1/src -I../../3rdparty/stout/include -I../3rdparty/zookeeper-3.4.8/src/c/include -I../3rdparty/zookeeper-3.4.8/src/c/generated -DHAS_AUTHENTICATION=1 -I/usr/include/subversion-1 -I/usr/include/apr-1 -I/usr/include/apr-1.0 -pthread -g1 -O0 -Wno-unused-local-typedefs -std=c++11 -MT slave/containerizer/mesos/provisioner/backends/libmesos_no_3rdparty_la-bind.lo -MD -MP -MF slave/containerizer/mesos/provisioner/backends/.deps/libmesos_no_3rdparty_la-bind.Tpo -c ../../src/slave/containerizer/mesos/provisioner/backends/bind.cpp  -fPIC -DPIC -o slave/containerizer/mesos/provisioner/backends/.libs/libmesos_no_3rdparty_la-bind.o
In file included from ../../src/slave/containerizer/mesos/launcher.hpp:28:0,
                 from ../../src/slave/containerizer/mesos/linux_launcher.hpp:20,
                 from ../../src/slave/containerizer/mesos/linux_launcher.cpp:39:
../../include/mesos/slave/isolator.hpp:25:41: fatal error: mesos/slave/containerizer.hpp: No such file or directory
 #include <mesos/slave/containerizer.hpp>
                                         ^
compilation terminated.
In file included from ../../src/slave/containerizer/mesos/isolator.hpp:20:0,
                 from ../../src/slave/containerizer/mesos/isolators/docker/volume/isolator.hpp:31,
                 from ../../src/slave/containerizer/mesos/isolators/docker/volume/isolator.cpp:25:
../../include/mesos/slave/isolator.hpp:25:41: fatal error: mesos/slave/containerizer.hpp: No such file or directory
 #include <mesos/slave/containerizer.hpp>
                                         ^
compilation terminated.
In file included from ../../src/slave/containerizer/mesos/isolator.hpp:20:0,
                 from ../../src/slave/containerizer/mesos/isolators/filesystem/shared.hpp:22,
                 from ../../src/slave/containerizer/mesos/isolators/filesystem/shared.cpp:25:
../../include/mesos/slave/isolator.hpp:25:41: fatal error: mesos/slave/containerizer.hpp: No such file or directory
 #include <mesos/slave/containerizer.hpp>
                                         ^
compilation terminated.
In file included from ../../src/slave/containerizer/mesos/isolator.hpp:20:0,
                 from ../../src/slave/containerizer/mesos/isolators/network/cni/cni.hpp:27,
                 from ../../src/slave/containerizer/mesos/isolators/network/cni/cni.cpp:33:
../../include/mesos/slave/isolator.hpp:25:41: fatal error: mesos/slave/containerizer.hpp: No such file or directory
 #include <mesos/slave/containerizer.hpp>
                                         ^
compilation terminated.
In file included from ../../src/slave/containerizer/mesos/isolator.hpp:20:0,
                 from ../../src/slave/containerizer/mesos/isolators/filesystem/linux.hpp:32,
                 from ../../src/slave/containerizer/mesos/isolators/filesystem/linux.cpp:46:
../../include/mesos/slave/isolator.hpp:25:41: fatal error: mesos/slave/containerizer.hpp: No such file or directory
 #include <mesos/slave/containerizer.hpp>
                                         ^
compilation terminated.
make[3]: *** [slave/containerizer/mesos/libmesos_no_3rdparty_la-linux_launcher.lo] Error 1
make[3]: *** Waiting for unfinished jobs....
make[3]: *** [slave/containerizer/mesos/isolators/docker/volume/libmesos_no_3rdparty_la-isolator.lo] Error 1
make[3]: *** [slave/containerizer/mesos/isolators/network/cni/libmesos_no_3rdparty_la-cni.lo] Error 1
make[3]: *** [slave/containerizer/mesos/isolators/filesystem/libmesos_no_3rdparty_la-shared.lo] Error 1
make[3]: *** [slave/containerizer/mesos/isolators/filesystem/libmesos_no_3rdparty_la-linux.lo] Error 1
mv -f slave/containerizer/mesos/provisioner/backends/.deps/libmesos_no_3rdparty_la-overlay.Tpo slave/containerizer/mesos/provisioner/backends/.deps/libmesos_no_3rdparty_la-overlay.Plo
mv -f slave/containerizer/mesos/provisioner/backends/.deps/libmesos_no_3rdparty_la-aufs.Tpo slave/containerizer/mesos/provisioner/backends/.deps/libmesos_no_3rdparty_la-aufs.Plo
mv -f slave/containerizer/mesos/provisioner/backends/.deps/libmesos_no_3rdparty_la-bind.Tpo slave/containerizer/mesos/provisioner/backends/.deps/libmesos_no_3rdparty_la-bind.Plo
make[3]: Leaving directory `/mesos/mesos-1.1.0/_build/src'
make[2]: *** [all] Error 2
make[2]: Leaving directory `/mesos/mesos-1.1.0/_build/src'
make[1]: *** [all-recursive] Error 1
make[1]: Leaving directory `/mesos/mesos-1.1.0/_build'
make: *** [distcheck] Error 1
+ docker rmi mesos-1471940560-10564
Untagged: mesos-1471940560-10564:latest
Deleted: sha256:1fc8104300f792676f2087edf5068de3bec6e68ee7b3ac67ef386e6060d80891
Deleted: sha256:b52e1c0ec966eefdb9645e0eb322a2bc7b3f8edb8dee517c90a0d769e5e7bffe
Deleted: sha256:0ee5a1484205f6a019724540e0307b712aba3662ac6170d468d249cb1f131c01
Deleted: sha256:b85e75ea0ede7c81014858516ede8303758aefe7d92bc40654664ea34389786e
Deleted: sha256:4b26467ff7f925bac9da6055a2937a4b34f561ed87a7180209cadf2d4f749e2c
Deleted: sha256:2a6bb16d173b3b3ef1e17e6e1174ff5c4d7cd473bd1d2c3c60fa50a94b5de897
Deleted: sha256:1d735fb6cacb9bfd95552f22b249a387eab17dca4e0bb9ea333fb3054b453459
Deleted: sha256:44344a8d0bf18620fae1fb3e1f170f023c3e5ba6fb4133031997d8f43e42de03
Deleted: sha256:e2b90c882b0f28f946a19189d0903ec587d719d007135311cf06b6ee2577e17d
Deleted: sha256:908709e58b5730b34a034ac736264ee06afdf10de46e7f8a3dbbc001199cbd17
Deleted: sha256:c8edd59d72d70feae82c57af892b6075455620208cf21689206d7e19f02c54aa
Deleted: sha256:dd182749fb021ca56ba3b2d2ff5e9cf8793396e309971ce2c100830ccadb0518
Deleted: sha256:ec69162f39e0f0375a66e72a335ae1027501f68977018cf6135422f133d12b4e
Deleted: sha256:bb23b8470af6dbc529f7c696027a8bf172ae4c052c2a34f12983af1c56ad2cd5
Deleted: sha256:6df3d49bbb4c8cf21b9369b5c3f55c88bed97eae3e4ecebcdfae8dbbd23c88bb
Deleted: sha256:8e78bd7763f7be64b45c95db1b3ba28bae575dc372d269b2537036e46a9a6f18
Deleted: sha256:57052434a7b9a05420006071d8bd1939b2b0b1da1d4a26c8f560e33c04493045
Deleted: sha256:24fe6e2d4aa216eae74203efd07796c098e5f7950018fdf326d1fc2897a2316a
Deleted: sha256:f06258f4e1d24f952f3a8d821af17e6661b69ae3cee6a1073fe3895bd5239d37
Deleted: sha256:eb02b1600b372743863b18f2eb33d9b90c1b62db0662decd6e88366350faf85d
Deleted: sha256:f6dfc522dcad2392c3d4b610f56f7db454e8f1c147e2003e57481fb7c9506164
Deleted: sha256:ca2258cc6f6514f917b97a049ab367d013a519c9da71ebfc716448fe4a88ff14
Deleted: sha256:077c4e294f6a2b6f27b23c5f1b211f7e357938d5e9023b6265964da2db0fe5fd
Deleted: sha256:459b41211837cda7b02c0ef2f2aa6538815d96a19eb8a349e6e83085256bfbb8
Build step 'Execute shell' marked build as failure

Mime
View raw message