mesos-builds mailing list archives

Site index · List index
Message view « Date » · « Thread »
Top « Date » · « Thread »
From Apache Jenkins Server <jenk...@builds.apache.org>
Subject Build failed in Jenkins: mesos-reviewbot #14947
Date Tue, 23 Aug 2016 17:07:28 GMT
See <https://builds.apache.org/job/mesos-reviewbot/14947/changes>

Changes:

[xujyan] Added test to simulate slow/unresponsive fetch.

[xujyan] Removed an unnecessary call to stream.precision() in Duration.

------------------------------------------
[...truncated 9589 lines...]
Downloading: http://repo.maven.apache.org/maven2/commons-validator/commons-validator/1.2.0/commons-validator-1.2.0.pom
Downloaded: http://repo.maven.apache.org/maven2/commons-validator/commons-validator/1.2.0/commons-validator-1.2.0.pom (9 KB at 170.6 KB/sec)
Downloading: http://repo.maven.apache.org/maven2/xml-apis/xml-apis/2.0.2/xml-apis-2.0.2.pom
Downloaded: http://repo.maven.apache.org/maven2/xml-apis/xml-apis/2.0.2/xml-apis-2.0.2.pom (346 B at 6.5 KB/sec)
Downloading: http://repo.maven.apache.org/maven2/org/codehaus/plexus/plexus-archiver/2.3/plexus-archiver-2.3.pom
Downloaded: http://repo.maven.apache.org/maven2/org/codehaus/plexus/plexus-archiver/2.3/plexus-archiver-2.3.pom (4 KB at 63.3 KB/sec)
Downloading: http://repo.maven.apache.org/maven2/org/codehaus/plexus/plexus-components/1.3/plexus-components-1.3.pom
Downloaded: http://repo.maven.apache.org/maven2/org/codehaus/plexus/plexus-components/1.3/plexus-components-1.3.pom (3 KB at 56.3 KB/sec)
Downloading: http://repo.maven.apache.org/maven2/org/codehaus/plexus/plexus/3.3/plexus-3.3.pom
Downloaded: http://repo.maven.apache.org/maven2/org/codehaus/plexus/plexus/3.3/plexus-3.3.pom (20 KB at 366.7 KB/sec)
Downloading: http://repo.maven.apache.org/maven2/org/codehaus/plexus/plexus-utils/3.0.10/plexus-utils-3.0.10.pom
Downloaded: http://repo.maven.apache.org/maven2/org/codehaus/plexus/plexus-utils/3.0.10/plexus-utils-3.0.10.pom (4 KB at 57.9 KB/sec)
Downloading: http://repo.maven.apache.org/maven2/org/codehaus/plexus/plexus-io/2.0.6/plexus-io-2.0.6.pom
Downloaded: http://repo.maven.apache.org/maven2/org/codehaus/plexus/plexus-io/2.0.6/plexus-io-2.0.6.pom (3 KB at 41.5 KB/sec)
Downloading: http://repo.maven.apache.org/maven2/org/codehaus/plexus/plexus-components/1.2/plexus-components-1.2.pom
Downloaded: http://repo.maven.apache.org/maven2/org/codehaus/plexus/plexus-components/1.2/plexus-components-1.2.pom (3 KB at 55.3 KB/sec)
Downloading: http://repo.maven.apache.org/maven2/org/codehaus/plexus/plexus/3.2/plexus-3.2.pom
Downloaded: http://repo.maven.apache.org/maven2/org/codehaus/plexus/plexus/3.2/plexus-3.2.pom (19 KB at 339.0 KB/sec)
Downloading: http://repo.maven.apache.org/maven2/org/codehaus/plexus/plexus-utils/3.0.8/plexus-utils-3.0.8.pom
Downloaded: http://repo.maven.apache.org/maven2/org/codehaus/plexus/plexus-utils/3.0.8/plexus-utils-3.0.8.pom (4 KB at 57.9 KB/sec)
Downloading: http://repo.maven.apache.org/maven2/org/codehaus/plexus/plexus-utils/3.0.9/plexus-utils-3.0.9.pom
Downloaded: http://repo.maven.apache.org/maven2/org/codehaus/plexus/plexus-utils/3.0.9/plexus-utils-3.0.9.pom (4 KB at 57.9 KB/sec)
Downloading: http://repo.maven.apache.org/maven2/org/apache/maven/shared/file-management/1.2.1/file-management-1.2.1.pom
Downloaded: http://repo.maven.apache.org/maven2/org/apache/maven/shared/file-management/1.2.1/file-management-1.2.1.pom (4 KB at 71.5 KB/sec)
Downloading: http://repo.maven.apache.org/maven2/org/apache/maven/shared/maven-shared-components/10/maven-shared-components-10.pom
Downloaded: http://repo.maven.apache.org/maven2/org/apache/maven/shared/maven-shared-components/10/maven-shared-components-10.pom (9 KB at 158.4 KB/sec)
Downloading: http://repo.maven.apache.org/maven2/org/apache/maven/maven-parent/9/maven-parent-9.pom
Downloaded: http://repo.maven.apache.org/maven2/org/apache/maven/maven-parent/9/maven-parent-9.pom (33 KB at 605.0 KB/sec)
Downloading: http://repo.maven.apache.org/maven2/org/apache/maven/shared/maven-shared-io/1.1/maven-shared-io-1.1.pom
Downloaded: http://repo.maven.apache.org/maven2/org/apache/maven/shared/maven-shared-io/1.1/maven-shared-io-1.1.pom (4 KB at 73.4 KB/sec)
Downloading: http://repo.maven.apache.org/maven2/org/apache/maven/maven-artifact/2.0.2/maven-artifact-2.0.2.pom
Downloaded: http://repo.maven.apache.org/maven2/org/apache/maven/maven-artifact/2.0.2/maven-artifact-2.0.2.pom (765 B at 14.1 KB/sec)
Downloading: http://repo.maven.apache.org/maven2/org/apache/maven/maven/2.0.2/maven-2.0.2.pom
Downloaded: http://repo.maven.apache.org/maven2/org/apache/maven/maven/2.0.2/maven-2.0.2.pom (13 KB at 238.2 KB/sec)
Downloading: http://repo.maven.apache.org/maven2/org/codehaus/plexus/plexus-utils/1.1/plexus-utils-1.1.pom
Downloaded: http://repo.maven.apache.org/maven2/org/codehaus/plexus/plexus-utils/1.1/plexus-utils-1.1.pom (767 B at 14.4 KB/sec)
Downloading: http://repo.maven.apache.org/maven2/org/apache/maven/maven-artifact-manager/2.0.2/maven-artifact-manager-2.0.2.pom
Downloaded: http://repo.maven.apache.org/maven2/org/apache/maven/maven-artifact-manager/2.0.2/maven-artifact-manager-2.0.2.pom (2 KB at 26.2 KB/sec)
Downloading: http://repo.maven.apache.org/maven2/org/apache/maven/maven-repository-metadata/2.0.2/maven-repository-metadata-2.0.2.pom
Downloaded: http://repo.maven.apache.org/maven2/org/apache/maven/maven-repository-metadata/2.0.2/maven-repository-metadata-2.0.2.pom (2 KB at 24.1 KB/sec)
Downloading: http://repo.maven.apache.org/maven2/org/apache/maven/wagon/wagon-provider-api/1.0-alpha-6/wagon-provider-api-1.0-alpha-6.pom
Downloaded: http://repo.maven.apache.org/maven2/org/apache/maven/wagon/wagon-provider-api/1.0-alpha-6/wagon-provider-api-1.0-alpha-6.pom (588 B at 10.8 KB/sec)
Downloading: http://repo.maven.apache.org/maven2/org/apache/maven/wagon/wagon/1.0-alpha-6/wagon-1.0-alpha-6.pom
Downloaded: http://repo.maven.apache.org/maven2/org/apache/maven/wagon/wagon/1.0-alpha-6/wagon-1.0-alpha-6.pom (7 KB at 120.3 KB/sec)
Downloading: http://repo.maven.apache.org/maven2/org/apache/maven/shared/maven-dependency-analyzer/1.4/maven-dependency-analyzer-1.4.pom
Downloaded: http://repo.maven.apache.org/maven2/org/apache/maven/shared/maven-dependency-analyzer/1.4/maven-dependency-analyzer-1.4.pom (6 KB at 95.0 KB/sec)
Downloading: http://repo.maven.apache.org/maven2/org/apache/maven/maven-project/2.0.5/maven-project-2.0.5.pom
Downloaded: http://repo.maven.apache.org/maven2/org/apache/maven/maven-project/2.0.5/maven-project-2.0.5.pom (2 KB at 33.9 KB/sec)
Downloading: http://repo.maven.apache.org/maven2/org/apache/maven/maven/2.0.5/maven-2.0.5.pom
Downloaded: http://repo.maven.apache.org/maven2/org/apache/maven/maven/2.0.5/maven-2.0.5.pom (6 KB at 103.2 KB/sec)
Downloading: http://repo.maven.apache.org/maven2/org/apache/maven/maven-settings/2.0.5/maven-settings-2.0.5.pom
Downloaded: http://repo.maven.apache.org/maven2/org/apache/maven/maven-settings/2.0.5/maven-settings-2.0.5.pom (2 KB at 31.5 KB/sec)
Downloading: http://repo.maven.apache.org/maven2/org/apache/maven/maven-model/2.0.5/maven-model-2.0.5.pom
Downloaded: http://repo.maven.apache.org/maven2/org/apache/maven/maven-model/2.0.5/maven-model-2.0.5.pom (3 KB at 51.1 KB/sec)
Downloading: http://repo.maven.apache.org/maven2/org/apache/maven/maven-profile/2.0.5/maven-profile-2.0.5.pom
Downloaded: http://repo.maven.apache.org/maven2/org/apache/maven/maven-profile/2.0.5/maven-profile-2.0.5.pom (2 KB at 30.5 KB/sec)
Downloading: http://repo.maven.apache.org/maven2/org/apache/maven/maven-artifact-manager/2.0.5/maven-artifact-manager-2.0.5.pom
Downloaded: http://repo.maven.apache.org/maven2/org/apache/maven/maven-artifact-manager/2.0.5/maven-artifact-manager-2.0.5.pom (2 KB at 34.4 KB/sec)
Downloading: http://repo.maven.apache.org/maven2/org/apache/maven/maven-repository-metadata/2.0.5/maven-repository-metadata-2.0.5.pom
Downloaded: http://repo.maven.apache.org/maven2/org/apache/maven/maven-repository-metadata/2.0.5/maven-repository-metadata-2.0.5.pom (2 KB at 27.9 KB/sec)
Downloading: http://repo.maven.apache.org/maven2/org/apache/maven/maven-artifact/2.0.5/maven-artifact-2.0.5.pom
Downloaded: http://repo.maven.apache.org/maven2/org/apache/maven/maven-artifact/2.0.5/maven-artifact-2.0.5.pom (727 B at 13.7 KB/sec)
Downloading: http://repo.maven.apache.org/maven2/org/apache/maven/shared/maven-common-artifact-filters/1.4/maven-common-artifact-filters-1.4.pom
Downloaded: http://repo.maven.apache.org/maven2/org/apache/maven/shared/maven-common-artifact-filters/1.4/maven-common-artifact-filters-1.4.pom (4 KB at 70.6 KB/sec)
Downloading: http://repo.maven.apache.org/maven2/org/codehaus/plexus/plexus-container-default/1.5.5/plexus-container-default-1.5.5.pom
Downloaded: http://repo.maven.apache.org/maven2/org/codehaus/plexus/plexus-container-default/1.5.5/plexus-container-default-1.5.5.pom (3 KB at 51.7 KB/sec)
Downloading: http://repo.maven.apache.org/maven2/org/codehaus/plexus/plexus-classworlds/2.2.2/plexus-classworlds-2.2.2.pom
Downloaded: http://repo.maven.apache.org/maven2/org/codehaus/plexus/plexus-classworlds/2.2.2/plexus-classworlds-2.2.2.pom (4 KB at 75.7 KB/sec)
Downloading: http://repo.maven.apache.org/maven2/org/apache/xbean/xbean-reflect/3.4/xbean-reflect-3.4.pom
Downloaded: http://repo.maven.apache.org/maven2/org/apache/xbean/xbean-reflect/3.4/xbean-reflect-3.4.pom (3 KB at 51.8 KB/sec)
Downloading: http://repo.maven.apache.org/maven2/org/apache/xbean/xbean/3.4/xbean-3.4.pom
Downloaded: http://repo.maven.apache.org/maven2/org/apache/xbean/xbean/3.4/xbean-3.4.pom (19 KB at 341.5 KB/sec)
Downloading: http://repo.maven.apache.org/maven2/commons-logging/commons-logging-api/1.1/commons-logging-api-1.1.pom
Downloaded: http://repo.maven.apache.org/maven2/commons-logging/commons-logging-api/1.1/commons-logging-api-1.1.pom (6 KB at 98.5 KB/sec)
Downloading: http://repo.maven.apache.org/maven2/com/google/collections/google-collections/1.0/google-collections-1.0.pom
Downloaded: http://repo.maven.apache.org/maven2/com/google/collections/google-collections/1.0/google-collections-1.0.pom (3 KB at 45.7 KB/sec)
Downloading: http://repo.maven.apache.org/maven2/junit/junit/3.8.2/junit-3.8.2.pom
Downloaded: http://repo.maven.apache.org/maven2/junit/junit/3.8.2/junit-3.8.2.pom (747 B at 13.8 KB/sec)
Downloading: http://repo.maven.apache.org/maven2/org/codehaus/plexus/plexus-utils/2.1/plexus-utils-2.1.pom
Downloaded: http://repo.maven.apache.org/maven2/org/codehaus/plexus/plexus-utils/2.1/plexus-utils-2.1.pom (4 KB at 75.8 KB/sec)
Downloading: http://repo.maven.apache.org/maven2/org/apache/maven/shared/maven-invoker/2.0.11/maven-invoker-2.0.11.pom
Downloaded: http://repo.maven.apache.org/maven2/org/apache/maven/shared/maven-invoker/2.0.11/maven-invoker-2.0.11.pom (5 KB at 91.8 KB/sec)
Downloading: http://repo.maven.apache.org/maven2/commons-lang/commons-lang/2.6/commons-lang-2.6.pom
Downloaded: http://repo.maven.apache.org/maven2/commons-lang/commons-lang/2.6/commons-lang-2.6.pom (18 KB at 322.3 KB/sec)
Downloading: http://repo.maven.apache.org/maven2/org/apache/commons/commons-parent/17/commons-parent-17.pom
Downloaded: http://repo.maven.apache.org/maven2/org/apache/commons/commons-parent/17/commons-parent-17.pom (31 KB at 574.6 KB/sec)
Downloading: http://repo.maven.apache.org/maven2/org/apache/maven/reporting/maven-reporting-impl/2.0.5/maven-reporting-impl-2.0.5.jar
Downloading: http://repo.maven.apache.org/maven2/org/apache/maven/shared/maven-doxia-tools/1.0.2/maven-doxia-tools-1.0.2.jar
Downloading: http://repo.maven.apache.org/maven2/commons-validator/commons-validator/1.2.0/commons-validator-1.2.0.jar
Downloading: http://repo.maven.apache.org/maven2/commons-digester/commons-digester/1.6/commons-digester-1.6.jar
Downloading: http://repo.maven.apache.org/maven2/commons-logging/commons-logging/1.0.4/commons-logging-1.0.4.jar
Downloaded: http://repo.maven.apache.org/maven2/org/apache/maven/shared/maven-doxia-tools/1.0.2/maven-doxia-tools-1.0.2.jar (41 KB at 743.0 KB/sec)
Downloaded: http://repo.maven.apache.org/maven2/org/apache/maven/reporting/maven-reporting-impl/2.0.5/maven-reporting-impl-2.0.5.jar (21 KB at 372.8 KB/sec)
Downloading: http://repo.maven.apache.org/maven2/xml-apis/xml-apis/1.0.b2/xml-apis-1.0.b2.jar
Downloading: http://repo.maven.apache.org/maven2/org/codehaus/plexus/plexus-archiver/2.3/plexus-archiver-2.3.jar
Downloaded: http://repo.maven.apache.org/maven2/commons-validator/commons-validator/1.2.0/commons-validator-1.2.0.jar (89 KB at 1617.8 KB/sec)
Downloading: http://repo.maven.apache.org/maven2/org/codehaus/plexus/plexus-utils/3.0.9/plexus-utils-3.0.9.jar
Downloaded: http://repo.maven.apache.org/maven2/commons-logging/commons-logging/1.0.4/commons-logging-1.0.4.jar (38 KB at 687.5 KB/sec)
Downloading: http://repo.maven.apache.org/maven2/org/apache/maven/shared/file-management/1.2.1/file-management-1.2.1.jar
Downloaded: http://repo.maven.apache.org/maven2/commons-digester/commons-digester/1.6/commons-digester-1.6.jar (165 KB at 2885.9 KB/sec)
Downloading: http://repo.maven.apache.org/maven2/org/apache/maven/shared/maven-shared-io/1.1/maven-shared-io-1.1.jar
Downloaded: http://repo.maven.apache.org/maven2/xml-apis/xml-apis/1.0.b2/xml-apis-1.0.b2.jar (107 KB at 1977.0 KB/sec)
Downloading: http://repo.maven.apache.org/maven2/org/codehaus/plexus/plexus-io/2.0.6/plexus-io-2.0.6.jar
Downloaded: http://repo.maven.apache.org/maven2/org/codehaus/plexus/plexus-archiver/2.3/plexus-archiver-2.3.jar (183 KB at 3251.7 KB/sec)
Downloading: http://repo.maven.apache.org/maven2/org/apache/maven/shared/maven-dependency-analyzer/1.4/maven-dependency-analyzer-1.4.jar
Downloaded: http://repo.maven.apache.org/maven2/org/apache/maven/shared/maven-shared-io/1.1/maven-shared-io-1.1.jar (39 KB at 727.4 KB/sec)
Downloaded: http://repo.maven.apache.org/maven2/org/apache/maven/shared/file-management/1.2.1/file-management-1.2.1.jar (37 KB at 667.2 KB/sec)
Downloading: http://repo.maven.apache.org/maven2/org/apache/maven/shared/maven-common-artifact-filters/1.4/maven-common-artifact-filters-1.4.jar
Downloading: http://repo.maven.apache.org/maven2/org/apache/maven/shared/maven-invoker/2.0.11/maven-invoker-2.0.11.jar
Downloaded: http://repo.maven.apache.org/maven2/org/codehaus/plexus/plexus-utils/3.0.9/plexus-utils-3.0.9.jar (227 KB at 3905.2 KB/sec)
Downloading: http://repo.maven.apache.org/maven2/commons-lang/commons-lang/2.6/commons-lang-2.6.jar
Downloaded: http://repo.maven.apache.org/maven2/org/codehaus/plexus/plexus-io/2.0.6/plexus-io-2.0.6.jar (57 KB at 1042.9 KB/sec)
Downloaded: http://repo.maven.apache.org/maven2/org/apache/maven/shared/maven-dependency-analyzer/1.4/maven-dependency-analyzer-1.4.jar (27 KB at 515.2 KB/sec)
Downloaded: http://repo.maven.apache.org/maven2/org/apache/maven/shared/maven-common-artifact-filters/1.4/maven-common-artifact-filters-1.4.jar (31 KB at 582.2 KB/sec)
Downloaded: http://repo.maven.apache.org/maven2/org/apache/maven/shared/maven-invoker/2.0.11/maven-invoker-2.0.11.jar (29 KB at 542.9 KB/sec)
Downloaded: http://repo.maven.apache.org/maven2/commons-lang/commons-lang/2.6/commons-lang-2.6.jar (278 KB at 4785.5 KB/sec)
[INFO] Copying protobuf-java-2.6.1.jar to /mesos/mesos-1.1.0/_build/src/java/target/protobuf-java-2.6.1.jar
[INFO] ------------------------------------------------------------------------
[INFO] BUILD SUCCESS
[INFO] ------------------------------------------------------------------------
[INFO] Total time: 4:40.574s
[INFO] Finished at: Tue Aug 23 17:06:28 UTC 2016
[INFO] Final Memory: 34M/1158M
[INFO] ------------------------------------------------------------------------
/usr/lib/jvm/java-7-openjdk-amd64/bin/javah -d java/jni				\
	-classpath java/target/mesos-1.1.0.jar:/mesos/mesos-1.1.0/_build/src/java/target/protobuf-java-2.6.1.jar				\
	  org.apache.mesos.Log
/usr/lib/jvm/java-7-openjdk-amd64/bin/javah -d java/jni				\
	-classpath java/target/mesos-1.1.0.jar:/mesos/mesos-1.1.0/_build/src/java/target/protobuf-java-2.6.1.jar				\
          org.apache.mesos.MesosExecutorDriver
/usr/lib/jvm/java-7-openjdk-amd64/bin/javah -d java/jni				\
	-classpath java/target/mesos-1.1.0.jar:/mesos/mesos-1.1.0/_build/src/java/target/protobuf-java-2.6.1.jar				\
	  org.apache.mesos.MesosSchedulerDriver
/usr/lib/jvm/java-7-openjdk-amd64/bin/javah -d java/jni				\
	-classpath java/target/mesos-1.1.0.jar:/mesos/mesos-1.1.0/_build/src/java/target/protobuf-java-2.6.1.jar				\
	  org.apache.mesos.state.AbstractState
/usr/lib/jvm/java-7-openjdk-amd64/bin/javah -d java/jni				\
	-classpath java/target/mesos-1.1.0.jar:/mesos/mesos-1.1.0/_build/src/java/target/protobuf-java-2.6.1.jar				\
	  org.apache.mesos.state.LevelDBState
/usr/lib/jvm/java-7-openjdk-amd64/bin/javah -d java/jni				\
	-classpath java/target/mesos-1.1.0.jar:/mesos/mesos-1.1.0/_build/src/java/target/protobuf-java-2.6.1.jar				\
	  org.apache.mesos.state.LogState
/usr/lib/jvm/java-7-openjdk-amd64/bin/javah -d java/jni				\
	-classpath java/target/mesos-1.1.0.jar:/mesos/mesos-1.1.0/_build/src/java/target/protobuf-java-2.6.1.jar				\
	  org.apache.mesos.state.Variable
/usr/lib/jvm/java-7-openjdk-amd64/bin/javah -d java/jni				\
	-classpath java/target/mesos-1.1.0.jar:/mesos/mesos-1.1.0/_build/src/java/target/protobuf-java-2.6.1.jar				\
	  org.apache.mesos.state.ZooKeeperState
/usr/lib/jvm/java-7-openjdk-amd64/bin/javah -d java/jni				\
	-classpath java/target/mesos-1.1.0.jar:/mesos/mesos-1.1.0/_build/src/java/target/protobuf-java-2.6.1.jar				\
	  org.apache.mesos.v1.scheduler.V1Mesos
/usr/lib/jvm/java-7-openjdk-amd64/bin/javah -d java/jni				\
	-classpath java/target/mesos-1.1.0.jar:/mesos/mesos-1.1.0/_build/src/java/target/protobuf-java-2.6.1.jar				\
	  org.apache.mesos.v1.scheduler.V0Mesos
make  all-am
make[3]: Entering directory `/mesos/mesos-1.1.0/_build/src'
/bin/bash ../libtool  --tag=CXX   --mode=compile g++ -DPACKAGE_NAME=\"mesos\" -DPACKAGE_TARNAME=\"mesos\" -DPACKAGE_VERSION=\"1.1.0\" -DPACKAGE_STRING=\"mesos\ 1.1.0\" -DPACKAGE_BUGREPORT=\"\" -DPACKAGE_URL=\"\" -DPACKAGE=\"mesos\" -DVERSION=\"1.1.0\" -DSTDC_HEADERS=1 -DHAVE_SYS_TYPES_H=1 -DHAVE_SYS_STAT_H=1 -DHAVE_STDLIB_H=1 -DHAVE_STRING_H=1 -DHAVE_MEMORY_H=1 -DHAVE_STRINGS_H=1 -DHAVE_INTTYPES_H=1 -DHAVE_STDINT_H=1 -DHAVE_UNISTD_H=1 -DHAVE_DLFCN_H=1 -DLT_OBJDIR=\".libs/\" -DHAVE_CXX11=1 -DHAVE_PTHREAD_PRIO_INHERIT=1 -DHAVE_PTHREAD=1 -DHAVE_LIBZ=1 -DHAVE_FTS_H=1 -DHAVE_APR_POOLS_H=1 -DHAVE_LIBAPR_1=1 -DHAVE_LIBCURL=1 -DMESOS_HAS_JAVA=1 -DHAVE_PYTHON=\"2.7\" -DMESOS_HAS_PYTHON=1 -DHAVE_LIBSASL2=1 -DHAVE_SVN_VERSION_H=1 -DHAVE_LIBSVN_SUBR_1=1 -DHAVE_SVN_DELTA_H=1 -DHAVE_LIBSVN_DELTA_1=1 -DHAVE_LIBZ=1 -I. -I../../src   -Wall -Werror -Wsign-compare -DLIBDIR=\"/mesos/mesos-1.1.0/_inst/lib\" -DPKGLIBEXECDIR=\"/mesos/mesos-1.1.0/_inst/libexec/mesos\" -DPKGDATADIR=\"/mesos/mesos-1.1.0/_inst/share/mesos\" -DPKGMODULEDIR=\"/mesos/mesos-1.1.0/_inst/lib/mesos/modules\" -I../../include -I../include -I../include/mesos -DPICOJSON_USE_INT64 -D__STDC_FORMAT_MACROS -isystem ../3rdparty/boost-1.53.0 -I../3rdparty/elfio-3.2 -I../3rdparty/glog-0.3.3/src -I../3rdparty/leveldb-1.4/include -I../../3rdparty/libprocess/include -I../3rdparty/nvml-352.79 -I../3rdparty/picojson-1.3.0 -I../3rdparty/protobuf-2.6.1/src -I../../3rdparty/stout/include -I../3rdparty/zookeeper-3.4.8/src/c/include -I../3rdparty/zookeeper-3.4.8/src/c/generated -DHAS_AUTHENTICATION=1 -I/usr/include/subversion-1 -I/usr/include/apr-1 -I/usr/include/apr-1.0  -pthread -g1 -O0 -Wno-unused-local-typedefs -std=c++11 -MT slave/containerizer/mesos/libmesos_no_3rdparty_la-linux_launcher.lo -MD -MP -MF slave/containerizer/mesos/.deps/libmesos_no_3rdparty_la-linux_launcher.Tpo -c -o slave/containerizer/mesos/libmesos_no_3rdparty_la-linux_launcher.lo `test -f 'slave/containerizer/mesos/linux_launcher.cpp' || echo '../../src/'`slave/containerizer/mesos/linux_launcher.cpp
/bin/bash ../libtool  --tag=CXX   --mode=compile g++ -DPACKAGE_NAME=\"mesos\" -DPACKAGE_TARNAME=\"mesos\" -DPACKAGE_VERSION=\"1.1.0\" -DPACKAGE_STRING=\"mesos\ 1.1.0\" -DPACKAGE_BUGREPORT=\"\" -DPACKAGE_URL=\"\" -DPACKAGE=\"mesos\" -DVERSION=\"1.1.0\" -DSTDC_HEADERS=1 -DHAVE_SYS_TYPES_H=1 -DHAVE_SYS_STAT_H=1 -DHAVE_STDLIB_H=1 -DHAVE_STRING_H=1 -DHAVE_MEMORY_H=1 -DHAVE_STRINGS_H=1 -DHAVE_INTTYPES_H=1 -DHAVE_STDINT_H=1 -DHAVE_UNISTD_H=1 -DHAVE_DLFCN_H=1 -DLT_OBJDIR=\".libs/\" -DHAVE_CXX11=1 -DHAVE_PTHREAD_PRIO_INHERIT=1 -DHAVE_PTHREAD=1 -DHAVE_LIBZ=1 -DHAVE_FTS_H=1 -DHAVE_APR_POOLS_H=1 -DHAVE_LIBAPR_1=1 -DHAVE_LIBCURL=1 -DMESOS_HAS_JAVA=1 -DHAVE_PYTHON=\"2.7\" -DMESOS_HAS_PYTHON=1 -DHAVE_LIBSASL2=1 -DHAVE_SVN_VERSION_H=1 -DHAVE_LIBSVN_SUBR_1=1 -DHAVE_SVN_DELTA_H=1 -DHAVE_LIBSVN_DELTA_1=1 -DHAVE_LIBZ=1 -I. -I../../src   -Wall -Werror -Wsign-compare -DLIBDIR=\"/mesos/mesos-1.1.0/_inst/lib\" -DPKGLIBEXECDIR=\"/mesos/mesos-1.1.0/_inst/libexec/mesos\" -DPKGDATADIR=\"/mesos/mesos-1.1.0/_inst/share/mesos\" -DPKGMODULEDIR=\"/mesos/mesos-1.1.0/_inst/lib/mesos/modules\" -I../../include -I../include -I../include/mesos -DPICOJSON_USE_INT64 -D__STDC_FORMAT_MACROS -isystem ../3rdparty/boost-1.53.0 -I../3rdparty/elfio-3.2 -I../3rdparty/glog-0.3.3/src -I../3rdparty/leveldb-1.4/include -I../../3rdparty/libprocess/include -I../3rdparty/nvml-352.79 -I../3rdparty/picojson-1.3.0 -I../3rdparty/protobuf-2.6.1/src -I../../3rdparty/stout/include -I../3rdparty/zookeeper-3.4.8/src/c/include -I../3rdparty/zookeeper-3.4.8/src/c/generated -DHAS_AUTHENTICATION=1 -I/usr/include/subversion-1 -I/usr/include/apr-1 -I/usr/include/apr-1.0  -pthread -g1 -O0 -Wno-unused-local-typedefs -std=c++11 -MT slave/containerizer/mesos/isolators/docker/volume/libmesos_no_3rdparty_la-isolator.lo -MD -MP -MF slave/containerizer/mesos/isolators/docker/volume/.deps/libmesos_no_3rdparty_la-isolator.Tpo -c -o slave/containerizer/mesos/isolators/docker/volume/libmesos_no_3rdparty_la-isolator.lo `test -f 'slave/containerizer/mesos/isolators/docker/volume/isolator.cpp' || echo '../../src/'`slave/containerizer/mesos/isolators/docker/volume/isolator.cpp
/bin/bash ../libtool  --tag=CXX   --mode=compile g++ -DPACKAGE_NAME=\"mesos\" -DPACKAGE_TARNAME=\"mesos\" -DPACKAGE_VERSION=\"1.1.0\" -DPACKAGE_STRING=\"mesos\ 1.1.0\" -DPACKAGE_BUGREPORT=\"\" -DPACKAGE_URL=\"\" -DPACKAGE=\"mesos\" -DVERSION=\"1.1.0\" -DSTDC_HEADERS=1 -DHAVE_SYS_TYPES_H=1 -DHAVE_SYS_STAT_H=1 -DHAVE_STDLIB_H=1 -DHAVE_STRING_H=1 -DHAVE_MEMORY_H=1 -DHAVE_STRINGS_H=1 -DHAVE_INTTYPES_H=1 -DHAVE_STDINT_H=1 -DHAVE_UNISTD_H=1 -DHAVE_DLFCN_H=1 -DLT_OBJDIR=\".libs/\" -DHAVE_CXX11=1 -DHAVE_PTHREAD_PRIO_INHERIT=1 -DHAVE_PTHREAD=1 -DHAVE_LIBZ=1 -DHAVE_FTS_H=1 -DHAVE_APR_POOLS_H=1 -DHAVE_LIBAPR_1=1 -DHAVE_LIBCURL=1 -DMESOS_HAS_JAVA=1 -DHAVE_PYTHON=\"2.7\" -DMESOS_HAS_PYTHON=1 -DHAVE_LIBSASL2=1 -DHAVE_SVN_VERSION_H=1 -DHAVE_LIBSVN_SUBR_1=1 -DHAVE_SVN_DELTA_H=1 -DHAVE_LIBSVN_DELTA_1=1 -DHAVE_LIBZ=1 -I. -I../../src   -Wall -Werror -Wsign-compare -DLIBDIR=\"/mesos/mesos-1.1.0/_inst/lib\" -DPKGLIBEXECDIR=\"/mesos/mesos-1.1.0/_inst/libexec/mesos\" -DPKGDATADIR=\"/mesos/mesos-1.1.0/_inst/share/mesos\" -DPKGMODULEDIR=\"/mesos/mesos-1.1.0/_inst/lib/mesos/modules\" -I../../include -I../include -I../include/mesos -DPICOJSON_USE_INT64 -D__STDC_FORMAT_MACROS -isystem ../3rdparty/boost-1.53.0 -I../3rdparty/elfio-3.2 -I../3rdparty/glog-0.3.3/src -I../3rdparty/leveldb-1.4/include -I../../3rdparty/libprocess/include -I../3rdparty/nvml-352.79 -I../3rdparty/picojson-1.3.0 -I../3rdparty/protobuf-2.6.1/src -I../../3rdparty/stout/include -I../3rdparty/zookeeper-3.4.8/src/c/include -I../3rdparty/zookeeper-3.4.8/src/c/generated -DHAS_AUTHENTICATION=1 -I/usr/include/subversion-1 -I/usr/include/apr-1 -I/usr/include/apr-1.0  -pthread -g1 -O0 -Wno-unused-local-typedefs -std=c++11 -MT slave/containerizer/mesos/isolators/filesystem/libmesos_no_3rdparty_la-linux.lo -MD -MP -MF slave/containerizer/mesos/isolators/filesystem/.deps/libmesos_no_3rdparty_la-linux.Tpo -c -o slave/containerizer/mesos/isolators/filesystem/libmesos_no_3rdparty_la-linux.lo `test -f 'slave/containerizer/mesos/isolators/filesystem/linux.cpp' || echo '../../src/'`slave/containerizer/mesos/isolators/filesystem/linux.cpp
/bin/bash ../libtool  --tag=CXX   --mode=compile g++ -DPACKAGE_NAME=\"mesos\" -DPACKAGE_TARNAME=\"mesos\" -DPACKAGE_VERSION=\"1.1.0\" -DPACKAGE_STRING=\"mesos\ 1.1.0\" -DPACKAGE_BUGREPORT=\"\" -DPACKAGE_URL=\"\" -DPACKAGE=\"mesos\" -DVERSION=\"1.1.0\" -DSTDC_HEADERS=1 -DHAVE_SYS_TYPES_H=1 -DHAVE_SYS_STAT_H=1 -DHAVE_STDLIB_H=1 -DHAVE_STRING_H=1 -DHAVE_MEMORY_H=1 -DHAVE_STRINGS_H=1 -DHAVE_INTTYPES_H=1 -DHAVE_STDINT_H=1 -DHAVE_UNISTD_H=1 -DHAVE_DLFCN_H=1 -DLT_OBJDIR=\".libs/\" -DHAVE_CXX11=1 -DHAVE_PTHREAD_PRIO_INHERIT=1 -DHAVE_PTHREAD=1 -DHAVE_LIBZ=1 -DHAVE_FTS_H=1 -DHAVE_APR_POOLS_H=1 -DHAVE_LIBAPR_1=1 -DHAVE_LIBCURL=1 -DMESOS_HAS_JAVA=1 -DHAVE_PYTHON=\"2.7\" -DMESOS_HAS_PYTHON=1 -DHAVE_LIBSASL2=1 -DHAVE_SVN_VERSION_H=1 -DHAVE_LIBSVN_SUBR_1=1 -DHAVE_SVN_DELTA_H=1 -DHAVE_LIBSVN_DELTA_1=1 -DHAVE_LIBZ=1 -I. -I../../src   -Wall -Werror -Wsign-compare -DLIBDIR=\"/mesos/mesos-1.1.0/_inst/lib\" -DPKGLIBEXECDIR=\"/mesos/mesos-1.1.0/_inst/libexec/mesos\" -DPKGDATADIR=\"/mesos/mesos-1.1.0/_inst/share/mesos\" -DPKGMODULEDIR=\"/mesos/mesos-1.1.0/_inst/lib/mesos/modules\" -I../../include -I../include -I../include/mesos -DPICOJSON_USE_INT64 -D__STDC_FORMAT_MACROS -isystem ../3rdparty/boost-1.53.0 -I../3rdparty/elfio-3.2 -I../3rdparty/glog-0.3.3/src -I../3rdparty/leveldb-1.4/include -I../../3rdparty/libprocess/include -I../3rdparty/nvml-352.79 -I../3rdparty/picojson-1.3.0 -I../3rdparty/protobuf-2.6.1/src -I../../3rdparty/stout/include -I../3rdparty/zookeeper-3.4.8/src/c/include -I../3rdparty/zookeeper-3.4.8/src/c/generated -DHAS_AUTHENTICATION=1 -I/usr/include/subversion-1 -I/usr/include/apr-1 -I/usr/include/apr-1.0  -pthread -g1 -O0 -Wno-unused-local-typedefs -std=c++11 -MT slave/containerizer/mesos/isolators/filesystem/libmesos_no_3rdparty_la-shared.lo -MD -MP -MF slave/containerizer/mesos/isolators/filesystem/.deps/libmesos_no_3rdparty_la-shared.Tpo -c -o slave/containerizer/mesos/isolators/filesystem/libmesos_no_3rdparty_la-shared.lo `test -f 'slave/containerizer/mesos/isolators/filesystem/shared.cpp' || echo '../../src/'`slave/containerizer/mesos/isolators/filesystem/shared.cpp
/bin/bash ../libtool  --tag=CXX   --mode=compile g++ -DPACKAGE_NAME=\"mesos\" -DPACKAGE_TARNAME=\"mesos\" -DPACKAGE_VERSION=\"1.1.0\" -DPACKAGE_STRING=\"mesos\ 1.1.0\" -DPACKAGE_BUGREPORT=\"\" -DPACKAGE_URL=\"\" -DPACKAGE=\"mesos\" -DVERSION=\"1.1.0\" -DSTDC_HEADERS=1 -DHAVE_SYS_TYPES_H=1 -DHAVE_SYS_STAT_H=1 -DHAVE_STDLIB_H=1 -DHAVE_STRING_H=1 -DHAVE_MEMORY_H=1 -DHAVE_STRINGS_H=1 -DHAVE_INTTYPES_H=1 -DHAVE_STDINT_H=1 -DHAVE_UNISTD_H=1 -DHAVE_DLFCN_H=1 -DLT_OBJDIR=\".libs/\" -DHAVE_CXX11=1 -DHAVE_PTHREAD_PRIO_INHERIT=1 -DHAVE_PTHREAD=1 -DHAVE_LIBZ=1 -DHAVE_FTS_H=1 -DHAVE_APR_POOLS_H=1 -DHAVE_LIBAPR_1=1 -DHAVE_LIBCURL=1 -DMESOS_HAS_JAVA=1 -DHAVE_PYTHON=\"2.7\" -DMESOS_HAS_PYTHON=1 -DHAVE_LIBSASL2=1 -DHAVE_SVN_VERSION_H=1 -DHAVE_LIBSVN_SUBR_1=1 -DHAVE_SVN_DELTA_H=1 -DHAVE_LIBSVN_DELTA_1=1 -DHAVE_LIBZ=1 -I. -I../../src   -Wall -Werror -Wsign-compare -DLIBDIR=\"/mesos/mesos-1.1.0/_inst/lib\" -DPKGLIBEXECDIR=\"/mesos/mesos-1.1.0/_inst/libexec/mesos\" -DPKGDATADIR=\"/mesos/mesos-1.1.0/_inst/share/mesos\" -DPKGMODULEDIR=\"/mesos/mesos-1.1.0/_inst/lib/mesos/modules\" -I../../include -I../include -I../include/mesos -DPICOJSON_USE_INT64 -D__STDC_FORMAT_MACROS -isystem ../3rdparty/boost-1.53.0 -I../3rdparty/elfio-3.2 -I../3rdparty/glog-0.3.3/src -I../3rdparty/leveldb-1.4/include -I../../3rdparty/libprocess/include -I../3rdparty/nvml-352.79 -I../3rdparty/picojson-1.3.0 -I../3rdparty/protobuf-2.6.1/src -I../../3rdparty/stout/include -I../3rdparty/zookeeper-3.4.8/src/c/include -I../3rdparty/zookeeper-3.4.8/src/c/generated -DHAS_AUTHENTICATION=1 -I/usr/include/subversion-1 -I/usr/include/apr-1 -I/usr/include/apr-1.0  -pthread -g1 -O0 -Wno-unused-local-typedefs -std=c++11 -MT slave/containerizer/mesos/isolators/network/cni/libmesos_no_3rdparty_la-cni.lo -MD -MP -MF slave/containerizer/mesos/isolators/network/cni/.deps/libmesos_no_3rdparty_la-cni.Tpo -c -o slave/containerizer/mesos/isolators/network/cni/libmesos_no_3rdparty_la-cni.lo `test -f 'slave/containerizer/mesos/isolators/network/cni/cni.cpp' || echo '../../src/'`slave/containerizer/mesos/isolators/network/cni/cni.cpp
/bin/bash ../libtool  --tag=CXX   --mode=compile g++ -DPACKAGE_NAME=\"mesos\" -DPACKAGE_TARNAME=\"mesos\" -DPACKAGE_VERSION=\"1.1.0\" -DPACKAGE_STRING=\"mesos\ 1.1.0\" -DPACKAGE_BUGREPORT=\"\" -DPACKAGE_URL=\"\" -DPACKAGE=\"mesos\" -DVERSION=\"1.1.0\" -DSTDC_HEADERS=1 -DHAVE_SYS_TYPES_H=1 -DHAVE_SYS_STAT_H=1 -DHAVE_STDLIB_H=1 -DHAVE_STRING_H=1 -DHAVE_MEMORY_H=1 -DHAVE_STRINGS_H=1 -DHAVE_INTTYPES_H=1 -DHAVE_STDINT_H=1 -DHAVE_UNISTD_H=1 -DHAVE_DLFCN_H=1 -DLT_OBJDIR=\".libs/\" -DHAVE_CXX11=1 -DHAVE_PTHREAD_PRIO_INHERIT=1 -DHAVE_PTHREAD=1 -DHAVE_LIBZ=1 -DHAVE_FTS_H=1 -DHAVE_APR_POOLS_H=1 -DHAVE_LIBAPR_1=1 -DHAVE_LIBCURL=1 -DMESOS_HAS_JAVA=1 -DHAVE_PYTHON=\"2.7\" -DMESOS_HAS_PYTHON=1 -DHAVE_LIBSASL2=1 -DHAVE_SVN_VERSION_H=1 -DHAVE_LIBSVN_SUBR_1=1 -DHAVE_SVN_DELTA_H=1 -DHAVE_LIBSVN_DELTA_1=1 -DHAVE_LIBZ=1 -I. -I../../src   -Wall -Werror -Wsign-compare -DLIBDIR=\"/mesos/mesos-1.1.0/_inst/lib\" -DPKGLIBEXECDIR=\"/mesos/mesos-1.1.0/_inst/libexec/mesos\" -DPKGDATADIR=\"/mesos/mesos-1.1.0/_inst/share/mesos\" -DPKGMODULEDIR=\"/mesos/mesos-1.1.0/_inst/lib/mesos/modules\" -I../../include -I../include -I../include/mesos -DPICOJSON_USE_INT64 -D__STDC_FORMAT_MACROS -isystem ../3rdparty/boost-1.53.0 -I../3rdparty/elfio-3.2 -I../3rdparty/glog-0.3.3/src -I../3rdparty/leveldb-1.4/include -I../../3rdparty/libprocess/include -I../3rdparty/nvml-352.79 -I../3rdparty/picojson-1.3.0 -I../3rdparty/protobuf-2.6.1/src -I../../3rdparty/stout/include -I../3rdparty/zookeeper-3.4.8/src/c/include -I../3rdparty/zookeeper-3.4.8/src/c/generated -DHAS_AUTHENTICATION=1 -I/usr/include/subversion-1 -I/usr/include/apr-1 -I/usr/include/apr-1.0  -pthread -g1 -O0 -Wno-unused-local-typedefs -std=c++11 -MT slave/containerizer/mesos/provisioner/backends/libmesos_no_3rdparty_la-aufs.lo -MD -MP -MF slave/containerizer/mesos/provisioner/backends/.deps/libmesos_no_3rdparty_la-aufs.Tpo -c -o slave/containerizer/mesos/provisioner/backends/libmesos_no_3rdparty_la-aufs.lo `test -f 'slave/containerizer/mesos/provisioner/backends/aufs.cpp' || echo '../../src/'`slave/containerizer/mesos/provisioner/backends/aufs.cpp
/bin/bash ../libtool  --tag=CXX   --mode=compile g++ -DPACKAGE_NAME=\"mesos\" -DPACKAGE_TARNAME=\"mesos\" -DPACKAGE_VERSION=\"1.1.0\" -DPACKAGE_STRING=\"mesos\ 1.1.0\" -DPACKAGE_BUGREPORT=\"\" -DPACKAGE_URL=\"\" -DPACKAGE=\"mesos\" -DVERSION=\"1.1.0\" -DSTDC_HEADERS=1 -DHAVE_SYS_TYPES_H=1 -DHAVE_SYS_STAT_H=1 -DHAVE_STDLIB_H=1 -DHAVE_STRING_H=1 -DHAVE_MEMORY_H=1 -DHAVE_STRINGS_H=1 -DHAVE_INTTYPES_H=1 -DHAVE_STDINT_H=1 -DHAVE_UNISTD_H=1 -DHAVE_DLFCN_H=1 -DLT_OBJDIR=\".libs/\" -DHAVE_CXX11=1 -DHAVE_PTHREAD_PRIO_INHERIT=1 -DHAVE_PTHREAD=1 -DHAVE_LIBZ=1 -DHAVE_FTS_H=1 -DHAVE_APR_POOLS_H=1 -DHAVE_LIBAPR_1=1 -DHAVE_LIBCURL=1 -DMESOS_HAS_JAVA=1 -DHAVE_PYTHON=\"2.7\" -DMESOS_HAS_PYTHON=1 -DHAVE_LIBSASL2=1 -DHAVE_SVN_VERSION_H=1 -DHAVE_LIBSVN_SUBR_1=1 -DHAVE_SVN_DELTA_H=1 -DHAVE_LIBSVN_DELTA_1=1 -DHAVE_LIBZ=1 -I. -I../../src   -Wall -Werror -Wsign-compare -DLIBDIR=\"/mesos/mesos-1.1.0/_inst/lib\" -DPKGLIBEXECDIR=\"/mesos/mesos-1.1.0/_inst/libexec/mesos\" -DPKGDATADIR=\"/mesos/mesos-1.1.0/_inst/share/mesos\" -DPKGMODULEDIR=\"/mesos/mesos-1.1.0/_inst/lib/mesos/modules\" -I../../include -I../include -I../include/mesos -DPICOJSON_USE_INT64 -D__STDC_FORMAT_MACROS -isystem ../3rdparty/boost-1.53.0 -I../3rdparty/elfio-3.2 -I../3rdparty/glog-0.3.3/src -I../3rdparty/leveldb-1.4/include -I../../3rdparty/libprocess/include -I../3rdparty/nvml-352.79 -I../3rdparty/picojson-1.3.0 -I../3rdparty/protobuf-2.6.1/src -I../../3rdparty/stout/include -I../3rdparty/zookeeper-3.4.8/src/c/include -I../3rdparty/zookeeper-3.4.8/src/c/generated -DHAS_AUTHENTICATION=1 -I/usr/include/subversion-1 -I/usr/include/apr-1 -I/usr/include/apr-1.0  -pthread -g1 -O0 -Wno-unused-local-typedefs -std=c++11 -MT slave/containerizer/mesos/provisioner/backends/libmesos_no_3rdparty_la-bind.lo -MD -MP -MF slave/containerizer/mesos/provisioner/backends/.deps/libmesos_no_3rdparty_la-bind.Tpo -c -o slave/containerizer/mesos/provisioner/backends/libmesos_no_3rdparty_la-bind.lo `test -f 'slave/containerizer/mesos/provisioner/backends/bind.cpp' || echo '../../src/'`slave/containerizer/mesos/provisioner/backends/bind.cpp
/bin/bash ../libtool  --tag=CXX   --mode=compile g++ -DPACKAGE_NAME=\"mesos\" -DPACKAGE_TARNAME=\"mesos\" -DPACKAGE_VERSION=\"1.1.0\" -DPACKAGE_STRING=\"mesos\ 1.1.0\" -DPACKAGE_BUGREPORT=\"\" -DPACKAGE_URL=\"\" -DPACKAGE=\"mesos\" -DVERSION=\"1.1.0\" -DSTDC_HEADERS=1 -DHAVE_SYS_TYPES_H=1 -DHAVE_SYS_STAT_H=1 -DHAVE_STDLIB_H=1 -DHAVE_STRING_H=1 -DHAVE_MEMORY_H=1 -DHAVE_STRINGS_H=1 -DHAVE_INTTYPES_H=1 -DHAVE_STDINT_H=1 -DHAVE_UNISTD_H=1 -DHAVE_DLFCN_H=1 -DLT_OBJDIR=\".libs/\" -DHAVE_CXX11=1 -DHAVE_PTHREAD_PRIO_INHERIT=1 -DHAVE_PTHREAD=1 -DHAVE_LIBZ=1 -DHAVE_FTS_H=1 -DHAVE_APR_POOLS_H=1 -DHAVE_LIBAPR_1=1 -DHAVE_LIBCURL=1 -DMESOS_HAS_JAVA=1 -DHAVE_PYTHON=\"2.7\" -DMESOS_HAS_PYTHON=1 -DHAVE_LIBSASL2=1 -DHAVE_SVN_VERSION_H=1 -DHAVE_LIBSVN_SUBR_1=1 -DHAVE_SVN_DELTA_H=1 -DHAVE_LIBSVN_DELTA_1=1 -DHAVE_LIBZ=1 -I. -I../../src   -Wall -Werror -Wsign-compare -DLIBDIR=\"/mesos/mesos-1.1.0/_inst/lib\" -DPKGLIBEXECDIR=\"/mesos/mesos-1.1.0/_inst/libexec/mesos\" -DPKGDATADIR=\"/mesos/mesos-1.1.0/_inst/share/mesos\" -DPKGMODULEDIR=\"/mesos/mesos-1.1.0/_inst/lib/mesos/modules\" -I../../include -I../include -I../include/mesos -DPICOJSON_USE_INT64 -D__STDC_FORMAT_MACROS -isystem ../3rdparty/boost-1.53.0 -I../3rdparty/elfio-3.2 -I../3rdparty/glog-0.3.3/src -I../3rdparty/leveldb-1.4/include -I../../3rdparty/libprocess/include -I../3rdparty/nvml-352.79 -I../3rdparty/picojson-1.3.0 -I../3rdparty/protobuf-2.6.1/src -I../../3rdparty/stout/include -I../3rdparty/zookeeper-3.4.8/src/c/include -I../3rdparty/zookeeper-3.4.8/src/c/generated -DHAS_AUTHENTICATION=1 -I/usr/include/subversion-1 -I/usr/include/apr-1 -I/usr/include/apr-1.0  -pthread -g1 -O0 -Wno-unused-local-typedefs -std=c++11 -MT slave/containerizer/mesos/provisioner/backends/libmesos_no_3rdparty_la-overlay.lo -MD -MP -MF slave/containerizer/mesos/provisioner/backends/.deps/libmesos_no_3rdparty_la-overlay.Tpo -c -o slave/containerizer/mesos/provisioner/backends/libmesos_no_3rdparty_la-overlay.lo `test -f 'slave/containerizer/mesos/provisioner/backends/overlay.cpp' || echo '../../src/'`slave/containerizer/mesos/provisioner/backends/overlay.cpp
libtool: compile:  g++ -DPACKAGE_NAME=\"mesos\" -DPACKAGE_TARNAME=\"mesos\" -DPACKAGE_VERSION=\"1.1.0\" "-DPACKAGE_STRING=\"mesos 1.1.0\"" -DPACKAGE_BUGREPORT=\"\" -DPACKAGE_URL=\"\" -DPACKAGE=\"mesos\" -DVERSION=\"1.1.0\" -DSTDC_HEADERS=1 -DHAVE_SYS_TYPES_H=1 -DHAVE_SYS_STAT_H=1 -DHAVE_STDLIB_H=1 -DHAVE_STRING_H=1 -DHAVE_MEMORY_H=1 -DHAVE_STRINGS_H=1 -DHAVE_INTTYPES_H=1 -DHAVE_STDINT_H=1 -DHAVE_UNISTD_H=1 -DHAVE_DLFCN_H=1 -DLT_OBJDIR=\".libs/\" -DHAVE_CXX11=1 -DHAVE_PTHREAD_PRIO_INHERIT=1 -DHAVE_PTHREAD=1 -DHAVE_LIBZ=1 -DHAVE_FTS_H=1 -DHAVE_APR_POOLS_H=1 -DHAVE_LIBAPR_1=1 -DHAVE_LIBCURL=1 -DMESOS_HAS_JAVA=1 -DHAVE_PYTHON=\"2.7\" -DMESOS_HAS_PYTHON=1 -DHAVE_LIBSASL2=1 -DHAVE_SVN_VERSION_H=1 -DHAVE_LIBSVN_SUBR_1=1 -DHAVE_SVN_DELTA_H=1 -DHAVE_LIBSVN_DELTA_1=1 -DHAVE_LIBZ=1 -I. -I../../src -Wall -Werror -Wsign-compare -DLIBDIR=\"/mesos/mesos-1.1.0/_inst/lib\" -DPKGLIBEXECDIR=\"/mesos/mesos-1.1.0/_inst/libexec/mesos\" -DPKGDATADIR=\"/mesos/mesos-1.1.0/_inst/share/mesos\" -DPKGMODULEDIR=\"/mesos/mesos-1.1.0/_inst/lib/mesos/modules\" -I../../include -I../include -I../include/mesos -DPICOJSON_USE_INT64 -D__STDC_FORMAT_MACROS -isystem ../3rdparty/boost-1.53.0 -I../3rdparty/elfio-3.2 -I../3rdparty/glog-0.3.3/src -I../3rdparty/leveldb-1.4/include -I../../3rdparty/libprocess/include -I../3rdparty/nvml-352.79 -I../3rdparty/picojson-1.3.0 -I../3rdparty/protobuf-2.6.1/src -I../../3rdparty/stout/include -I../3rdparty/zookeeper-3.4.8/src/c/include -I../3rdparty/zookeeper-3.4.8/src/c/generated -DHAS_AUTHENTICATION=1 -I/usr/include/subversion-1 -I/usr/include/apr-1 -I/usr/include/apr-1.0 -pthread -g1 -O0 -Wno-unused-local-typedefs -std=c++11 -MT slave/containerizer/mesos/libmesos_no_3rdparty_la-linux_launcher.lo -MD -MP -MF slave/containerizer/mesos/.deps/libmesos_no_3rdparty_la-linux_launcher.Tpo -c ../../src/slave/containerizer/mesos/linux_launcher.cpp  -fPIC -DPIC -o slave/containerizer/mesos/.libs/libmesos_no_3rdparty_la-linux_launcher.o
libtool: compile:  g++ -DPACKAGE_NAME=\"mesos\" -DPACKAGE_TARNAME=\"mesos\" -DPACKAGE_VERSION=\"1.1.0\" "-DPACKAGE_STRING=\"mesos 1.1.0\"" -DPACKAGE_BUGREPORT=\"\" -DPACKAGE_URL=\"\" -DPACKAGE=\"mesos\" -DVERSION=\"1.1.0\" -DSTDC_HEADERS=1 -DHAVE_SYS_TYPES_H=1 -DHAVE_SYS_STAT_H=1 -DHAVE_STDLIB_H=1 -DHAVE_STRING_H=1 -DHAVE_MEMORY_H=1 -DHAVE_STRINGS_H=1 -DHAVE_INTTYPES_H=1 -DHAVE_STDINT_H=1 -DHAVE_UNISTD_H=1 -DHAVE_DLFCN_H=1 -DLT_OBJDIR=\".libs/\" -DHAVE_CXX11=1 -DHAVE_PTHREAD_PRIO_INHERIT=1 -DHAVE_PTHREAD=1 -DHAVE_LIBZ=1 -DHAVE_FTS_H=1 -DHAVE_APR_POOLS_H=1 -DHAVE_LIBAPR_1=1 -DHAVE_LIBCURL=1 -DMESOS_HAS_JAVA=1 -DHAVE_PYTHON=\"2.7\" -DMESOS_HAS_PYTHON=1 -DHAVE_LIBSASL2=1 -DHAVE_SVN_VERSION_H=1 -DHAVE_LIBSVN_SUBR_1=1 -DHAVE_SVN_DELTA_H=1 -DHAVE_LIBSVN_DELTA_1=1 -DHAVE_LIBZ=1 -I. -I../../src -Wall -Werror -Wsign-compare -DLIBDIR=\"/mesos/mesos-1.1.0/_inst/lib\" -DPKGLIBEXECDIR=\"/mesos/mesos-1.1.0/_inst/libexec/mesos\" -DPKGDATADIR=\"/mesos/mesos-1.1.0/_inst/share/mesos\" -DPKGMODULEDIR=\"/mesos/mesos-1.1.0/_inst/lib/mesos/modules\" -I../../include -I../include -I../include/mesos -DPICOJSON_USE_INT64 -D__STDC_FORMAT_MACROS -isystem ../3rdparty/boost-1.53.0 -I../3rdparty/elfio-3.2 -I../3rdparty/glog-0.3.3/src -I../3rdparty/leveldb-1.4/include -I../../3rdparty/libprocess/include -I../3rdparty/nvml-352.79 -I../3rdparty/picojson-1.3.0 -I../3rdparty/protobuf-2.6.1/src -I../../3rdparty/stout/include -I../3rdparty/zookeeper-3.4.8/src/c/include -I../3rdparty/zookeeper-3.4.8/src/c/generated -DHAS_AUTHENTICATION=1 -I/usr/include/subversion-1 -I/usr/include/apr-1 -I/usr/include/apr-1.0 -pthread -g1 -O0 -Wno-unused-local-typedefs -std=c++11 -MT slave/containerizer/mesos/isolators/docker/volume/libmesos_no_3rdparty_la-isolator.lo -MD -MP -MF slave/containerizer/mesos/isolators/docker/volume/.deps/libmesos_no_3rdparty_la-isolator.Tpo -c ../../src/slave/containerizer/mesos/isolators/docker/volume/isolator.cpp  -fPIC -DPIC -o slave/containerizer/mesos/isolators/docker/volume/.libs/libmesos_no_3rdparty_la-isolator.o
libtool: compile:  g++ -DPACKAGE_NAME=\"mesos\" -DPACKAGE_TARNAME=\"mesos\" -DPACKAGE_VERSION=\"1.1.0\" "-DPACKAGE_STRING=\"mesos 1.1.0\"" -DPACKAGE_BUGREPORT=\"\" -DPACKAGE_URL=\"\" -DPACKAGE=\"mesos\" -DVERSION=\"1.1.0\" -DSTDC_HEADERS=1 -DHAVE_SYS_TYPES_H=1 -DHAVE_SYS_STAT_H=1 -DHAVE_STDLIB_H=1 -DHAVE_STRING_H=1 -DHAVE_MEMORY_H=1 -DHAVE_STRINGS_H=1 -DHAVE_INTTYPES_H=1 -DHAVE_STDINT_H=1 -DHAVE_UNISTD_H=1 -DHAVE_DLFCN_H=1 -DLT_OBJDIR=\".libs/\" -DHAVE_CXX11=1 -DHAVE_PTHREAD_PRIO_INHERIT=1 -DHAVE_PTHREAD=1 -DHAVE_LIBZ=1 -DHAVE_FTS_H=1 -DHAVE_APR_POOLS_H=1 -DHAVE_LIBAPR_1=1 -DHAVE_LIBCURL=1 -DMESOS_HAS_JAVA=1 -DHAVE_PYTHON=\"2.7\" -DMESOS_HAS_PYTHON=1 -DHAVE_LIBSASL2=1 -DHAVE_SVN_VERSION_H=1 -DHAVE_LIBSVN_SUBR_1=1 -DHAVE_SVN_DELTA_H=1 -DHAVE_LIBSVN_DELTA_1=1 -DHAVE_LIBZ=1 -I. -I../../src -Wall -Werror -Wsign-compare -DLIBDIR=\"/mesos/mesos-1.1.0/_inst/lib\" -DPKGLIBEXECDIR=\"/mesos/mesos-1.1.0/_inst/libexec/mesos\" -DPKGDATADIR=\"/mesos/mesos-1.1.0/_inst/share/mesos\" -DPKGMODULEDIR=\"/mesos/mesos-1.1.0/_inst/lib/mesos/modules\" -I../../include -I../include -I../include/mesos -DPICOJSON_USE_INT64 -D__STDC_FORMAT_MACROS -isystem ../3rdparty/boost-1.53.0 -I../3rdparty/elfio-3.2 -I../3rdparty/glog-0.3.3/src -I../3rdparty/leveldb-1.4/include -I../../3rdparty/libprocess/include -I../3rdparty/nvml-352.79 -I../3rdparty/picojson-1.3.0 -I../3rdparty/protobuf-2.6.1/src -I../../3rdparty/stout/include -I../3rdparty/zookeeper-3.4.8/src/c/include -I../3rdparty/zookeeper-3.4.8/src/c/generated -DHAS_AUTHENTICATION=1 -I/usr/include/subversion-1 -I/usr/include/apr-1 -I/usr/include/apr-1.0 -pthread -g1 -O0 -Wno-unused-local-typedefs -std=c++11 -MT slave/containerizer/mesos/isolators/filesystem/libmesos_no_3rdparty_la-linux.lo -MD -MP -MF slave/containerizer/mesos/isolators/filesystem/.deps/libmesos_no_3rdparty_la-linux.Tpo -c ../../src/slave/containerizer/mesos/isolators/filesystem/linux.cpp  -fPIC -DPIC -o slave/containerizer/mesos/isolators/filesystem/.libs/libmesos_no_3rdparty_la-linux.o
libtool: compile:  g++ -DPACKAGE_NAME=\"mesos\" -DPACKAGE_TARNAME=\"mesos\" -DPACKAGE_VERSION=\"1.1.0\" "-DPACKAGE_STRING=\"mesos 1.1.0\"" -DPACKAGE_BUGREPORT=\"\" -DPACKAGE_URL=\"\" -DPACKAGE=\"mesos\" -DVERSION=\"1.1.0\" -DSTDC_HEADERS=1 -DHAVE_SYS_TYPES_H=1 -DHAVE_SYS_STAT_H=1 -DHAVE_STDLIB_H=1 -DHAVE_STRING_H=1 -DHAVE_MEMORY_H=1 -DHAVE_STRINGS_H=1 -DHAVE_INTTYPES_H=1 -DHAVE_STDINT_H=1 -DHAVE_UNISTD_H=1 -DHAVE_DLFCN_H=1 -DLT_OBJDIR=\".libs/\" -DHAVE_CXX11=1 -DHAVE_PTHREAD_PRIO_INHERIT=1 -DHAVE_PTHREAD=1 -DHAVE_LIBZ=1 -DHAVE_FTS_H=1 -DHAVE_APR_POOLS_H=1 -DHAVE_LIBAPR_1=1 -DHAVE_LIBCURL=1 -DMESOS_HAS_JAVA=1 -DHAVE_PYTHON=\"2.7\" -DMESOS_HAS_PYTHON=1 -DHAVE_LIBSASL2=1 -DHAVE_SVN_VERSION_H=1 -DHAVE_LIBSVN_SUBR_1=1 -DHAVE_SVN_DELTA_H=1 -DHAVE_LIBSVN_DELTA_1=1 -DHAVE_LIBZ=1 -I. -I../../src -Wall -Werror -Wsign-compare -DLIBDIR=\"/mesos/mesos-1.1.0/_inst/lib\" -DPKGLIBEXECDIR=\"/mesos/mesos-1.1.0/_inst/libexec/mesos\" -DPKGDATADIR=\"/mesos/mesos-1.1.0/_inst/share/mesos\" -DPKGMODULEDIR=\"/mesos/mesos-1.1.0/_inst/lib/mesos/modules\" -I../../include -I../include -I../include/mesos -DPICOJSON_USE_INT64 -D__STDC_FORMAT_MACROS -isystem ../3rdparty/boost-1.53.0 -I../3rdparty/elfio-3.2 -I../3rdparty/glog-0.3.3/src -I../3rdparty/leveldb-1.4/include -I../../3rdparty/libprocess/include -I../3rdparty/nvml-352.79 -I../3rdparty/picojson-1.3.0 -I../3rdparty/protobuf-2.6.1/src -I../../3rdparty/stout/include -I../3rdparty/zookeeper-3.4.8/src/c/include -I../3rdparty/zookeeper-3.4.8/src/c/generated -DHAS_AUTHENTICATION=1 -I/usr/include/subversion-1 -I/usr/include/apr-1 -I/usr/include/apr-1.0 -pthread -g1 -O0 -Wno-unused-local-typedefs -std=c++11 -MT slave/containerizer/mesos/isolators/filesystem/libmesos_no_3rdparty_la-shared.lo -MD -MP -MF slave/containerizer/mesos/isolators/filesystem/.deps/libmesos_no_3rdparty_la-shared.Tpo -c ../../src/slave/containerizer/mesos/isolators/filesystem/shared.cpp  -fPIC -DPIC -o slave/containerizer/mesos/isolators/filesystem/.libs/libmesos_no_3rdparty_la-shared.o
libtool: compile:  g++ -DPACKAGE_NAME=\"mesos\" -DPACKAGE_TARNAME=\"mesos\" -DPACKAGE_VERSION=\"1.1.0\" "-DPACKAGE_STRING=\"mesos 1.1.0\"" -DPACKAGE_BUGREPORT=\"\" -DPACKAGE_URL=\"\" -DPACKAGE=\"mesos\" -DVERSION=\"1.1.0\" -DSTDC_HEADERS=1 -DHAVE_SYS_TYPES_H=1 -DHAVE_SYS_STAT_H=1 -DHAVE_STDLIB_H=1 -DHAVE_STRING_H=1 -DHAVE_MEMORY_H=1 -DHAVE_STRINGS_H=1 -DHAVE_INTTYPES_H=1 -DHAVE_STDINT_H=1 -DHAVE_UNISTD_H=1 -DHAVE_DLFCN_H=1 -DLT_OBJDIR=\".libs/\" -DHAVE_CXX11=1 -DHAVE_PTHREAD_PRIO_INHERIT=1 -DHAVE_PTHREAD=1 -DHAVE_LIBZ=1 -DHAVE_FTS_H=1 -DHAVE_APR_POOLS_H=1 -DHAVE_LIBAPR_1=1 -DHAVE_LIBCURL=1 -DMESOS_HAS_JAVA=1 -DHAVE_PYTHON=\"2.7\" -DMESOS_HAS_PYTHON=1 -DHAVE_LIBSASL2=1 -DHAVE_SVN_VERSION_H=1 -DHAVE_LIBSVN_SUBR_1=1 -DHAVE_SVN_DELTA_H=1 -DHAVE_LIBSVN_DELTA_1=1 -DHAVE_LIBZ=1 -I. -I../../src -Wall -Werror -Wsign-compare -DLIBDIR=\"/mesos/mesos-1.1.0/_inst/lib\" -DPKGLIBEXECDIR=\"/mesos/mesos-1.1.0/_inst/libexec/mesos\" -DPKGDATADIR=\"/mesos/mesos-1.1.0/_inst/share/mesos\" -DPKGMODULEDIR=\"/mesos/mesos-1.1.0/_inst/lib/mesos/modules\" -I../../include -I../include -I../include/mesos -DPICOJSON_USE_INT64 -D__STDC_FORMAT_MACROS -isystem ../3rdparty/boost-1.53.0 -I../3rdparty/elfio-3.2 -I../3rdparty/glog-0.3.3/src -I../3rdparty/leveldb-1.4/include -I../../3rdparty/libprocess/include -I../3rdparty/nvml-352.79 -I../3rdparty/picojson-1.3.0 -I../3rdparty/protobuf-2.6.1/src -I../../3rdparty/stout/include -I../3rdparty/zookeeper-3.4.8/src/c/include -I../3rdparty/zookeeper-3.4.8/src/c/generated -DHAS_AUTHENTICATION=1 -I/usr/include/subversion-1 -I/usr/include/apr-1 -I/usr/include/apr-1.0 -pthread -g1 -O0 -Wno-unused-local-typedefs -std=c++11 -MT slave/containerizer/mesos/isolators/network/cni/libmesos_no_3rdparty_la-cni.lo -MD -MP -MF slave/containerizer/mesos/isolators/network/cni/.deps/libmesos_no_3rdparty_la-cni.Tpo -c ../../src/slave/containerizer/mesos/isolators/network/cni/cni.cpp  -fPIC -DPIC -o slave/containerizer/mesos/isolators/network/cni/.libs/libmesos_no_3rdparty_la-cni.o
libtool: compile:  g++ -DPACKAGE_NAME=\"mesos\" -DPACKAGE_TARNAME=\"mesos\" -DPACKAGE_VERSION=\"1.1.0\" "-DPACKAGE_STRING=\"mesos 1.1.0\"" -DPACKAGE_BUGREPORT=\"\" -DPACKAGE_URL=\"\" -DPACKAGE=\"mesos\" -DVERSION=\"1.1.0\" -DSTDC_HEADERS=1 -DHAVE_SYS_TYPES_H=1 -DHAVE_SYS_STAT_H=1 -DHAVE_STDLIB_H=1 -DHAVE_STRING_H=1 -DHAVE_MEMORY_H=1 -DHAVE_STRINGS_H=1 -DHAVE_INTTYPES_H=1 -DHAVE_STDINT_H=1 -DHAVE_UNISTD_H=1 -DHAVE_DLFCN_H=1 -DLT_OBJDIR=\".libs/\" -DHAVE_CXX11=1 -DHAVE_PTHREAD_PRIO_INHERIT=1 -DHAVE_PTHREAD=1 -DHAVE_LIBZ=1 -DHAVE_FTS_H=1 -DHAVE_APR_POOLS_H=1 -DHAVE_LIBAPR_1=1 -DHAVE_LIBCURL=1 -DMESOS_HAS_JAVA=1 -DHAVE_PYTHON=\"2.7\" -DMESOS_HAS_PYTHON=1 -DHAVE_LIBSASL2=1 -DHAVE_SVN_VERSION_H=1 -DHAVE_LIBSVN_SUBR_1=1 -DHAVE_SVN_DELTA_H=1 -DHAVE_LIBSVN_DELTA_1=1 -DHAVE_LIBZ=1 -I. -I../../src -Wall -Werror -Wsign-compare -DLIBDIR=\"/mesos/mesos-1.1.0/_inst/lib\" -DPKGLIBEXECDIR=\"/mesos/mesos-1.1.0/_inst/libexec/mesos\" -DPKGDATADIR=\"/mesos/mesos-1.1.0/_inst/share/mesos\" -DPKGMODULEDIR=\"/mesos/mesos-1.1.0/_inst/lib/mesos/modules\" -I../../include -I../include -I../include/mesos -DPICOJSON_USE_INT64 -D__STDC_FORMAT_MACROS -isystem ../3rdparty/boost-1.53.0 -I../3rdparty/elfio-3.2 -I../3rdparty/glog-0.3.3/src -I../3rdparty/leveldb-1.4/include -I../../3rdparty/libprocess/include -I../3rdparty/nvml-352.79 -I../3rdparty/picojson-1.3.0 -I../3rdparty/protobuf-2.6.1/src -I../../3rdparty/stout/include -I../3rdparty/zookeeper-3.4.8/src/c/include -I../3rdparty/zookeeper-3.4.8/src/c/generated -DHAS_AUTHENTICATION=1 -I/usr/include/subversion-1 -I/usr/include/apr-1 -I/usr/include/apr-1.0 -pthread -g1 -O0 -Wno-unused-local-typedefs -std=c++11 -MT slave/containerizer/mesos/provisioner/backends/libmesos_no_3rdparty_la-bind.lo -MD -MP -MF slave/containerizer/mesos/provisioner/backends/.deps/libmesos_no_3rdparty_la-bind.Tpo -c ../../src/slave/containerizer/mesos/provisioner/backends/bind.cpp  -fPIC -DPIC -o slave/containerizer/mesos/provisioner/backends/.libs/libmesos_no_3rdparty_la-bind.o
libtool: compile:  g++ -DPACKAGE_NAME=\"mesos\" -DPACKAGE_TARNAME=\"mesos\" -DPACKAGE_VERSION=\"1.1.0\" "-DPACKAGE_STRING=\"mesos 1.1.0\"" -DPACKAGE_BUGREPORT=\"\" -DPACKAGE_URL=\"\" -DPACKAGE=\"mesos\" -DVERSION=\"1.1.0\" -DSTDC_HEADERS=1 -DHAVE_SYS_TYPES_H=1 -DHAVE_SYS_STAT_H=1 -DHAVE_STDLIB_H=1 -DHAVE_STRING_H=1 -DHAVE_MEMORY_H=1 -DHAVE_STRINGS_H=1 -DHAVE_INTTYPES_H=1 -DHAVE_STDINT_H=1 -DHAVE_UNISTD_H=1 -DHAVE_DLFCN_H=1 -DLT_OBJDIR=\".libs/\" -DHAVE_CXX11=1 -DHAVE_PTHREAD_PRIO_INHERIT=1 -DHAVE_PTHREAD=1 -DHAVE_LIBZ=1 -DHAVE_FTS_H=1 -DHAVE_APR_POOLS_H=1 -DHAVE_LIBAPR_1=1 -DHAVE_LIBCURL=1 -DMESOS_HAS_JAVA=1 -DHAVE_PYTHON=\"2.7\" -DMESOS_HAS_PYTHON=1 -DHAVE_LIBSASL2=1 -DHAVE_SVN_VERSION_H=1 -DHAVE_LIBSVN_SUBR_1=1 -DHAVE_SVN_DELTA_H=1 -DHAVE_LIBSVN_DELTA_1=1 -DHAVE_LIBZ=1 -I. -I../../src -Wall -Werror -Wsign-compare -DLIBDIR=\"/mesos/mesos-1.1.0/_inst/lib\" -DPKGLIBEXECDIR=\"/mesos/mesos-1.1.0/_inst/libexec/mesos\" -DPKGDATADIR=\"/mesos/mesos-1.1.0/_inst/share/mesos\" -DPKGMODULEDIR=\"/mesos/mesos-1.1.0/_inst/lib/mesos/modules\" -I../../include -I../include -I../include/mesos -DPICOJSON_USE_INT64 -D__STDC_FORMAT_MACROS -isystem ../3rdparty/boost-1.53.0 -I../3rdparty/elfio-3.2 -I../3rdparty/glog-0.3.3/src -I../3rdparty/leveldb-1.4/include -I../../3rdparty/libprocess/include -I../3rdparty/nvml-352.79 -I../3rdparty/picojson-1.3.0 -I../3rdparty/protobuf-2.6.1/src -I../../3rdparty/stout/include -I../3rdparty/zookeeper-3.4.8/src/c/include -I../3rdparty/zookeeper-3.4.8/src/c/generated -DHAS_AUTHENTICATION=1 -I/usr/include/subversion-1 -I/usr/include/apr-1 -I/usr/include/apr-1.0 -pthread -g1 -O0 -Wno-unused-local-typedefs -std=c++11 -MT slave/containerizer/mesos/provisioner/backends/libmesos_no_3rdparty_la-overlay.lo -MD -MP -MF slave/containerizer/mesos/provisioner/backends/.deps/libmesos_no_3rdparty_la-overlay.Tpo -c ../../src/slave/containerizer/mesos/provisioner/backends/overlay.cpp  -fPIC -DPIC -o slave/containerizer/mesos/provisioner/backends/.libs/libmesos_no_3rdparty_la-overlay.o
libtool: compile:  g++ -DPACKAGE_NAME=\"mesos\" -DPACKAGE_TARNAME=\"mesos\" -DPACKAGE_VERSION=\"1.1.0\" "-DPACKAGE_STRING=\"mesos 1.1.0\"" -DPACKAGE_BUGREPORT=\"\" -DPACKAGE_URL=\"\" -DPACKAGE=\"mesos\" -DVERSION=\"1.1.0\" -DSTDC_HEADERS=1 -DHAVE_SYS_TYPES_H=1 -DHAVE_SYS_STAT_H=1 -DHAVE_STDLIB_H=1 -DHAVE_STRING_H=1 -DHAVE_MEMORY_H=1 -DHAVE_STRINGS_H=1 -DHAVE_INTTYPES_H=1 -DHAVE_STDINT_H=1 -DHAVE_UNISTD_H=1 -DHAVE_DLFCN_H=1 -DLT_OBJDIR=\".libs/\" -DHAVE_CXX11=1 -DHAVE_PTHREAD_PRIO_INHERIT=1 -DHAVE_PTHREAD=1 -DHAVE_LIBZ=1 -DHAVE_FTS_H=1 -DHAVE_APR_POOLS_H=1 -DHAVE_LIBAPR_1=1 -DHAVE_LIBCURL=1 -DMESOS_HAS_JAVA=1 -DHAVE_PYTHON=\"2.7\" -DMESOS_HAS_PYTHON=1 -DHAVE_LIBSASL2=1 -DHAVE_SVN_VERSION_H=1 -DHAVE_LIBSVN_SUBR_1=1 -DHAVE_SVN_DELTA_H=1 -DHAVE_LIBSVN_DELTA_1=1 -DHAVE_LIBZ=1 -I. -I../../src -Wall -Werror -Wsign-compare -DLIBDIR=\"/mesos/mesos-1.1.0/_inst/lib\" -DPKGLIBEXECDIR=\"/mesos/mesos-1.1.0/_inst/libexec/mesos\" -DPKGDATADIR=\"/mesos/mesos-1.1.0/_inst/share/mesos\" -DPKGMODULEDIR=\"/mesos/mesos-1.1.0/_inst/lib/mesos/modules\" -I../../include -I../include -I../include/mesos -DPICOJSON_USE_INT64 -D__STDC_FORMAT_MACROS -isystem ../3rdparty/boost-1.53.0 -I../3rdparty/elfio-3.2 -I../3rdparty/glog-0.3.3/src -I../3rdparty/leveldb-1.4/include -I../../3rdparty/libprocess/include -I../3rdparty/nvml-352.79 -I../3rdparty/picojson-1.3.0 -I../3rdparty/protobuf-2.6.1/src -I../../3rdparty/stout/include -I../3rdparty/zookeeper-3.4.8/src/c/include -I../3rdparty/zookeeper-3.4.8/src/c/generated -DHAS_AUTHENTICATION=1 -I/usr/include/subversion-1 -I/usr/include/apr-1 -I/usr/include/apr-1.0 -pthread -g1 -O0 -Wno-unused-local-typedefs -std=c++11 -MT slave/containerizer/mesos/provisioner/backends/libmesos_no_3rdparty_la-aufs.lo -MD -MP -MF slave/containerizer/mesos/provisioner/backends/.deps/libmesos_no_3rdparty_la-aufs.Tpo -c ../../src/slave/containerizer/mesos/provisioner/backends/aufs.cpp  -fPIC -DPIC -o slave/containerizer/mesos/provisioner/backends/.libs/libmesos_no_3rdparty_la-aufs.o
In file included from ../../src/slave/containerizer/mesos/isolator.hpp:20:0,
                 from ../../src/slave/containerizer/mesos/isolators/network/cni/cni.hpp:27,
                 from ../../src/slave/containerizer/mesos/isolators/network/cni/cni.cpp:33:
../../include/mesos/slave/isolator.hpp:25:41: fatal error: mesos/slave/containerizer.hpp: No such file or directory
 #include <mesos/slave/containerizer.hpp>
                                         ^
compilation terminated.
In file included from ../../src/slave/containerizer/mesos/launcher.hpp:28:0,
                 from ../../src/slave/containerizer/mesos/linux_launcher.hpp:20,
                 from ../../src/slave/containerizer/mesos/linux_launcher.cpp:39:
../../include/mesos/slave/isolator.hpp:25:41: fatal error: mesos/slave/containerizer.hpp: No such file or directory
 #include <mesos/slave/containerizer.hpp>
                                         ^
compilation terminated.
In file included from ../../src/slave/containerizer/mesos/isolator.hpp:20:0,
                 from ../../src/slave/containerizer/mesos/isolators/filesystem/shared.hpp:22,
                 from ../../src/slave/containerizer/mesos/isolators/filesystem/shared.cpp:25:
../../include/mesos/slave/isolator.hpp:25:41: fatal error: mesos/slave/containerizer.hpp: No such file or directory
 #include <mesos/slave/containerizer.hpp>
                                         ^
compilation terminated.
In file included from ../../src/slave/containerizer/mesos/isolator.hpp:20:0,
                 from ../../src/slave/containerizer/mesos/isolators/docker/volume/isolator.hpp:31,
                 from ../../src/slave/containerizer/mesos/isolators/docker/volume/isolator.cpp:25:
../../include/mesos/slave/isolator.hpp:25:41: fatal error: mesos/slave/containerizer.hpp: No such file or directory
 #include <mesos/slave/containerizer.hpp>
                                         ^
compilation terminated.
In file included from ../../src/slave/containerizer/mesos/isolator.hpp:20:0,
                 from ../../src/slave/containerizer/mesos/isolators/filesystem/linux.hpp:32,
                 from ../../src/slave/containerizer/mesos/isolators/filesystem/linux.cpp:46:
../../include/mesos/slave/isolator.hpp:25:41: fatal error: mesos/slave/containerizer.hpp: No such file or directory
 #include <mesos/slave/containerizer.hpp>
                                         ^
compilation terminated.
make[3]: *** [slave/containerizer/mesos/isolators/network/cni/libmesos_no_3rdparty_la-cni.lo] Error 1
make[3]: *** Waiting for unfinished jobs....
make[3]: *** [slave/containerizer/mesos/libmesos_no_3rdparty_la-linux_launcher.lo] Error 1
make[3]: *** [slave/containerizer/mesos/isolators/docker/volume/libmesos_no_3rdparty_la-isolator.lo] Error 1
make[3]: *** [slave/containerizer/mesos/isolators/filesystem/libmesos_no_3rdparty_la-shared.lo] Error 1
make[3]: *** [slave/containerizer/mesos/isolators/filesystem/libmesos_no_3rdparty_la-linux.lo] Error 1
mv -f slave/containerizer/mesos/provisioner/backends/.deps/libmesos_no_3rdparty_la-aufs.Tpo slave/containerizer/mesos/provisioner/backends/.deps/libmesos_no_3rdparty_la-aufs.Plo
mv -f slave/containerizer/mesos/provisioner/backends/.deps/libmesos_no_3rdparty_la-overlay.Tpo slave/containerizer/mesos/provisioner/backends/.deps/libmesos_no_3rdparty_la-overlay.Plo
mv -f slave/containerizer/mesos/provisioner/backends/.deps/libmesos_no_3rdparty_la-bind.Tpo slave/containerizer/mesos/provisioner/backends/.deps/libmesos_no_3rdparty_la-bind.Plo
make[3]: Leaving directory `/mesos/mesos-1.1.0/_build/src'
make[2]: *** [all] Error 2
make[2]: Leaving directory `/mesos/mesos-1.1.0/_build/src'
make[1]: Leaving directory `/mesos/mesos-1.1.0/_build'
make[1]: *** [all-recursive] Error 1
make: *** [distcheck] Error 1
+ docker rmi mesos-1471971330-5704
Untagged: mesos-1471971330-5704:latest
Deleted: sha256:9f41483344f0b29015945036e25cc7533a12bc94b232eb119209c658b456a873
Deleted: sha256:02f05dc4888328f6275ca8b19a2136d27740ed12ee553ae5a808bbbf9e29a80a
Deleted: sha256:7da69bf7ec1a54a752594c5db27123fab725bdea3fb227dbc461dfcc4741f171
Deleted: sha256:6e8fb716fa0c0f53feefaaa4632a82eb523b302592d890dad8aeb9cc6d569f64
Deleted: sha256:8bf8b5c6e263e2ecc682daf58d7464f519b80fa4847dfc45c2a8739d9f557a38
Deleted: sha256:082f367184f0ea3388ac903b2160e10ca9dd1805db1b32430fd93e758fe67e05
Deleted: sha256:31725830381cbe01c2a3c1c26a97fd2125c9d8650d9cfb7efb924c064cd4cd82
Deleted: sha256:e3b11cf378ccbcd785ec7876a90dbbf2485ed6bde492b87d2d18115fc8c129c5
Deleted: sha256:3d26ea1726a5ae5147afeb27ada7dc44b19886d59c6c80ede6f7c023c5d7782f
Deleted: sha256:b9b8db0ac943f060689f6c6bff69a8ebceb0dcc8cee0919850bb4a920f321e25
Deleted: sha256:3d3167e3688c3f6c4847288a9a39c4c0adb2cf6cadfaa1cbeda2f0aa0382c1e9
Deleted: sha256:15a437326ea2eba59d9390f14781ee2de5e66e182df1fb8d9d8bc8a342c3d792
Deleted: sha256:f386119956c2d3dce84b592aedf2149424e7ddb3de018430e6e7c349b9222972
Deleted: sha256:e3e40d80e954e2cd62ae91ff37f33d4c059533a85caffdc286dc4c0a8eca1642
Deleted: sha256:2c8a840de7f4364cda4d68bd61226f084fc144225ac9fd5a460849247df376dd
Deleted: sha256:0d04d6d6898ef10b2f1ed24c6e9358b95f93617706f11e0df60f5d4e97ba0bd2
Deleted: sha256:009dce38cf46337eabc904ea0f5f8598ba16eb42d3452a0ceb29b55c7fb7c4da
Deleted: sha256:22fd4698ea3712f157afb3fde656234d1d51acf96567c3f683ada11ea0653069
Deleted: sha256:4113f6251a233d567d66365844529ef5724e82cdbf4fcfcf01818b158aafb3a2
Deleted: sha256:1d142ce2ca44120dc35217e38c3aae97de89b28dd0c79f05b18f2419463e55ed
Deleted: sha256:1bb9ae1a6c386a8a66147751f1dc4f7064b2ce20e0d7d14448f3e94c35851170
Deleted: sha256:c5b8c2ffe30da3251b2f0b8f19f6e09d6a1fdfebd2f40d0275bc1e04e42fb668
Deleted: sha256:cbce6f42094dd2663dc8c940ab258590edb616a653a0e928959652657c26f687
Deleted: sha256:d090ccb45bd27aa76d5c25dc684e41c961c685e0098be118fada4e558b3c93f0
Build step 'Execute shell' marked build as failure

Mime
View raw message