mesos-builds mailing list archives

Site index · List index
Message view « Date » · « Thread »
Top « Date » · « Thread »
From Apache Jenkins Server <jenk...@builds.apache.org>
Subject Build failed in Jenkins: mesos-reviewbot #14955
Date Tue, 23 Aug 2016 20:30:17 GMT
See <https://builds.apache.org/job/mesos-reviewbot/14955/>

------------------------------------------
[...truncated 9583 lines...]
Downloading: http://repo.maven.apache.org/maven2/commons-validator/commons-validator/1.2.0/commons-validator-1.2.0.pom
Downloaded: http://repo.maven.apache.org/maven2/commons-validator/commons-validator/1.2.0/commons-validator-1.2.0.pom (9 KB at 164.3 KB/sec)
Downloading: http://repo.maven.apache.org/maven2/xml-apis/xml-apis/2.0.2/xml-apis-2.0.2.pom
Downloaded: http://repo.maven.apache.org/maven2/xml-apis/xml-apis/2.0.2/xml-apis-2.0.2.pom (346 B at 6.4 KB/sec)
Downloading: http://repo.maven.apache.org/maven2/org/codehaus/plexus/plexus-archiver/2.3/plexus-archiver-2.3.pom
Downloaded: http://repo.maven.apache.org/maven2/org/codehaus/plexus/plexus-archiver/2.3/plexus-archiver-2.3.pom (4 KB at 62.1 KB/sec)
Downloading: http://repo.maven.apache.org/maven2/org/codehaus/plexus/plexus-components/1.3/plexus-components-1.3.pom
Downloaded: http://repo.maven.apache.org/maven2/org/codehaus/plexus/plexus-components/1.3/plexus-components-1.3.pom (3 KB at 55.3 KB/sec)
Downloading: http://repo.maven.apache.org/maven2/org/codehaus/plexus/plexus/3.3/plexus-3.3.pom
Downloaded: http://repo.maven.apache.org/maven2/org/codehaus/plexus/plexus/3.3/plexus-3.3.pom (20 KB at 366.7 KB/sec)
Downloading: http://repo.maven.apache.org/maven2/org/codehaus/plexus/plexus-utils/3.0.10/plexus-utils-3.0.10.pom
Downloaded: http://repo.maven.apache.org/maven2/org/codehaus/plexus/plexus-utils/3.0.10/plexus-utils-3.0.10.pom (4 KB at 57.9 KB/sec)
Downloading: http://repo.maven.apache.org/maven2/org/codehaus/plexus/plexus-io/2.0.6/plexus-io-2.0.6.pom
Downloaded: http://repo.maven.apache.org/maven2/org/codehaus/plexus/plexus-io/2.0.6/plexus-io-2.0.6.pom (3 KB at 40.7 KB/sec)
Downloading: http://repo.maven.apache.org/maven2/org/codehaus/plexus/plexus-components/1.2/plexus-components-1.2.pom
Downloaded: http://repo.maven.apache.org/maven2/org/codehaus/plexus/plexus-components/1.2/plexus-components-1.2.pom (3 KB at 57.4 KB/sec)
Downloading: http://repo.maven.apache.org/maven2/org/codehaus/plexus/plexus/3.2/plexus-3.2.pom
Downloaded: http://repo.maven.apache.org/maven2/org/codehaus/plexus/plexus/3.2/plexus-3.2.pom (19 KB at 345.4 KB/sec)
Downloading: http://repo.maven.apache.org/maven2/org/codehaus/plexus/plexus-utils/3.0.8/plexus-utils-3.0.8.pom
Downloaded: http://repo.maven.apache.org/maven2/org/codehaus/plexus/plexus-utils/3.0.8/plexus-utils-3.0.8.pom (4 KB at 59.0 KB/sec)
Downloading: http://repo.maven.apache.org/maven2/org/codehaus/plexus/plexus-utils/3.0.9/plexus-utils-3.0.9.pom
Downloaded: http://repo.maven.apache.org/maven2/org/codehaus/plexus/plexus-utils/3.0.9/plexus-utils-3.0.9.pom (4 KB at 59.0 KB/sec)
Downloading: http://repo.maven.apache.org/maven2/org/apache/maven/shared/file-management/1.2.1/file-management-1.2.1.pom
Downloaded: http://repo.maven.apache.org/maven2/org/apache/maven/shared/file-management/1.2.1/file-management-1.2.1.pom (4 KB at 72.9 KB/sec)
Downloading: http://repo.maven.apache.org/maven2/org/apache/maven/shared/maven-shared-components/10/maven-shared-components-10.pom
Downloaded: http://repo.maven.apache.org/maven2/org/apache/maven/shared/maven-shared-components/10/maven-shared-components-10.pom (9 KB at 155.4 KB/sec)
Downloading: http://repo.maven.apache.org/maven2/org/apache/maven/maven-parent/9/maven-parent-9.pom
Downloaded: http://repo.maven.apache.org/maven2/org/apache/maven/maven-parent/9/maven-parent-9.pom (33 KB at 605.0 KB/sec)
Downloading: http://repo.maven.apache.org/maven2/org/apache/maven/shared/maven-shared-io/1.1/maven-shared-io-1.1.pom
Downloaded: http://repo.maven.apache.org/maven2/org/apache/maven/shared/maven-shared-io/1.1/maven-shared-io-1.1.pom (4 KB at 74.8 KB/sec)
Downloading: http://repo.maven.apache.org/maven2/org/apache/maven/maven-artifact/2.0.2/maven-artifact-2.0.2.pom
Downloaded: http://repo.maven.apache.org/maven2/org/apache/maven/maven-artifact/2.0.2/maven-artifact-2.0.2.pom (765 B at 14.4 KB/sec)
Downloading: http://repo.maven.apache.org/maven2/org/apache/maven/maven/2.0.2/maven-2.0.2.pom
Downloaded: http://repo.maven.apache.org/maven2/org/apache/maven/maven/2.0.2/maven-2.0.2.pom (13 KB at 242.7 KB/sec)
Downloading: http://repo.maven.apache.org/maven2/org/codehaus/plexus/plexus-utils/1.1/plexus-utils-1.1.pom
Downloaded: http://repo.maven.apache.org/maven2/org/codehaus/plexus/plexus-utils/1.1/plexus-utils-1.1.pom (767 B at 14.1 KB/sec)
Downloading: http://repo.maven.apache.org/maven2/org/apache/maven/maven-artifact-manager/2.0.2/maven-artifact-manager-2.0.2.pom
Downloaded: http://repo.maven.apache.org/maven2/org/apache/maven/maven-artifact-manager/2.0.2/maven-artifact-manager-2.0.2.pom (2 KB at 26.2 KB/sec)
Downloading: http://repo.maven.apache.org/maven2/org/apache/maven/maven-repository-metadata/2.0.2/maven-repository-metadata-2.0.2.pom
Downloaded: http://repo.maven.apache.org/maven2/org/apache/maven/maven-repository-metadata/2.0.2/maven-repository-metadata-2.0.2.pom (2 KB at 24.1 KB/sec)
Downloading: http://repo.maven.apache.org/maven2/org/apache/maven/wagon/wagon-provider-api/1.0-alpha-6/wagon-provider-api-1.0-alpha-6.pom
Downloaded: http://repo.maven.apache.org/maven2/org/apache/maven/wagon/wagon-provider-api/1.0-alpha-6/wagon-provider-api-1.0-alpha-6.pom (588 B at 10.8 KB/sec)
Downloading: http://repo.maven.apache.org/maven2/org/apache/maven/wagon/wagon/1.0-alpha-6/wagon-1.0-alpha-6.pom
Downloaded: http://repo.maven.apache.org/maven2/org/apache/maven/wagon/wagon/1.0-alpha-6/wagon-1.0-alpha-6.pom (7 KB at 120.3 KB/sec)
Downloading: http://repo.maven.apache.org/maven2/org/apache/maven/shared/maven-dependency-analyzer/1.4/maven-dependency-analyzer-1.4.pom
Downloaded: http://repo.maven.apache.org/maven2/org/apache/maven/shared/maven-dependency-analyzer/1.4/maven-dependency-analyzer-1.4.pom (6 KB at 95.0 KB/sec)
Downloading: http://repo.maven.apache.org/maven2/org/apache/maven/maven-project/2.0.5/maven-project-2.0.5.pom
Downloaded: http://repo.maven.apache.org/maven2/org/apache/maven/maven-project/2.0.5/maven-project-2.0.5.pom (2 KB at 33.9 KB/sec)
Downloading: http://repo.maven.apache.org/maven2/org/apache/maven/maven/2.0.5/maven-2.0.5.pom
Downloaded: http://repo.maven.apache.org/maven2/org/apache/maven/maven/2.0.5/maven-2.0.5.pom (6 KB at 105.1 KB/sec)
Downloading: http://repo.maven.apache.org/maven2/org/apache/maven/maven-settings/2.0.5/maven-settings-2.0.5.pom
Downloaded: http://repo.maven.apache.org/maven2/org/apache/maven/maven-settings/2.0.5/maven-settings-2.0.5.pom (2 KB at 30.9 KB/sec)
Downloading: http://repo.maven.apache.org/maven2/org/apache/maven/maven-model/2.0.5/maven-model-2.0.5.pom
Downloaded: http://repo.maven.apache.org/maven2/org/apache/maven/maven-model/2.0.5/maven-model-2.0.5.pom (3 KB at 50.2 KB/sec)
Downloading: http://repo.maven.apache.org/maven2/org/apache/maven/maven-profile/2.0.5/maven-profile-2.0.5.pom
Downloaded: http://repo.maven.apache.org/maven2/org/apache/maven/maven-profile/2.0.5/maven-profile-2.0.5.pom (2 KB at 30.5 KB/sec)
Downloading: http://repo.maven.apache.org/maven2/org/apache/maven/maven-artifact-manager/2.0.5/maven-artifact-manager-2.0.5.pom
Downloaded: http://repo.maven.apache.org/maven2/org/apache/maven/maven-artifact-manager/2.0.5/maven-artifact-manager-2.0.5.pom (2 KB at 34.4 KB/sec)
Downloading: http://repo.maven.apache.org/maven2/org/apache/maven/maven-repository-metadata/2.0.5/maven-repository-metadata-2.0.5.pom
Downloaded: http://repo.maven.apache.org/maven2/org/apache/maven/maven-repository-metadata/2.0.5/maven-repository-metadata-2.0.5.pom (2 KB at 26.9 KB/sec)
Downloading: http://repo.maven.apache.org/maven2/org/apache/maven/maven-artifact/2.0.5/maven-artifact-2.0.5.pom
Downloaded: http://repo.maven.apache.org/maven2/org/apache/maven/maven-artifact/2.0.5/maven-artifact-2.0.5.pom (727 B at 13.7 KB/sec)
Downloading: http://repo.maven.apache.org/maven2/org/apache/maven/shared/maven-common-artifact-filters/1.4/maven-common-artifact-filters-1.4.pom
Downloaded: http://repo.maven.apache.org/maven2/org/apache/maven/shared/maven-common-artifact-filters/1.4/maven-common-artifact-filters-1.4.pom (4 KB at 69.3 KB/sec)
Downloading: http://repo.maven.apache.org/maven2/org/codehaus/plexus/plexus-container-default/1.5.5/plexus-container-default-1.5.5.pom
Downloaded: http://repo.maven.apache.org/maven2/org/codehaus/plexus/plexus-container-default/1.5.5/plexus-container-default-1.5.5.pom (3 KB at 50.8 KB/sec)
Downloading: http://repo.maven.apache.org/maven2/org/codehaus/plexus/plexus-classworlds/2.2.2/plexus-classworlds-2.2.2.pom
Downloaded: http://repo.maven.apache.org/maven2/org/codehaus/plexus/plexus-classworlds/2.2.2/plexus-classworlds-2.2.2.pom (4 KB at 74.3 KB/sec)
Downloading: http://repo.maven.apache.org/maven2/org/apache/xbean/xbean-reflect/3.4/xbean-reflect-3.4.pom
Downloaded: http://repo.maven.apache.org/maven2/org/apache/xbean/xbean-reflect/3.4/xbean-reflect-3.4.pom (3 KB at 51.8 KB/sec)
Downloading: http://repo.maven.apache.org/maven2/org/apache/xbean/xbean/3.4/xbean-3.4.pom
Downloaded: http://repo.maven.apache.org/maven2/org/apache/xbean/xbean/3.4/xbean-3.4.pom (19 KB at 335.1 KB/sec)
Downloading: http://repo.maven.apache.org/maven2/commons-logging/commons-logging-api/1.1/commons-logging-api-1.1.pom
Downloaded: http://repo.maven.apache.org/maven2/commons-logging/commons-logging-api/1.1/commons-logging-api-1.1.pom (6 KB at 98.5 KB/sec)
Downloading: http://repo.maven.apache.org/maven2/com/google/collections/google-collections/1.0/google-collections-1.0.pom
Downloaded: http://repo.maven.apache.org/maven2/com/google/collections/google-collections/1.0/google-collections-1.0.pom (3 KB at 44.8 KB/sec)
Downloading: http://repo.maven.apache.org/maven2/junit/junit/3.8.2/junit-3.8.2.pom
Downloaded: http://repo.maven.apache.org/maven2/junit/junit/3.8.2/junit-3.8.2.pom (747 B at 13.8 KB/sec)
Downloading: http://repo.maven.apache.org/maven2/org/codehaus/plexus/plexus-utils/2.1/plexus-utils-2.1.pom
Downloaded: http://repo.maven.apache.org/maven2/org/codehaus/plexus/plexus-utils/2.1/plexus-utils-2.1.pom (4 KB at 75.8 KB/sec)
Downloading: http://repo.maven.apache.org/maven2/org/apache/maven/shared/maven-invoker/2.0.11/maven-invoker-2.0.11.pom
Downloaded: http://repo.maven.apache.org/maven2/org/apache/maven/shared/maven-invoker/2.0.11/maven-invoker-2.0.11.pom (5 KB at 95.3 KB/sec)
Downloading: http://repo.maven.apache.org/maven2/commons-lang/commons-lang/2.6/commons-lang-2.6.pom
Downloaded: http://repo.maven.apache.org/maven2/commons-lang/commons-lang/2.6/commons-lang-2.6.pom (18 KB at 316.4 KB/sec)
Downloading: http://repo.maven.apache.org/maven2/org/apache/commons/commons-parent/17/commons-parent-17.pom
Downloaded: http://repo.maven.apache.org/maven2/org/apache/commons/commons-parent/17/commons-parent-17.pom (31 KB at 564.0 KB/sec)
Downloading: http://repo.maven.apache.org/maven2/org/apache/maven/reporting/maven-reporting-impl/2.0.5/maven-reporting-impl-2.0.5.jar
Downloading: http://repo.maven.apache.org/maven2/org/apache/maven/shared/maven-doxia-tools/1.0.2/maven-doxia-tools-1.0.2.jar
Downloading: http://repo.maven.apache.org/maven2/commons-validator/commons-validator/1.2.0/commons-validator-1.2.0.jar
Downloading: http://repo.maven.apache.org/maven2/commons-digester/commons-digester/1.6/commons-digester-1.6.jar
Downloading: http://repo.maven.apache.org/maven2/commons-logging/commons-logging/1.0.4/commons-logging-1.0.4.jar
Downloaded: http://repo.maven.apache.org/maven2/org/apache/maven/reporting/maven-reporting-impl/2.0.5/maven-reporting-impl-2.0.5.jar (21 KB at 372.8 KB/sec)
Downloading: http://repo.maven.apache.org/maven2/xml-apis/xml-apis/1.0.b2/xml-apis-1.0.b2.jar
Downloaded: http://repo.maven.apache.org/maven2/org/apache/maven/shared/maven-doxia-tools/1.0.2/maven-doxia-tools-1.0.2.jar (41 KB at 743.0 KB/sec)
Downloading: http://repo.maven.apache.org/maven2/org/codehaus/plexus/plexus-archiver/2.3/plexus-archiver-2.3.jar
Downloaded: http://repo.maven.apache.org/maven2/commons-validator/commons-validator/1.2.0/commons-validator-1.2.0.jar (89 KB at 1588.9 KB/sec)
Downloading: http://repo.maven.apache.org/maven2/org/codehaus/plexus/plexus-utils/3.0.9/plexus-utils-3.0.9.jar
Downloaded: http://repo.maven.apache.org/maven2/commons-logging/commons-logging/1.0.4/commons-logging-1.0.4.jar (38 KB at 662.9 KB/sec)
Downloading: http://repo.maven.apache.org/maven2/org/apache/maven/shared/file-management/1.2.1/file-management-1.2.1.jar
Downloaded: http://repo.maven.apache.org/maven2/commons-digester/commons-digester/1.6/commons-digester-1.6.jar (165 KB at 2885.9 KB/sec)
Downloading: http://repo.maven.apache.org/maven2/org/apache/maven/shared/maven-shared-io/1.1/maven-shared-io-1.1.jar
Downloaded: http://repo.maven.apache.org/maven2/xml-apis/xml-apis/1.0.b2/xml-apis-1.0.b2.jar (107 KB at 2014.3 KB/sec)
Downloading: http://repo.maven.apache.org/maven2/org/codehaus/plexus/plexus-io/2.0.6/plexus-io-2.0.6.jar
Downloaded: http://repo.maven.apache.org/maven2/org/codehaus/plexus/plexus-archiver/2.3/plexus-archiver-2.3.jar (183 KB at 3310.9 KB/sec)
Downloading: http://repo.maven.apache.org/maven2/org/apache/maven/shared/maven-dependency-analyzer/1.4/maven-dependency-analyzer-1.4.jar
Downloaded: http://repo.maven.apache.org/maven2/org/apache/maven/shared/file-management/1.2.1/file-management-1.2.1.jar (37 KB at 692.4 KB/sec)
Downloading: http://repo.maven.apache.org/maven2/org/apache/maven/shared/maven-common-artifact-filters/1.4/maven-common-artifact-filters-1.4.jar
Downloaded: http://repo.maven.apache.org/maven2/org/apache/maven/shared/maven-shared-io/1.1/maven-shared-io-1.1.jar (39 KB at 741.4 KB/sec)
Downloading: http://repo.maven.apache.org/maven2/org/apache/maven/shared/maven-invoker/2.0.11/maven-invoker-2.0.11.jar
Downloaded: http://repo.maven.apache.org/maven2/org/codehaus/plexus/plexus-utils/3.0.9/plexus-utils-3.0.9.jar (227 KB at 3973.7 KB/sec)
Downloading: http://repo.maven.apache.org/maven2/commons-lang/commons-lang/2.6/commons-lang-2.6.jar
Downloaded: http://repo.maven.apache.org/maven2/org/codehaus/plexus/plexus-io/2.0.6/plexus-io-2.0.6.jar (57 KB at 1042.9 KB/sec)
Downloaded: http://repo.maven.apache.org/maven2/org/apache/maven/shared/maven-dependency-analyzer/1.4/maven-dependency-analyzer-1.4.jar (27 KB at 515.2 KB/sec)
Downloaded: http://repo.maven.apache.org/maven2/org/apache/maven/shared/maven-invoker/2.0.11/maven-invoker-2.0.11.jar (29 KB at 542.9 KB/sec)
Downloaded: http://repo.maven.apache.org/maven2/org/apache/maven/shared/maven-common-artifact-filters/1.4/maven-common-artifact-filters-1.4.jar (31 KB at 582.2 KB/sec)
Downloaded: http://repo.maven.apache.org/maven2/commons-lang/commons-lang/2.6/commons-lang-2.6.jar (278 KB at 4626.0 KB/sec)
[INFO] Copying protobuf-java-2.6.1.jar to /mesos/mesos-1.1.0/_build/src/java/target/protobuf-java-2.6.1.jar
[INFO] ------------------------------------------------------------------------
[INFO] BUILD SUCCESS
[INFO] ------------------------------------------------------------------------
[INFO] Total time: 4:40.267s
[INFO] Finished at: Tue Aug 23 20:30:01 UTC 2016
[INFO] Final Memory: 34M/1179M
[INFO] ------------------------------------------------------------------------
/usr/lib/jvm/java-7-openjdk-amd64/bin/javah -d java/jni				\
	-classpath java/target/mesos-1.1.0.jar:/mesos/mesos-1.1.0/_build/src/java/target/protobuf-java-2.6.1.jar				\
	  org.apache.mesos.Log
/usr/lib/jvm/java-7-openjdk-amd64/bin/javah -d java/jni				\
	-classpath java/target/mesos-1.1.0.jar:/mesos/mesos-1.1.0/_build/src/java/target/protobuf-java-2.6.1.jar				\
          org.apache.mesos.MesosExecutorDriver
/usr/lib/jvm/java-7-openjdk-amd64/bin/javah -d java/jni				\
	-classpath java/target/mesos-1.1.0.jar:/mesos/mesos-1.1.0/_build/src/java/target/protobuf-java-2.6.1.jar				\
	  org.apache.mesos.MesosSchedulerDriver
/usr/lib/jvm/java-7-openjdk-amd64/bin/javah -d java/jni				\
	-classpath java/target/mesos-1.1.0.jar:/mesos/mesos-1.1.0/_build/src/java/target/protobuf-java-2.6.1.jar				\
	  org.apache.mesos.state.AbstractState
/usr/lib/jvm/java-7-openjdk-amd64/bin/javah -d java/jni				\
	-classpath java/target/mesos-1.1.0.jar:/mesos/mesos-1.1.0/_build/src/java/target/protobuf-java-2.6.1.jar				\
	  org.apache.mesos.state.LevelDBState
/usr/lib/jvm/java-7-openjdk-amd64/bin/javah -d java/jni				\
	-classpath java/target/mesos-1.1.0.jar:/mesos/mesos-1.1.0/_build/src/java/target/protobuf-java-2.6.1.jar				\
	  org.apache.mesos.state.LogState
/usr/lib/jvm/java-7-openjdk-amd64/bin/javah -d java/jni				\
	-classpath java/target/mesos-1.1.0.jar:/mesos/mesos-1.1.0/_build/src/java/target/protobuf-java-2.6.1.jar				\
	  org.apache.mesos.state.Variable
/usr/lib/jvm/java-7-openjdk-amd64/bin/javah -d java/jni				\
	-classpath java/target/mesos-1.1.0.jar:/mesos/mesos-1.1.0/_build/src/java/target/protobuf-java-2.6.1.jar				\
	  org.apache.mesos.state.ZooKeeperState
/usr/lib/jvm/java-7-openjdk-amd64/bin/javah -d java/jni				\
	-classpath java/target/mesos-1.1.0.jar:/mesos/mesos-1.1.0/_build/src/java/target/protobuf-java-2.6.1.jar				\
	  org.apache.mesos.v1.scheduler.V1Mesos
/usr/lib/jvm/java-7-openjdk-amd64/bin/javah -d java/jni				\
	-classpath java/target/mesos-1.1.0.jar:/mesos/mesos-1.1.0/_build/src/java/target/protobuf-java-2.6.1.jar				\
	  org.apache.mesos.v1.scheduler.V0Mesos
make  all-am
make[3]: Entering directory `/mesos/mesos-1.1.0/_build/src'
/bin/bash ../libtool  --tag=CXX   --mode=compile g++ -DPACKAGE_NAME=\"mesos\" -DPACKAGE_TARNAME=\"mesos\" -DPACKAGE_VERSION=\"1.1.0\" -DPACKAGE_STRING=\"mesos\ 1.1.0\" -DPACKAGE_BUGREPORT=\"\" -DPACKAGE_URL=\"\" -DPACKAGE=\"mesos\" -DVERSION=\"1.1.0\" -DSTDC_HEADERS=1 -DHAVE_SYS_TYPES_H=1 -DHAVE_SYS_STAT_H=1 -DHAVE_STDLIB_H=1 -DHAVE_STRING_H=1 -DHAVE_MEMORY_H=1 -DHAVE_STRINGS_H=1 -DHAVE_INTTYPES_H=1 -DHAVE_STDINT_H=1 -DHAVE_UNISTD_H=1 -DHAVE_DLFCN_H=1 -DLT_OBJDIR=\".libs/\" -DHAVE_CXX11=1 -DHAVE_PTHREAD_PRIO_INHERIT=1 -DHAVE_PTHREAD=1 -DHAVE_LIBZ=1 -DHAVE_FTS_H=1 -DHAVE_APR_POOLS_H=1 -DHAVE_LIBAPR_1=1 -DHAVE_LIBCURL=1 -DMESOS_HAS_JAVA=1 -DHAVE_PYTHON=\"2.7\" -DMESOS_HAS_PYTHON=1 -DHAVE_LIBSASL2=1 -DHAVE_SVN_VERSION_H=1 -DHAVE_LIBSVN_SUBR_1=1 -DHAVE_SVN_DELTA_H=1 -DHAVE_LIBSVN_DELTA_1=1 -DHAVE_LIBZ=1 -I. -I../../src   -Wall -Werror -Wsign-compare -DLIBDIR=\"/mesos/mesos-1.1.0/_inst/lib\" -DPKGLIBEXECDIR=\"/mesos/mesos-1.1.0/_inst/libexec/mesos\" -DPKGDATADIR=\"/mesos/mesos-1.1.0/_inst/share/mesos\" -DPKGMODULEDIR=\"/mesos/mesos-1.1.0/_inst/lib/mesos/modules\" -I../../include -I../include -I../include/mesos -DPICOJSON_USE_INT64 -D__STDC_FORMAT_MACROS -isystem ../3rdparty/boost-1.53.0 -I../3rdparty/elfio-3.2 -I../3rdparty/glog-0.3.3/src -I../3rdparty/leveldb-1.4/include -I../../3rdparty/libprocess/include -I../3rdparty/nvml-352.79 -I../3rdparty/picojson-1.3.0 -I../3rdparty/protobuf-2.6.1/src -I../../3rdparty/stout/include -I../3rdparty/zookeeper-3.4.8/src/c/include -I../3rdparty/zookeeper-3.4.8/src/c/generated -DHAS_AUTHENTICATION=1 -I/usr/include/subversion-1 -I/usr/include/apr-1 -I/usr/include/apr-1.0  -pthread -g1 -O0 -Wno-unused-local-typedefs -std=c++11 -MT slave/containerizer/mesos/libmesos_no_3rdparty_la-linux_launcher.lo -MD -MP -MF slave/containerizer/mesos/.deps/libmesos_no_3rdparty_la-linux_launcher.Tpo -c -o slave/containerizer/mesos/libmesos_no_3rdparty_la-linux_launcher.lo `test -f 'slave/containerizer/mesos/linux_launcher.cpp' || echo '../../src/'`slave/containerizer/mesos/linux_launcher.cpp
/bin/bash ../libtool  --tag=CXX   --mode=compile g++ -DPACKAGE_NAME=\"mesos\" -DPACKAGE_TARNAME=\"mesos\" -DPACKAGE_VERSION=\"1.1.0\" -DPACKAGE_STRING=\"mesos\ 1.1.0\" -DPACKAGE_BUGREPORT=\"\" -DPACKAGE_URL=\"\" -DPACKAGE=\"mesos\" -DVERSION=\"1.1.0\" -DSTDC_HEADERS=1 -DHAVE_SYS_TYPES_H=1 -DHAVE_SYS_STAT_H=1 -DHAVE_STDLIB_H=1 -DHAVE_STRING_H=1 -DHAVE_MEMORY_H=1 -DHAVE_STRINGS_H=1 -DHAVE_INTTYPES_H=1 -DHAVE_STDINT_H=1 -DHAVE_UNISTD_H=1 -DHAVE_DLFCN_H=1 -DLT_OBJDIR=\".libs/\" -DHAVE_CXX11=1 -DHAVE_PTHREAD_PRIO_INHERIT=1 -DHAVE_PTHREAD=1 -DHAVE_LIBZ=1 -DHAVE_FTS_H=1 -DHAVE_APR_POOLS_H=1 -DHAVE_LIBAPR_1=1 -DHAVE_LIBCURL=1 -DMESOS_HAS_JAVA=1 -DHAVE_PYTHON=\"2.7\" -DMESOS_HAS_PYTHON=1 -DHAVE_LIBSASL2=1 -DHAVE_SVN_VERSION_H=1 -DHAVE_LIBSVN_SUBR_1=1 -DHAVE_SVN_DELTA_H=1 -DHAVE_LIBSVN_DELTA_1=1 -DHAVE_LIBZ=1 -I. -I../../src   -Wall -Werror -Wsign-compare -DLIBDIR=\"/mesos/mesos-1.1.0/_inst/lib\" -DPKGLIBEXECDIR=\"/mesos/mesos-1.1.0/_inst/libexec/mesos\" -DPKGDATADIR=\"/mesos/mesos-1.1.0/_inst/share/mesos\" -DPKGMODULEDIR=\"/mesos/mesos-1.1.0/_inst/lib/mesos/modules\" -I../../include -I../include -I../include/mesos -DPICOJSON_USE_INT64 -D__STDC_FORMAT_MACROS -isystem ../3rdparty/boost-1.53.0 -I../3rdparty/elfio-3.2 -I../3rdparty/glog-0.3.3/src -I../3rdparty/leveldb-1.4/include -I../../3rdparty/libprocess/include -I../3rdparty/nvml-352.79 -I../3rdparty/picojson-1.3.0 -I../3rdparty/protobuf-2.6.1/src -I../../3rdparty/stout/include -I../3rdparty/zookeeper-3.4.8/src/c/include -I../3rdparty/zookeeper-3.4.8/src/c/generated -DHAS_AUTHENTICATION=1 -I/usr/include/subversion-1 -I/usr/include/apr-1 -I/usr/include/apr-1.0  -pthread -g1 -O0 -Wno-unused-local-typedefs -std=c++11 -MT slave/containerizer/mesos/isolators/docker/volume/libmesos_no_3rdparty_la-isolator.lo -MD -MP -MF slave/containerizer/mesos/isolators/docker/volume/.deps/libmesos_no_3rdparty_la-isolator.Tpo -c -o slave/containerizer/mesos/isolators/docker/volume/libmesos_no_3rdparty_la-isolator.lo `test -f 'slave/containerizer/mesos/isolators/docker/volume/isolator.cpp' || echo '../../src/'`slave/containerizer/mesos/isolators/docker/volume/isolator.cpp
/bin/bash ../libtool  --tag=CXX   --mode=compile g++ -DPACKAGE_NAME=\"mesos\" -DPACKAGE_TARNAME=\"mesos\" -DPACKAGE_VERSION=\"1.1.0\" -DPACKAGE_STRING=\"mesos\ 1.1.0\" -DPACKAGE_BUGREPORT=\"\" -DPACKAGE_URL=\"\" -DPACKAGE=\"mesos\" -DVERSION=\"1.1.0\" -DSTDC_HEADERS=1 -DHAVE_SYS_TYPES_H=1 -DHAVE_SYS_STAT_H=1 -DHAVE_STDLIB_H=1 -DHAVE_STRING_H=1 -DHAVE_MEMORY_H=1 -DHAVE_STRINGS_H=1 -DHAVE_INTTYPES_H=1 -DHAVE_STDINT_H=1 -DHAVE_UNISTD_H=1 -DHAVE_DLFCN_H=1 -DLT_OBJDIR=\".libs/\" -DHAVE_CXX11=1 -DHAVE_PTHREAD_PRIO_INHERIT=1 -DHAVE_PTHREAD=1 -DHAVE_LIBZ=1 -DHAVE_FTS_H=1 -DHAVE_APR_POOLS_H=1 -DHAVE_LIBAPR_1=1 -DHAVE_LIBCURL=1 -DMESOS_HAS_JAVA=1 -DHAVE_PYTHON=\"2.7\" -DMESOS_HAS_PYTHON=1 -DHAVE_LIBSASL2=1 -DHAVE_SVN_VERSION_H=1 -DHAVE_LIBSVN_SUBR_1=1 -DHAVE_SVN_DELTA_H=1 -DHAVE_LIBSVN_DELTA_1=1 -DHAVE_LIBZ=1 -I. -I../../src   -Wall -Werror -Wsign-compare -DLIBDIR=\"/mesos/mesos-1.1.0/_inst/lib\" -DPKGLIBEXECDIR=\"/mesos/mesos-1.1.0/_inst/libexec/mesos\" -DPKGDATADIR=\"/mesos/mesos-1.1.0/_inst/share/mesos\" -DPKGMODULEDIR=\"/mesos/mesos-1.1.0/_inst/lib/mesos/modules\" -I../../include -I../include -I../include/mesos -DPICOJSON_USE_INT64 -D__STDC_FORMAT_MACROS -isystem ../3rdparty/boost-1.53.0 -I../3rdparty/elfio-3.2 -I../3rdparty/glog-0.3.3/src -I../3rdparty/leveldb-1.4/include -I../../3rdparty/libprocess/include -I../3rdparty/nvml-352.79 -I../3rdparty/picojson-1.3.0 -I../3rdparty/protobuf-2.6.1/src -I../../3rdparty/stout/include -I../3rdparty/zookeeper-3.4.8/src/c/include -I../3rdparty/zookeeper-3.4.8/src/c/generated -DHAS_AUTHENTICATION=1 -I/usr/include/subversion-1 -I/usr/include/apr-1 -I/usr/include/apr-1.0  -pthread -g1 -O0 -Wno-unused-local-typedefs -std=c++11 -MT slave/containerizer/mesos/isolators/filesystem/libmesos_no_3rdparty_la-linux.lo -MD -MP -MF slave/containerizer/mesos/isolators/filesystem/.deps/libmesos_no_3rdparty_la-linux.Tpo -c -o slave/containerizer/mesos/isolators/filesystem/libmesos_no_3rdparty_la-linux.lo `test -f 'slave/containerizer/mesos/isolators/filesystem/linux.cpp' || echo '../../src/'`slave/containerizer/mesos/isolators/filesystem/linux.cpp
/bin/bash ../libtool  --tag=CXX   --mode=compile g++ -DPACKAGE_NAME=\"mesos\" -DPACKAGE_TARNAME=\"mesos\" -DPACKAGE_VERSION=\"1.1.0\" -DPACKAGE_STRING=\"mesos\ 1.1.0\" -DPACKAGE_BUGREPORT=\"\" -DPACKAGE_URL=\"\" -DPACKAGE=\"mesos\" -DVERSION=\"1.1.0\" -DSTDC_HEADERS=1 -DHAVE_SYS_TYPES_H=1 -DHAVE_SYS_STAT_H=1 -DHAVE_STDLIB_H=1 -DHAVE_STRING_H=1 -DHAVE_MEMORY_H=1 -DHAVE_STRINGS_H=1 -DHAVE_INTTYPES_H=1 -DHAVE_STDINT_H=1 -DHAVE_UNISTD_H=1 -DHAVE_DLFCN_H=1 -DLT_OBJDIR=\".libs/\" -DHAVE_CXX11=1 -DHAVE_PTHREAD_PRIO_INHERIT=1 -DHAVE_PTHREAD=1 -DHAVE_LIBZ=1 -DHAVE_FTS_H=1 -DHAVE_APR_POOLS_H=1 -DHAVE_LIBAPR_1=1 -DHAVE_LIBCURL=1 -DMESOS_HAS_JAVA=1 -DHAVE_PYTHON=\"2.7\" -DMESOS_HAS_PYTHON=1 -DHAVE_LIBSASL2=1 -DHAVE_SVN_VERSION_H=1 -DHAVE_LIBSVN_SUBR_1=1 -DHAVE_SVN_DELTA_H=1 -DHAVE_LIBSVN_DELTA_1=1 -DHAVE_LIBZ=1 -I. -I../../src   -Wall -Werror -Wsign-compare -DLIBDIR=\"/mesos/mesos-1.1.0/_inst/lib\" -DPKGLIBEXECDIR=\"/mesos/mesos-1.1.0/_inst/libexec/mesos\" -DPKGDATADIR=\"/mesos/mesos-1.1.0/_inst/share/mesos\" -DPKGMODULEDIR=\"/mesos/mesos-1.1.0/_inst/lib/mesos/modules\" -I../../include -I../include -I../include/mesos -DPICOJSON_USE_INT64 -D__STDC_FORMAT_MACROS -isystem ../3rdparty/boost-1.53.0 -I../3rdparty/elfio-3.2 -I../3rdparty/glog-0.3.3/src -I../3rdparty/leveldb-1.4/include -I../../3rdparty/libprocess/include -I../3rdparty/nvml-352.79 -I../3rdparty/picojson-1.3.0 -I../3rdparty/protobuf-2.6.1/src -I../../3rdparty/stout/include -I../3rdparty/zookeeper-3.4.8/src/c/include -I../3rdparty/zookeeper-3.4.8/src/c/generated -DHAS_AUTHENTICATION=1 -I/usr/include/subversion-1 -I/usr/include/apr-1 -I/usr/include/apr-1.0  -pthread -g1 -O0 -Wno-unused-local-typedefs -std=c++11 -MT slave/containerizer/mesos/isolators/filesystem/libmesos_no_3rdparty_la-shared.lo -MD -MP -MF slave/containerizer/mesos/isolators/filesystem/.deps/libmesos_no_3rdparty_la-shared.Tpo -c -o slave/containerizer/mesos/isolators/filesystem/libmesos_no_3rdparty_la-shared.lo `test -f 'slave/containerizer/mesos/isolators/filesystem/shared.cpp' || echo '../../src/'`slave/containerizer/mesos/isolators/filesystem/shared.cpp
/bin/bash ../libtool  --tag=CXX   --mode=compile g++ -DPACKAGE_NAME=\"mesos\" -DPACKAGE_TARNAME=\"mesos\" -DPACKAGE_VERSION=\"1.1.0\" -DPACKAGE_STRING=\"mesos\ 1.1.0\" -DPACKAGE_BUGREPORT=\"\" -DPACKAGE_URL=\"\" -DPACKAGE=\"mesos\" -DVERSION=\"1.1.0\" -DSTDC_HEADERS=1 -DHAVE_SYS_TYPES_H=1 -DHAVE_SYS_STAT_H=1 -DHAVE_STDLIB_H=1 -DHAVE_STRING_H=1 -DHAVE_MEMORY_H=1 -DHAVE_STRINGS_H=1 -DHAVE_INTTYPES_H=1 -DHAVE_STDINT_H=1 -DHAVE_UNISTD_H=1 -DHAVE_DLFCN_H=1 -DLT_OBJDIR=\".libs/\" -DHAVE_CXX11=1 -DHAVE_PTHREAD_PRIO_INHERIT=1 -DHAVE_PTHREAD=1 -DHAVE_LIBZ=1 -DHAVE_FTS_H=1 -DHAVE_APR_POOLS_H=1 -DHAVE_LIBAPR_1=1 -DHAVE_LIBCURL=1 -DMESOS_HAS_JAVA=1 -DHAVE_PYTHON=\"2.7\" -DMESOS_HAS_PYTHON=1 -DHAVE_LIBSASL2=1 -DHAVE_SVN_VERSION_H=1 -DHAVE_LIBSVN_SUBR_1=1 -DHAVE_SVN_DELTA_H=1 -DHAVE_LIBSVN_DELTA_1=1 -DHAVE_LIBZ=1 -I. -I../../src   -Wall -Werror -Wsign-compare -DLIBDIR=\"/mesos/mesos-1.1.0/_inst/lib\" -DPKGLIBEXECDIR=\"/mesos/mesos-1.1.0/_inst/libexec/mesos\" -DPKGDATADIR=\"/mesos/mesos-1.1.0/_inst/share/mesos\" -DPKGMODULEDIR=\"/mesos/mesos-1.1.0/_inst/lib/mesos/modules\" -I../../include -I../include -I../include/mesos -DPICOJSON_USE_INT64 -D__STDC_FORMAT_MACROS -isystem ../3rdparty/boost-1.53.0 -I../3rdparty/elfio-3.2 -I../3rdparty/glog-0.3.3/src -I../3rdparty/leveldb-1.4/include -I../../3rdparty/libprocess/include -I../3rdparty/nvml-352.79 -I../3rdparty/picojson-1.3.0 -I../3rdparty/protobuf-2.6.1/src -I../../3rdparty/stout/include -I../3rdparty/zookeeper-3.4.8/src/c/include -I../3rdparty/zookeeper-3.4.8/src/c/generated -DHAS_AUTHENTICATION=1 -I/usr/include/subversion-1 -I/usr/include/apr-1 -I/usr/include/apr-1.0  -pthread -g1 -O0 -Wno-unused-local-typedefs -std=c++11 -MT slave/containerizer/mesos/isolators/network/cni/libmesos_no_3rdparty_la-cni.lo -MD -MP -MF slave/containerizer/mesos/isolators/network/cni/.deps/libmesos_no_3rdparty_la-cni.Tpo -c -o slave/containerizer/mesos/isolators/network/cni/libmesos_no_3rdparty_la-cni.lo `test -f 'slave/containerizer/mesos/isolators/network/cni/cni.cpp' || echo '../../src/'`slave/containerizer/mesos/isolators/network/cni/cni.cpp
/bin/bash ../libtool  --tag=CXX   --mode=compile g++ -DPACKAGE_NAME=\"mesos\" -DPACKAGE_TARNAME=\"mesos\" -DPACKAGE_VERSION=\"1.1.0\" -DPACKAGE_STRING=\"mesos\ 1.1.0\" -DPACKAGE_BUGREPORT=\"\" -DPACKAGE_URL=\"\" -DPACKAGE=\"mesos\" -DVERSION=\"1.1.0\" -DSTDC_HEADERS=1 -DHAVE_SYS_TYPES_H=1 -DHAVE_SYS_STAT_H=1 -DHAVE_STDLIB_H=1 -DHAVE_STRING_H=1 -DHAVE_MEMORY_H=1 -DHAVE_STRINGS_H=1 -DHAVE_INTTYPES_H=1 -DHAVE_STDINT_H=1 -DHAVE_UNISTD_H=1 -DHAVE_DLFCN_H=1 -DLT_OBJDIR=\".libs/\" -DHAVE_CXX11=1 -DHAVE_PTHREAD_PRIO_INHERIT=1 -DHAVE_PTHREAD=1 -DHAVE_LIBZ=1 -DHAVE_FTS_H=1 -DHAVE_APR_POOLS_H=1 -DHAVE_LIBAPR_1=1 -DHAVE_LIBCURL=1 -DMESOS_HAS_JAVA=1 -DHAVE_PYTHON=\"2.7\" -DMESOS_HAS_PYTHON=1 -DHAVE_LIBSASL2=1 -DHAVE_SVN_VERSION_H=1 -DHAVE_LIBSVN_SUBR_1=1 -DHAVE_SVN_DELTA_H=1 -DHAVE_LIBSVN_DELTA_1=1 -DHAVE_LIBZ=1 -I. -I../../src   -Wall -Werror -Wsign-compare -DLIBDIR=\"/mesos/mesos-1.1.0/_inst/lib\" -DPKGLIBEXECDIR=\"/mesos/mesos-1.1.0/_inst/libexec/mesos\" -DPKGDATADIR=\"/mesos/mesos-1.1.0/_inst/share/mesos\" -DPKGMODULEDIR=\"/mesos/mesos-1.1.0/_inst/lib/mesos/modules\" -I../../include -I../include -I../include/mesos -DPICOJSON_USE_INT64 -D__STDC_FORMAT_MACROS -isystem ../3rdparty/boost-1.53.0 -I../3rdparty/elfio-3.2 -I../3rdparty/glog-0.3.3/src -I../3rdparty/leveldb-1.4/include -I../../3rdparty/libprocess/include -I../3rdparty/nvml-352.79 -I../3rdparty/picojson-1.3.0 -I../3rdparty/protobuf-2.6.1/src -I../../3rdparty/stout/include -I../3rdparty/zookeeper-3.4.8/src/c/include -I../3rdparty/zookeeper-3.4.8/src/c/generated -DHAS_AUTHENTICATION=1 -I/usr/include/subversion-1 -I/usr/include/apr-1 -I/usr/include/apr-1.0  -pthread -g1 -O0 -Wno-unused-local-typedefs -std=c++11 -MT slave/containerizer/mesos/provisioner/backends/libmesos_no_3rdparty_la-aufs.lo -MD -MP -MF slave/containerizer/mesos/provisioner/backends/.deps/libmesos_no_3rdparty_la-aufs.Tpo -c -o slave/containerizer/mesos/provisioner/backends/libmesos_no_3rdparty_la-aufs.lo `test -f 'slave/containerizer/mesos/provisioner/backends/aufs.cpp' || echo '../../src/'`slave/containerizer/mesos/provisioner/backends/aufs.cpp
/bin/bash ../libtool  --tag=CXX   --mode=compile g++ -DPACKAGE_NAME=\"mesos\" -DPACKAGE_TARNAME=\"mesos\" -DPACKAGE_VERSION=\"1.1.0\" -DPACKAGE_STRING=\"mesos\ 1.1.0\" -DPACKAGE_BUGREPORT=\"\" -DPACKAGE_URL=\"\" -DPACKAGE=\"mesos\" -DVERSION=\"1.1.0\" -DSTDC_HEADERS=1 -DHAVE_SYS_TYPES_H=1 -DHAVE_SYS_STAT_H=1 -DHAVE_STDLIB_H=1 -DHAVE_STRING_H=1 -DHAVE_MEMORY_H=1 -DHAVE_STRINGS_H=1 -DHAVE_INTTYPES_H=1 -DHAVE_STDINT_H=1 -DHAVE_UNISTD_H=1 -DHAVE_DLFCN_H=1 -DLT_OBJDIR=\".libs/\" -DHAVE_CXX11=1 -DHAVE_PTHREAD_PRIO_INHERIT=1 -DHAVE_PTHREAD=1 -DHAVE_LIBZ=1 -DHAVE_FTS_H=1 -DHAVE_APR_POOLS_H=1 -DHAVE_LIBAPR_1=1 -DHAVE_LIBCURL=1 -DMESOS_HAS_JAVA=1 -DHAVE_PYTHON=\"2.7\" -DMESOS_HAS_PYTHON=1 -DHAVE_LIBSASL2=1 -DHAVE_SVN_VERSION_H=1 -DHAVE_LIBSVN_SUBR_1=1 -DHAVE_SVN_DELTA_H=1 -DHAVE_LIBSVN_DELTA_1=1 -DHAVE_LIBZ=1 -I. -I../../src   -Wall -Werror -Wsign-compare -DLIBDIR=\"/mesos/mesos-1.1.0/_inst/lib\" -DPKGLIBEXECDIR=\"/mesos/mesos-1.1.0/_inst/libexec/mesos\" -DPKGDATADIR=\"/mesos/mesos-1.1.0/_inst/share/mesos\" -DPKGMODULEDIR=\"/mesos/mesos-1.1.0/_inst/lib/mesos/modules\" -I../../include -I../include -I../include/mesos -DPICOJSON_USE_INT64 -D__STDC_FORMAT_MACROS -isystem ../3rdparty/boost-1.53.0 -I../3rdparty/elfio-3.2 -I../3rdparty/glog-0.3.3/src -I../3rdparty/leveldb-1.4/include -I../../3rdparty/libprocess/include -I../3rdparty/nvml-352.79 -I../3rdparty/picojson-1.3.0 -I../3rdparty/protobuf-2.6.1/src -I../../3rdparty/stout/include -I../3rdparty/zookeeper-3.4.8/src/c/include -I../3rdparty/zookeeper-3.4.8/src/c/generated -DHAS_AUTHENTICATION=1 -I/usr/include/subversion-1 -I/usr/include/apr-1 -I/usr/include/apr-1.0  -pthread -g1 -O0 -Wno-unused-local-typedefs -std=c++11 -MT slave/containerizer/mesos/provisioner/backends/libmesos_no_3rdparty_la-bind.lo -MD -MP -MF slave/containerizer/mesos/provisioner/backends/.deps/libmesos_no_3rdparty_la-bind.Tpo -c -o slave/containerizer/mesos/provisioner/backends/libmesos_no_3rdparty_la-bind.lo `test -f 'slave/containerizer/mesos/provisioner/backends/bind.cpp' || echo '../../src/'`slave/containerizer/mesos/provisioner/backends/bind.cpp
/bin/bash ../libtool  --tag=CXX   --mode=compile g++ -DPACKAGE_NAME=\"mesos\" -DPACKAGE_TARNAME=\"mesos\" -DPACKAGE_VERSION=\"1.1.0\" -DPACKAGE_STRING=\"mesos\ 1.1.0\" -DPACKAGE_BUGREPORT=\"\" -DPACKAGE_URL=\"\" -DPACKAGE=\"mesos\" -DVERSION=\"1.1.0\" -DSTDC_HEADERS=1 -DHAVE_SYS_TYPES_H=1 -DHAVE_SYS_STAT_H=1 -DHAVE_STDLIB_H=1 -DHAVE_STRING_H=1 -DHAVE_MEMORY_H=1 -DHAVE_STRINGS_H=1 -DHAVE_INTTYPES_H=1 -DHAVE_STDINT_H=1 -DHAVE_UNISTD_H=1 -DHAVE_DLFCN_H=1 -DLT_OBJDIR=\".libs/\" -DHAVE_CXX11=1 -DHAVE_PTHREAD_PRIO_INHERIT=1 -DHAVE_PTHREAD=1 -DHAVE_LIBZ=1 -DHAVE_FTS_H=1 -DHAVE_APR_POOLS_H=1 -DHAVE_LIBAPR_1=1 -DHAVE_LIBCURL=1 -DMESOS_HAS_JAVA=1 -DHAVE_PYTHON=\"2.7\" -DMESOS_HAS_PYTHON=1 -DHAVE_LIBSASL2=1 -DHAVE_SVN_VERSION_H=1 -DHAVE_LIBSVN_SUBR_1=1 -DHAVE_SVN_DELTA_H=1 -DHAVE_LIBSVN_DELTA_1=1 -DHAVE_LIBZ=1 -I. -I../../src   -Wall -Werror -Wsign-compare -DLIBDIR=\"/mesos/mesos-1.1.0/_inst/lib\" -DPKGLIBEXECDIR=\"/mesos/mesos-1.1.0/_inst/libexec/mesos\" -DPKGDATADIR=\"/mesos/mesos-1.1.0/_inst/share/mesos\" -DPKGMODULEDIR=\"/mesos/mesos-1.1.0/_inst/lib/mesos/modules\" -I../../include -I../include -I../include/mesos -DPICOJSON_USE_INT64 -D__STDC_FORMAT_MACROS -isystem ../3rdparty/boost-1.53.0 -I../3rdparty/elfio-3.2 -I../3rdparty/glog-0.3.3/src -I../3rdparty/leveldb-1.4/include -I../../3rdparty/libprocess/include -I../3rdparty/nvml-352.79 -I../3rdparty/picojson-1.3.0 -I../3rdparty/protobuf-2.6.1/src -I../../3rdparty/stout/include -I../3rdparty/zookeeper-3.4.8/src/c/include -I../3rdparty/zookeeper-3.4.8/src/c/generated -DHAS_AUTHENTICATION=1 -I/usr/include/subversion-1 -I/usr/include/apr-1 -I/usr/include/apr-1.0  -pthread -g1 -O0 -Wno-unused-local-typedefs -std=c++11 -MT slave/containerizer/mesos/provisioner/backends/libmesos_no_3rdparty_la-overlay.lo -MD -MP -MF slave/containerizer/mesos/provisioner/backends/.deps/libmesos_no_3rdparty_la-overlay.Tpo -c -o slave/containerizer/mesos/provisioner/backends/libmesos_no_3rdparty_la-overlay.lo `test -f 'slave/containerizer/mesos/provisioner/backends/overlay.cpp' || echo '../../src/'`slave/containerizer/mesos/provisioner/backends/overlay.cpp
libtool: compile:  g++ -DPACKAGE_NAME=\"mesos\" -DPACKAGE_TARNAME=\"mesos\" -DPACKAGE_VERSION=\"1.1.0\" "-DPACKAGE_STRING=\"mesos 1.1.0\"" -DPACKAGE_BUGREPORT=\"\" -DPACKAGE_URL=\"\" -DPACKAGE=\"mesos\" -DVERSION=\"1.1.0\" -DSTDC_HEADERS=1 -DHAVE_SYS_TYPES_H=1 -DHAVE_SYS_STAT_H=1 -DHAVE_STDLIB_H=1 -DHAVE_STRING_H=1 -DHAVE_MEMORY_H=1 -DHAVE_STRINGS_H=1 -DHAVE_INTTYPES_H=1 -DHAVE_STDINT_H=1 -DHAVE_UNISTD_H=1 -DHAVE_DLFCN_H=1 -DLT_OBJDIR=\".libs/\" -DHAVE_CXX11=1 -DHAVE_PTHREAD_PRIO_INHERIT=1 -DHAVE_PTHREAD=1 -DHAVE_LIBZ=1 -DHAVE_FTS_H=1 -DHAVE_APR_POOLS_H=1 -DHAVE_LIBAPR_1=1 -DHAVE_LIBCURL=1 -DMESOS_HAS_JAVA=1 -DHAVE_PYTHON=\"2.7\" -DMESOS_HAS_PYTHON=1 -DHAVE_LIBSASL2=1 -DHAVE_SVN_VERSION_H=1 -DHAVE_LIBSVN_SUBR_1=1 -DHAVE_SVN_DELTA_H=1 -DHAVE_LIBSVN_DELTA_1=1 -DHAVE_LIBZ=1 -I. -I../../src -Wall -Werror -Wsign-compare -DLIBDIR=\"/mesos/mesos-1.1.0/_inst/lib\" -DPKGLIBEXECDIR=\"/mesos/mesos-1.1.0/_inst/libexec/mesos\" -DPKGDATADIR=\"/mesos/mesos-1.1.0/_inst/share/mesos\" -DPKGMODULEDIR=\"/mesos/mesos-1.1.0/_inst/lib/mesos/modules\" -I../../include -I../include -I../include/mesos -DPICOJSON_USE_INT64 -D__STDC_FORMAT_MACROS -isystem ../3rdparty/boost-1.53.0 -I../3rdparty/elfio-3.2 -I../3rdparty/glog-0.3.3/src -I../3rdparty/leveldb-1.4/include -I../../3rdparty/libprocess/include -I../3rdparty/nvml-352.79 -I../3rdparty/picojson-1.3.0 -I../3rdparty/protobuf-2.6.1/src -I../../3rdparty/stout/include -I../3rdparty/zookeeper-3.4.8/src/c/include -I../3rdparty/zookeeper-3.4.8/src/c/generated -DHAS_AUTHENTICATION=1 -I/usr/include/subversion-1 -I/usr/include/apr-1 -I/usr/include/apr-1.0 -pthread -g1 -O0 -Wno-unused-local-typedefs -std=c++11 -MT slave/containerizer/mesos/libmesos_no_3rdparty_la-linux_launcher.lo -MD -MP -MF slave/containerizer/mesos/.deps/libmesos_no_3rdparty_la-linux_launcher.Tpo -c ../../src/slave/containerizer/mesos/linux_launcher.cpp  -fPIC -DPIC -o slave/containerizer/mesos/.libs/libmesos_no_3rdparty_la-linux_launcher.o
libtool: compile:  g++ -DPACKAGE_NAME=\"mesos\" -DPACKAGE_TARNAME=\"mesos\" -DPACKAGE_VERSION=\"1.1.0\" "-DPACKAGE_STRING=\"mesos 1.1.0\"" -DPACKAGE_BUGREPORT=\"\" -DPACKAGE_URL=\"\" -DPACKAGE=\"mesos\" -DVERSION=\"1.1.0\" -DSTDC_HEADERS=1 -DHAVE_SYS_TYPES_H=1 -DHAVE_SYS_STAT_H=1 -DHAVE_STDLIB_H=1 -DHAVE_STRING_H=1 -DHAVE_MEMORY_H=1 -DHAVE_STRINGS_H=1 -DHAVE_INTTYPES_H=1 -DHAVE_STDINT_H=1 -DHAVE_UNISTD_H=1 -DHAVE_DLFCN_H=1 -DLT_OBJDIR=\".libs/\" -DHAVE_CXX11=1 -DHAVE_PTHREAD_PRIO_INHERIT=1 -DHAVE_PTHREAD=1 -DHAVE_LIBZ=1 -DHAVE_FTS_H=1 -DHAVE_APR_POOLS_H=1 -DHAVE_LIBAPR_1=1 -DHAVE_LIBCURL=1 -DMESOS_HAS_JAVA=1 -DHAVE_PYTHON=\"2.7\" -DMESOS_HAS_PYTHON=1 -DHAVE_LIBSASL2=1 -DHAVE_SVN_VERSION_H=1 -DHAVE_LIBSVN_SUBR_1=1 -DHAVE_SVN_DELTA_H=1 -DHAVE_LIBSVN_DELTA_1=1 -DHAVE_LIBZ=1 -I. -I../../src -Wall -Werror -Wsign-compare -DLIBDIR=\"/mesos/mesos-1.1.0/_inst/lib\" -DPKGLIBEXECDIR=\"/mesos/mesos-1.1.0/_inst/libexec/mesos\" -DPKGDATADIR=\"/mesos/mesos-1.1.0/_inst/share/mesos\" -DPKGMODULEDIR=\"/mesos/mesos-1.1.0/_inst/lib/mesos/modules\" -I../../include -I../include -I../include/mesos -DPICOJSON_USE_INT64 -D__STDC_FORMAT_MACROS -isystem ../3rdparty/boost-1.53.0 -I../3rdparty/elfio-3.2 -I../3rdparty/glog-0.3.3/src -I../3rdparty/leveldb-1.4/include -I../../3rdparty/libprocess/include -I../3rdparty/nvml-352.79 -I../3rdparty/picojson-1.3.0 -I../3rdparty/protobuf-2.6.1/src -I../../3rdparty/stout/include -I../3rdparty/zookeeper-3.4.8/src/c/include -I../3rdparty/zookeeper-3.4.8/src/c/generated -DHAS_AUTHENTICATION=1 -I/usr/include/subversion-1 -I/usr/include/apr-1 -I/usr/include/apr-1.0 -pthread -g1 -O0 -Wno-unused-local-typedefs -std=c++11 -MT slave/containerizer/mesos/isolators/filesystem/libmesos_no_3rdparty_la-linux.lo -MD -MP -MF slave/containerizer/mesos/isolators/filesystem/.deps/libmesos_no_3rdparty_la-linux.Tpo -c ../../src/slave/containerizer/mesos/isolators/filesystem/linux.cpp  -fPIC -DPIC -o slave/containerizer/mesos/isolators/filesystem/.libs/libmesos_no_3rdparty_la-linux.o
libtool: compile:  g++ -DPACKAGE_NAME=\"mesos\" -DPACKAGE_TARNAME=\"mesos\" -DPACKAGE_VERSION=\"1.1.0\" "-DPACKAGE_STRING=\"mesos 1.1.0\"" -DPACKAGE_BUGREPORT=\"\" -DPACKAGE_URL=\"\" -DPACKAGE=\"mesos\" -DVERSION=\"1.1.0\" -DSTDC_HEADERS=1 -DHAVE_SYS_TYPES_H=1 -DHAVE_SYS_STAT_H=1 -DHAVE_STDLIB_H=1 -DHAVE_STRING_H=1 -DHAVE_MEMORY_H=1 -DHAVE_STRINGS_H=1 -DHAVE_INTTYPES_H=1 -DHAVE_STDINT_H=1 -DHAVE_UNISTD_H=1 -DHAVE_DLFCN_H=1 -DLT_OBJDIR=\".libs/\" -DHAVE_CXX11=1 -DHAVE_PTHREAD_PRIO_INHERIT=1 -DHAVE_PTHREAD=1 -DHAVE_LIBZ=1 -DHAVE_FTS_H=1 -DHAVE_APR_POOLS_H=1 -DHAVE_LIBAPR_1=1 -DHAVE_LIBCURL=1 -DMESOS_HAS_JAVA=1 -DHAVE_PYTHON=\"2.7\" -DMESOS_HAS_PYTHON=1 -DHAVE_LIBSASL2=1 -DHAVE_SVN_VERSION_H=1 -DHAVE_LIBSVN_SUBR_1=1 -DHAVE_SVN_DELTA_H=1 -DHAVE_LIBSVN_DELTA_1=1 -DHAVE_LIBZ=1 -I. -I../../src -Wall -Werror -Wsign-compare -DLIBDIR=\"/mesos/mesos-1.1.0/_inst/lib\" -DPKGLIBEXECDIR=\"/mesos/mesos-1.1.0/_inst/libexec/mesos\" -DPKGDATADIR=\"/mesos/mesos-1.1.0/_inst/share/mesos\" -DPKGMODULEDIR=\"/mesos/melibtool: compile:  g++ -DPACKAGE_NAME=\"mesos\" -DPACKAGE_TARNAME=\"mesos\" -DPACKAGE_VERSION=\"1.1.0\" "-DPACKAGE_STRING=\"mesos 1.1.0\"" -DPACKAGE_BUGREPORT=\"\" -DPACKAGE_URL=\"\" -DPACKAGE=\"mesos\" -DVERSION=\"1.1.0\" -DSTDC_HEADERS=1 -DHAVE_SYS_TYPES_H=1 -DHAVE_SYS_STAT_H=1 -DHAVE_STDLIB_H=1 -DHAVE_STRING_H=1 -DHAVE_MEMORY_H=1 -DHAVE_STRINGS_H=1 -DHAVE_INTTYPES_H=1 -DHAVE_STDINT_H=1 -DHAVE_UNISTD_H=1 -DHAVE_DLFCN_H=1 -DLT_OBJDIR=\".libs/\" -DHAVE_CXX11=1 -DHAVE_PTHREAD_PRIO_INHERIT=1 -DHAVE_PTHREAD=1 -DHAVE_LIBZ=1 -DHAVE_FTS_H=1 -DHAVE_APR_POOLS_H=1 -DHAVE_LIBAPR_1=1 -DHAVE_LIBCURL=1 -DMESOS_HAS_JAVA=1 -DHAVE_PYTHON=\"2.7\" -DMESOS_HAS_PYTHON=1 -DHAVE_LIBSASL2=1 -DHAVE_SVN_VERSION_H=1 -DHAVE_LIBSVN_SUBR_1=1 -DHAVE_SVN_DELTA_H=1 -DHAVE_LIBSVN_DELTA_1=1 -DHAVE_LIBZ=1 -I. -I../../src -Wall -Werror -Wsign-compare -DLIBDIR=\"/mesos/mesos-1.1.0/_inst/lib\" -DPKGLIBEXECDIR=\"/mesos/mesos-1.1.0/_inst/libexec/mesos\" -DPKGDATADIR=\"/mesos/mesos-1.1.0/_inst/share/mesos\" -DPKGMODULEDIR=\"/mesos/mesos-1.1.0/_inst/lib/mesos/modules\" -I../../include -I../include -I../include/mesos -DPICOJSON_USE_INT64 -D__STDC_FORMAT_MACROS -isystem ../3rdparty/boost-1.53.0 -I../3rdparty/elfio-3.2 -I../3rdparty/glog-0.3.3/src -I../3rdparty/leveldb-1.4/include -I../../3rdparty/libprocess/include -I../3rdparty/nvml-352.79 -I../3rdparty/picojson-1.3.0 -I../3rdparty/protobuf-2.6.1/src -I../../3rdparty/stout/include -I../3rdparty/zookeeper-3.4.8/src/c/include -I../3rdparty/zookeeper-3.4.8/src/c/generated -DHAS_AUTHENTICATION=1 -I/usr/include/subversion-1 -I/usr/include/apr-1 -I/usr/include/apr-1.0 -pthread -g1 -O0 -Wno-unused-local-typedefs -std=c++11 -MT slave/containerizer/mesos/isolators/network/cni/libmesos_no_3rdparty_la-cni.lo -MD -MP -MF slave/containerizer/mesos/isolators/network/cni/.deps/libmesos_no_3rdparty_la-cni.Tpo -c ../../src/slave/containerizer/mesos/isolators/network/cni/cni.cpp  -fPIC -DPIC -o slave/containerizer/mesos/isolators/network/cni/.libs/libmesos_no_3rdparty_la-cni.o
sos-1.1.0/_inst/lib/mesos/modules\" -I../../include -I../include -I../include/mesos -DPICOJSON_USE_INT64 -D__STDC_FORMAT_MACROS -isystem ../3rdparty/boost-1.53.0 -I../3rdparty/elfio-3.2 -I../3rdparty/glog-0.3.3/src -I../3rdparty/leveldb-1.4/include -I../../3rdparty/libprocess/include -I../3rdparty/nvml-352.79 -I../3rdparty/picojson-1.3.0 -I../3rdparty/protobuf-2.6.1/src -I../../3rdparty/stout/include -I../3rdparty/zookeeper-3.4.8/src/c/include -I../3rdparty/zookeeper-3.4.8/src/c/generated -DHAS_AUTHENTICATION=1 -I/usr/include/subversion-1 -I/usr/include/apr-1 -I/usr/include/apr-1.0 -pthread -g1 -O0 -Wno-unused-local-typedefs -std=c++11 -MT slave/containerizer/mesos/provisioner/backends/libmesos_no_3rdparty_la-bind.lo -MD -MP -MF slave/containerizer/mesos/provisioner/backends/.deps/libmesos_no_3rdparty_la-bind.Tpo -c ../../src/slave/containerizer/mesos/provisioner/backends/bind.cpp  -fPIC -DPIC -o slave/containerizer/mesos/provisioner/backends/.libs/libmesos_no_3rdparty_la-bind.o
libtool: compile:  g++ -DPACKAGE_NAME=\"mesos\" -DPACKAGE_TARNAME=\"mesos\" -DPACKAGE_VERSION=\"1.1.0\" "-DPACKAGE_STRING=\"mesos 1.1.0\"" -DPACKAGE_BUGREPORT=\"\" -DPACKAGE_URL=\"\" -DPACKAGE=\"mesos\" -DVERSION=\"1.1.0\" -DSTDC_HEADERS=1 -DHAVE_SYS_TYPES_H=1 -DHAVE_SYS_STAT_H=1 -DHAVE_STDLIB_H=1 -DHAVE_STRING_H=1 -DHAVE_MEMORY_H=1 -DHAVE_STRINGS_H=1 -DHAVE_INTTYPES_H=1 -DHAVE_STDINT_H=1 -DHAVE_UNISTD_H=1 -DHAVE_DLFCN_H=1 -DLT_OBJDIR=\".libs/\" -DHAVE_CXX11=1 -DHAVE_PTHREAD_PRIO_INHERIT=1 -DHAVE_PTHREAD=1 -DHAVE_LIBZ=1 -DHAVE_FTS_H=1 -DHAVE_APR_POOLS_H=1 -DHAVE_LIBAPR_1=1 -DHAVE_LIBCURL=1 -DMESOS_HAS_JAVA=1 -DHAVE_PYTHON=\"2.7\" -DMESOS_HAS_PYTHON=1 -DHAVE_LIBSASL2=1 -DHAVE_SVN_VERSION_H=1 -DHAVE_LIBSVN_SUBR_1=1 -DHAVE_SVN_DELTA_H=1 -DHAVE_LIBSVN_DELTA_1=1 -DHAVE_LIBZ=1 -I. -I../../src -Wall -Werror -Wsign-compare -DLIBDIR=\"/mesos/mesos-1.1.0/_inst/lib\" -DPKGLIBEXECDIR=\"/mesos/mesos-1.1.0/_inst/libexec/mesos\" -DPKGDATADIR=\"/mesos/mesos-1.1.0/_inst/share/mesos\" -DPKGMODULEDIR=\"/mesos/mesos-1.1.0/_inst/lib/mesos/modules\" -I../../include -I../include -I../include/mesos -DPICOJSON_USE_INT64 -D__STDC_FORMAT_MACROS -isystem ../3rdparty/boost-1.53.0 -I../3rdparty/elfio-3.2 -I../3rdparty/glog-0.3.3/src -I../3rdparty/leveldb-1.4/include -I../../3rdparty/libprocess/include -I../3rdparty/nvml-352.79 -I../3rdparty/picojson-1.3.0 -I../3rdparty/protobuf-2.6.1/src -I../../3rdparty/stout/include -I../3rdparty/zookeeper-3.4.8/src/c/include -I../3rdparty/zookeeper-3.4.8/src/c/generated -DHAS_AUTHENTICATION=1 -I/usr/include/subversion-1 -I/usr/include/apr-1 -I/usr/include/apr-1.0 -pthread -g1 -O0 -Wno-unused-local-typedefs -std=c++11 -MT slave/containerizer/mesos/isolators/filesystem/libmesos_no_3rdparty_la-shared.lo -MD -MP -MF slave/containerizer/mesos/isolators/filesystem/.deps/libmesos_no_3rdparty_la-shared.Tpo -c ../../src/slave/containerizer/mesos/isolators/filesystem/shared.cpp  -fPIC -DPIC -o slave/containerizer/mesos/isolators/filesystem/.libs/libmesos_no_3rdparty_la-shared.o
libtool: compile:  g++ -DPACKAGE_NAME=\"mesos\" -DPACKAGE_TARNAME=\"mesos\" -DPACKAGE_VERSION=\"1.1.0\" "-DPACKAGE_STRING=\"mesos 1.1.0\"" -DPACKAGE_BUGREPORT=\"\" -DPACKAGE_URL=\"\" -DPACKAGE=\"mesos\" -DVERSION=\"1.1.0\" -DSTDC_HEADERS=1 -DHAVE_SYS_TYPES_H=1 -DHAVE_SYS_STAT_H=1 -DHAVE_STDLIB_H=1 -DHAVE_STRING_H=1 -DHAVE_MEMORY_H=1 -DHAVE_STRINGS_H=1 -DHAVE_INTTYPES_H=1 -DHAVE_STDINT_H=1 -DHAVE_UNISTD_H=1 -DHAVE_DLFCN_H=1 -DLT_OBJDIR=\".libs/\" -DHAVE_CXX11=1 -DHAVE_PTHREAD_PRIO_INHERIT=1 -DHAVE_PTHREAD=1 -DHAVE_LIBZ=1 -DHAVE_FTS_H=1 -DHAVE_APR_POOLS_H=1 -DHAVE_LIBAPR_1=1 -DHAVE_LIBCURL=1 -DMESOS_HAS_JAVA=1 -DHAVE_PYTHON=\"2.7\" -DMESOS_HAS_PYTHON=1 -DHAVE_LIBSASL2=1 -DHAVE_SVN_VERSION_H=1 -DHAVE_LIBSVN_SUBR_1=1 -DHAVE_SVN_DELTA_H=1 -DHAVE_LIBSVN_DELTA_1=1 -DHAVE_LIBZ=1 -I. -I../../src -Wall -Werror -Wsign-compare -DLIBDIR=\"/mesos/mesos-1.1.0/_inst/lib\" -DPKGLIBEXECDIR=\"/mesos/mesos-1.1.0/_inst/libexec/mesos\" -DPKGDATADIR=\"/mesos/mesos-1.1.0/_inst/share/mesos\" -DPKGMODULEDIR=\"/mesos/mesos-1.1.0/_inst/lib/mesos/modules\" -I../../include -I../include -I../include/mesos -DPICOJSON_USE_INT64 -D__STDC_FORMAT_MACROS -isystem ../3rdparty/boost-1.53.0 -I../3rdparty/elfio-3.2 -I../3rdparty/glog-0.3.3/src -I../3rdparty/leveldb-1.4/include -I../../3rdparty/libprocess/include -I../3rdparty/nvml-352.79 -I../3rdparty/picojson-1.3.0 -I../3rdparty/protobuf-2.6.1/src -I../../3rdparty/stout/include -I../3rdparty/zookeeper-3.4.8/src/c/include -I../3rdparty/zookeeper-3.4.8/src/c/generated -DHAS_AUTHENTICATION=1 -I/usr/include/subversion-1 -I/usr/include/apr-1 -I/usr/include/apr-1.0 -pthread -g1 -O0 -Wno-unused-local-typedefs -std=c++11 -MT slave/containerizer/mesos/provisioner/backends/libmesos_no_3rdparty_la-aufs.lo -MD -MP -MF slave/containerizer/mesos/provisioner/backends/.deps/libmesos_no_3rdparty_la-aufs.Tpo -c ../../src/slave/containerizer/mesos/provisioner/backends/aufs.cpp  -fPIC -DPIC -o slave/containerizer/mesos/provisioner/backends/.libs/libmesos_no_3rdparty_la-aufs.o
libtool: compile:  g++ -DPACKAGE_NAME=\"mesos\" -DPACKAGE_TARNAME=\"mesos\" -DPACKAGE_VERSION=\"1.1.0\" "-DPACKAGE_STRING=\"mesos 1.1.0\"" -DPACKAGE_BUGREPORT=\"\" -DPACKAGE_URL=\"\" -DPACKAGE=\"mesos\" -DVERSION=\"1.1.0\" -DSTDC_HEADERS=1 -DHAVE_SYS_TYPES_H=1 -DHAVE_SYS_STAT_H=1 -DHAVE_STDLIB_H=1 -DHAVE_STRING_H=1 -DHAVE_MEMORY_H=1 -DHAVE_STRINGS_H=1 -DHAVE_INTTYPES_H=1 -DHAVE_STDINT_H=1 -DHAVE_UNISTD_H=1 -DHAVE_DLFCN_H=1 -DLT_OBJDIR=\".libs/\" -DHAVE_CXX11=1 -DHAVE_PTHREAD_PRIO_INHERIT=1 -DHAVE_PTHREAD=1 -DHAVE_LIBZ=1 -DHAVE_FTS_H=1 -DHAVE_APR_POOLS_H=1 -DHAVE_LIBAPR_1=1 -DHAVE_LIBCURL=1 -DMESOS_HAS_JAVA=1 -DHAVE_PYTHON=\"2.7\" -DMESOS_HAS_PYTHON=1 -DHAVE_LIBSASL2=1 -DHAVE_SVN_VERSION_H=1 -DHAVE_LIBSVN_SUBR_1=1 -DHAVE_SVN_DELTA_H=1 -DHAVE_LIBSVN_DELTA_1=1 -DHAVE_LIBZ=1 -I. -I../../src -Wall -Werror -Wsign-compare -DLIBDIR=\"/mesos/mesos-1.1.0/_inst/lib\" -DPKGLIBEXECDIR=\"/mesos/mesos-1.1.0/_inst/libexec/mesos\" -DPKGDATADIR=\"/mesos/mesos-1.1.0/_inst/share/mesos\" -DPKGMODULEDIR=\"/mesos/mesos-1.1.0/_inst/lib/mesos/modules\" -I../../include -I../include -I../include/mesos -DPICOJSON_USE_INT64 -D__STDC_FORMAT_MACROS -isystem ../3rdparty/boost-1.53.0 -I../3rdparty/elfio-3.2 -I../3rdparty/glog-0.3.3/src -I../3rdparty/leveldb-1.4/include -I../../3rdparty/libprocess/include -I../3rdparty/nvml-352.79 -I../3rdparty/picojson-1.3.0 -I../3rdparty/protobuf-2.6.1/src -I../../3rdparty/stout/include -I../3rdparty/zookeeper-3.4.8/src/c/include -I../3rdparty/zookeeper-3.4.8/src/c/generated -DHAS_AUTHENTICATION=1 -I/usr/include/subversion-1 -I/usr/include/apr-1 -I/usr/include/apr-1.0 -pthread -g1 -O0 -Wno-unused-local-typedefs -std=c++11 -MT slave/containerizer/mesos/provisioner/backends/libmesos_no_3rdparty_la-overlay.lo -MD -MP -MF slave/containerizer/mesos/provisioner/backends/.deps/libmesos_no_3rdparty_la-overlay.Tpo -c ../../src/slave/containerizer/mesos/provisioner/backends/overlay.cpp  -fPIC -DPIC -o slave/containerizer/mesos/provisioner/backends/.libs/libmesos_no_3rdparty_la-overlay.o
libtool: compile:  g++ -DPACKAGE_NAME=\"mesos\" -DPACKAGE_TARNAME=\"mesos\" -DPACKAGE_VERSION=\"1.1.0\" "-DPACKAGE_STRING=\"mesos 1.1.0\"" -DPACKAGE_BUGREPORT=\"\" -DPACKAGE_URL=\"\" -DPACKAGE=\"mesos\" -DVERSION=\"1.1.0\" -DSTDC_HEADERS=1 -DHAVE_SYS_TYPES_H=1 -DHAVE_SYS_STAT_H=1 -DHAVE_STDLIB_H=1 -DHAVE_STRING_H=1 -DHAVE_MEMORY_H=1 -DHAVE_STRINGS_H=1 -DHAVE_INTTYPES_H=1 -DHAVE_STDINT_H=1 -DHAVE_UNISTD_H=1 -DHAVE_DLFCN_H=1 -DLT_OBJDIR=\".libs/\" -DHAVE_CXX11=1 -DHAVE_PTHREAD_PRIO_INHERIT=1 -DHAVE_PTHREAD=1 -DHAVE_LIBZ=1 -DHAVE_FTS_H=1 -DHAVE_APR_POOLS_H=1 -DHAVE_LIBAPR_1=1 -DHAVE_LIBCURL=1 -DMESOS_HAS_JAVA=1 -DHAVE_PYTHON=\"2.7\" -DMESOS_HAS_PYTHON=1 -DHAVE_LIBSASL2=1 -DHAVE_SVN_VERSION_H=1 -DHAVE_LIBSVN_SUBR_1=1 -DHAVE_SVN_DELTA_H=1 -DHAVE_LIBSVN_DELTA_1=1 -DHAVE_LIBZ=1 -I. -I../../src -Wall -Werror -Wsign-compare -DLIBDIR=\"/mesos/mesos-1.1.0/_inst/lib\" -DPKGLIBEXECDIR=\"/mesos/mesos-1.1.0/_inst/libexec/mesos\" -DPKGDATADIR=\"/mesos/mesos-1.1.0/_inst/share/mesos\" -DPKGMODULEDIR=\"/mesos/mesos-1.1.0/_inst/lib/mesos/modules\" -I../../include -I../include -I../include/mesos -DPICOJSON_USE_INT64 -D__STDC_FORMAT_MACROS -isystem ../3rdparty/boost-1.53.0 -I../3rdparty/elfio-3.2 -I../3rdparty/glog-0.3.3/src -I../3rdparty/leveldb-1.4/include -I../../3rdparty/libprocess/include -I../3rdparty/nvml-352.79 -I../3rdparty/picojson-1.3.0 -I../3rdparty/protobuf-2.6.1/src -I../../3rdparty/stout/include -I../3rdparty/zookeeper-3.4.8/src/c/include -I../3rdparty/zookeeper-3.4.8/src/c/generated -DHAS_AUTHENTICATION=1 -I/usr/include/subversion-1 -I/usr/include/apr-1 -I/usr/include/apr-1.0 -pthread -g1 -O0 -Wno-unused-local-typedefs -std=c++11 -MT slave/containerizer/mesos/isolators/docker/volume/libmesos_no_3rdparty_la-isolator.lo -MD -MP -MF slave/containerizer/mesos/isolators/docker/volume/.deps/libmesos_no_3rdparty_la-isolator.Tpo -c ../../src/slave/containerizer/mesos/isolators/docker/volume/isolator.cpp  -fPIC -DPIC -o slave/containerizer/mesos/isolators/docker/volume/.libs/libmesos_no_3rdparty_la-isolator.o
In file included from ../../src/slave/containerizer/mesos/isolator.hpp:20:0,
                 from ../../src/slave/containerizer/mesos/isolators/docker/volume/isolator.hpp:31,
                 from ../../src/slave/containerizer/mesos/isolators/docker/volume/isolator.cpp:25:
../../include/mesos/slave/isolator.hpp:25:41: fatal error: mesos/slave/containerizer.hpp: No such file or directory
 #include <mesos/slave/containerizer.hpp>
                                         ^
compilation terminated.
In file included from ../../src/slave/containerizer/mesos/launcher.hpp:28:0,
                 from ../../src/slave/containerizer/mesos/linux_launcher.hpp:20,
                 from ../../src/slave/containerizer/mesos/linux_launcher.cpp:39:
../../include/mesos/slave/isolator.hpp:25:41: fatal error: mesos/slave/containerizer.hpp: No such file or directory
 #include <mesos/slave/containerizer.hpp>
                                         ^
compilation terminated.
In file included from ../../src/slave/containerizer/mesos/isolator.hpp:20:0,
                 from ../../src/slave/containerizer/mesos/isolators/network/cni/cni.hpp:27,
                 from ../../src/slave/containerizer/mesos/isolators/network/cni/cni.cpp:33:
../../include/mesos/slave/isolator.hpp:25:41: fatal error: mesos/slave/containerizer.hpp: No such file or directory
 #include <mesos/slave/containerizer.hpp>
                                         ^
compilation terminated.
In file included from ../../src/slave/containerizer/mesos/isolator.hpp:20:0,
                 from ../../src/slave/containerizer/mesos/isolators/filesystem/shared.hpp:22,
                 from ../../src/slave/containerizer/mesos/isolators/filesystem/shared.cpp:25:
../../include/mesos/slave/isolator.hpp:25:41: fatal error: mesos/slave/containerizer.hpp: No such file or directory
 #include <mesos/slave/containerizer.hpp>
                                         ^
compilation terminated.
In file included from ../../src/slave/containerizer/mesos/isolator.hpp:20:0,
                 from ../../src/slave/containerizer/mesos/isolators/filesystem/linux.hpp:32,
                 from ../../src/slave/containerizer/mesos/isolators/filesystem/linux.cpp:46:
../../include/mesos/slave/isolator.hpp:25:41: fatal error: mesos/slave/containerizer.hpp: No such file or directory
 #include <mesos/slave/containerizer.hpp>
                                         ^
compilation terminated.
make[3]: *** [slave/containerizer/mesos/isolators/docker/volume/libmesos_no_3rdparty_la-isolator.lo] Error 1
make[3]: *** Waiting for unfinished jobs....
make[3]: *** [slave/containerizer/mesos/libmesos_no_3rdparty_la-linux_launcher.lo] Error 1
make[3]: *** [slave/containerizer/mesos/isolators/filesystem/libmesos_no_3rdparty_la-linux.lo] Error 1
make[3]: *** [slave/containerizer/mesos/isolators/filesystem/libmesos_no_3rdparty_la-shared.lo] Error 1
make[3]: *** [slave/containerizer/mesos/isolators/network/cni/libmesos_no_3rdparty_la-cni.lo] Error 1
mv -f slave/containerizer/mesos/provisioner/backends/.deps/libmesos_no_3rdparty_la-aufs.Tpo slave/containerizer/mesos/provisioner/backends/.deps/libmesos_no_3rdparty_la-aufs.Plo
mv -f slave/containerizer/mesos/provisioner/backends/.deps/libmesos_no_3rdparty_la-overlay.Tpo slave/containerizer/mesos/provisioner/backends/.deps/libmesos_no_3rdparty_la-overlay.Plo
mv -f slave/containerizer/mesos/provisioner/backends/.deps/libmesos_no_3rdparty_la-bind.Tpo slave/containerizer/mesos/provisioner/backends/.deps/libmesos_no_3rdparty_la-bind.Plo
make[3]: Leaving directory `/mesos/mesos-1.1.0/_build/src'
make[2]: *** [all] Error 2
make[2]: Leaving directory `/mesos/mesos-1.1.0/_build/src'
make[1]: *** [all-recursive] Error 1
make[1]: Leaving directory `/mesos/mesos-1.1.0/_build'
make: *** [distcheck] Error 1
+ docker rmi mesos-1471983174-12054
Untagged: mesos-1471983174-12054:latest
Deleted: sha256:4c15822c19a8d0972b1cda5a22b8f4da3d4db93a08c502fbf1d6a3d31f742bb6
Deleted: sha256:2f1bf9ac4bd77b2cb510dd776ad675220c8a2490fccdbb611e4b7ae99f485242
Deleted: sha256:f91060a65f1f91f2f3e6f80ea243693864667c1c0a05b360d67f50118c59a666
Deleted: sha256:59cc8101f9960f9fca73e152204585979936c1ed14a7f20aac16b9b77f2ed735
Deleted: sha256:fc35695226c46369f81f613100b7dac7ddaf3a53f9b8823510e34c27c2d25155
Deleted: sha256:4e5f008ca976b48bdc0f5b565998f342e2afa42b236f9d8526d0883e046eee91
Deleted: sha256:28bc492cd96fb86c9fc4090ebfd715f26f1cb0bb1f12508fc8e41f655db8515e
Deleted: sha256:7e6b6e7df685dab3a9ede2f3c3ef66a821f1a0bbcdb5ceb7091d6e7cfc57afae
Deleted: sha256:fa782629b92c29503cabd7a8ec935d4f0b123346f0365f7313ddefe3371a6691
Deleted: sha256:67350fd9314f05ff17191f3733f202dba9e576a3924ec8506dc6e4600cf65c96
Deleted: sha256:fea76df0b8a1ff1936db69bf4135b5a58123f53ad32bc125fbe4261c15deac65
Deleted: sha256:20447a32676ac6d163d674d0eff5af1fb6bef10c193a1ab86f4f6b77f84cf015
Deleted: sha256:b597175ecdc88b0bf736fd94a6bae9c9abb4601edd1e81e36e7ec93178507b80
Deleted: sha256:86e9cc421e0d0118d2d1ff8aab3b45662f1aec6665f455a86ebdd7c372c7acbb
Deleted: sha256:f2549fce3a2c3ead9c87d6053c81d62182a9a1da50d39b2acaf45ab733ee2206
Deleted: sha256:d1f9e8c7a32e55c634df8bc2e098c3a75d3a4e71632a7117585726567b4e0b26
Deleted: sha256:f5c0f5cfea081c1f9d54c42f544836cad80fdb7bb932cd18c5573be502481beb
Deleted: sha256:ea5025c70f207e17b4002cd46e5beb671e3145a7424881e3a64e742fa5fc6a46
Deleted: sha256:4e6345bd3f153f5234e5051822ffbb513bfeb696dab91f2ac525a0def1783b25
Deleted: sha256:ad583323ec4a461ba596c585960f3cb2582aa5ff00747233cb91a5ee8bf8c042
Deleted: sha256:f96604edd898a1977ad8b95809354cc2531b8cc465526593ced6df027cd6af01
Deleted: sha256:ec502b5e59b5a7ac2714f27ebdcab0d6fe42fd0d7fe7bcb376c2de55e8df0329
Deleted: sha256:7891c9731c7b4ca87d394c5f451cbe56c2b155b3dfebabd937eb80d9fb4b0234
Deleted: sha256:43a0fa018644c3af8360a1a9d86b3a1e1a4f6050ac79070183c6a2496bef9062
Build step 'Execute shell' marked build as failure

Mime
View raw message