mesos-builds mailing list archives

Site index · List index
Message view « Date » · « Thread »
Top « Date » · « Thread »
From Michael Park <mp...@apache.org>
Subject Re: Build failed in Jenkins: Mesos » autotools,gcc,--verbose,GLOG_v=1 MESOS_VERBOSE=1,ubuntu:14.04,(docker||Hadoop)&&(!ubuntu-us1)&&(!ubuntu-6) #2433
Date Mon, 04 Jul 2016 18:44:55 GMT
Looks like https://issues.apache.org/jira/browse/MESOS-3968

On 4 July 2016 at 20:30, Apache Jenkins Server <jenkins@builds.apache.org>
wrote:

> See <
> https://builds.apache.org/job/Mesos/BUILDTOOL=autotools,COMPILER=gcc,CONFIGURATION=--verbose,ENVIRONMENT=GLOG_v=1%20MESOS_VERBOSE=1,OS=ubuntu%3A14.04,label_exp=(docker%7C%7CHadoop)&&(!ubuntu-us1)&&(!ubuntu-6)/2433/
> >
>
> ------------------------------------------
> [...truncated 193685 lines...]
> I0704 18:30:11.996745 28191 slave.cpp:605] Agent hostname: ac08071de0bc
> I0704 18:30:11.998109 28183 state.cpp:57] Recovering state from
> '/tmp/Endpoint_SlaveEndpointTest_AuthorizedRequest_1_ENh8ex/meta'
> I0704 18:30:11.998178 28191 process.cpp:3322] Handling HTTP event for
> process 'slave(541)' with path: '/slave(541)/monitor/statistics.json'
> I0704 18:30:11.998759 28187 status_update_manager.cpp:200] Recovering
> status update manager
> I0704 18:30:11.999045 28194 containerizer.cpp:522] Recovering containerizer
> I0704 18:30:11.999136 28188 http.cpp:765] Authorizing principal
> 'test-principal' to GET the '/monitor/statistics.json' endpoint
> I0704 18:30:12.001163 28196 provisioner.cpp:253] Provisioner recovery
> complete
> I0704 18:30:12.001464 28194 slave.cpp:4838] Finished recovery
> I0704 18:30:12.002090 28194 slave.cpp:5010] Querying resource estimator
> for oversubscribable resources
> I0704 18:30:12.002322 28186 slave.cpp:5024] Received oversubscribable
> resources  from the resource estimator
> I0704 18:30:12.002928 28198 slave.cpp:839] Agent terminating
> [       OK ] Endpoint/SlaveEndpointTest.AuthorizedRequest/1 (23 ms)
> [ RUN      ] Endpoint/SlaveEndpointTest.AuthorizedRequest/2
> I0704 18:30:12.013043 28164 containerizer.cpp:196] Using isolation:
> posix/cpu,posix/mem,filesystem/posix,network/cni
> W0704 18:30:12.013751 28164 backend.cpp:75] Failed to create 'aufs'
> backend: AufsBackend requires root privileges, but is running as user mesos
> W0704 18:30:12.013890 28164 backend.cpp:75] Failed to create 'bind'
> backend: BindBackend requires root privileges
> I0704 18:30:12.016866 28196 slave.cpp:203] Agent started on 542)@
> 172.17.0.2:41465
> I0704 18:30:12.016891 28196 slave.cpp:204] Flags at startup: --acls=""
> --appc_simple_discovery_uri_prefix="http://"
> --appc_store_dir="/tmp/mesos/store/appc" --authenticate_http="true"
> --authenticatee="crammd5" --authorizer="local"
> --cgroups_cpu_enable_pids_and_tids_count="false"
> --cgroups_enable_cfs="false" --cgroups_hierarchy="/sys/fs/cgroup"
> --cgroups_limit_swap="false" --cgroups_root="mesos"
> --container_disk_watch_interval="15secs" --containerizers="mesos"
> --credential="/tmp/Endpoint_SlaveEndpointTest_AuthorizedRequest_2_UP17MD/credential"
> --default_role="*" --disk_watch_interval="1mins" --docker="docker"
> --docker_kill_orphans="true" --docker_registry="
> https://registry-1.docker.io" --docker_remove_delay="6hrs"
> --docker_socket="/var/run/docker.sock" --docker_stop_timeout="0ns"
> --docker_store_dir="/tmp/mesos/store/docker"
> --docker_volume_checkpoint_dir="/var/run/mesos/isolators/docker/volume"
> --enforce_container_disk_quota="false"
> --executor_registration_timeout="1mins"
> --executor_shutdown_grace_period="5secs"
> --fetcher_cache_dir="/tmp/Endpoint_SlaveEndpointTest_AuthorizedRequest_2_UP17MD/fetch"
> --fetcher_cache_size="2GB" --frameworks_home="" --gc_delay="1weeks"
> --gc_disk_headroom="0.1" --hadoop_home="" --help="true"
> --hostname_lookup="true" --http_authenticators="basic"
> --http_command_executor="false"
> --http_credentials="/tmp/Endpoint_SlaveEndpointTest_AuthorizedRequest_2_UP17MD/http_credentials"
> --image_provisioner_backend="copy" --initialize_driver_logging="true"
> --isolation="posix/cpu,posix/mem"
> --launcher_dir="/mesos/mesos-1.0.0/_build/src" --logbufsecs="0"
> --logging_level="INFO" --oversubscribed_resources_interval="15secs"
> --perf_duration="10secs" --perf_interval="1mins"
> --qos_correction_interval_min="0ns" --quiet="false" --recover="reconnect"
> --recovery_timeout="15mins" --registration_backoff_factor="10ms"
> --resources="cpus:2;gpus:0;mem:1024;disk:1024;ports:[31000-32000]"
> --revocable_cpu_low_priority="true"
> --sandbox_directory="/mnt/mesos/sandbox" --strict="true"
> --switch_user="true" --systemd_enable_support="true"
> --systemd_runtime_directory="/run/systemd/system" --version="false"
> --work_dir="/tmp/Endpoint_SlaveEndpointTest_AuthorizedRequest_2_UP17MD"
> I0704 18:30:12.017422 28196 credentials.hpp:86] Loading credential for
> authentication from
> '/tmp/Endpoint_SlaveEndpointTest_AuthorizedRequest_2_UP17MD/credential'
> I0704 18:30:12.017727 28196 slave.cpp:341] Agent using credential for:
> test-principal
> I0704 18:30:12.017772 28196 credentials.hpp:37] Loading credentials for
> authentication from
> '/tmp/Endpoint_SlaveEndpointTest_AuthorizedRequest_2_UP17MD/http_credentials'
> I0704 18:30:12.018056 28196 slave.cpp:393] Using default 'basic' HTTP
> authenticator
> I0704 18:30:12.018411 28196 resources.cpp:572] Parsing resources as JSON
> failed: cpus:2;gpus:0;mem:1024;disk:1024;ports:[31000-32000]
> Trying semicolon-delimited string format instead
> I0704 18:30:12.018847 28196 resources.cpp:572] Parsing resources as JSON
> failed: cpus:2;gpus:0;mem:1024;disk:1024;ports:[31000-32000]
> Trying semicolon-delimited string format instead
> I0704 18:30:12.019254 28196 slave.cpp:592] Agent resources: cpus(*):2;
> mem(*):1024; disk(*):1024; ports(*):[31000-32000]
> I0704 18:30:12.019322 28196 slave.cpp:600] Agent attributes: [  ]
> I0704 18:30:12.019343 28196 slave.cpp:605] Agent hostname: ac08071de0bc
> I0704 18:30:12.020980 28189 state.cpp:57] Recovering state from
> '/tmp/Endpoint_SlaveEndpointTest_AuthorizedRequest_2_UP17MD/meta'
> I0704 18:30:12.021055 28196 process.cpp:3322] Handling HTTP event for
> process 'slave(542)' with path: '/slave(542)/containers'
> I0704 18:30:12.021522 28187 status_update_manager.cpp:200] Recovering
> status update manager
> I0704 18:30:12.021739 28186 containerizer.cpp:522] Recovering containerizer
> I0704 18:30:12.022011 28183 http.cpp:765] Authorizing principal
> 'test-principal' to GET the '/containers' endpoint
> I0704 18:30:12.023954 28186 provisioner.cpp:253] Provisioner recovery
> complete
> I0704 18:30:12.024353 28198 slave.cpp:4838] Finished recovery
> I0704 18:30:12.025017 28198 slave.cpp:5010] Querying resource estimator
> for oversubscribable resources
> I0704 18:30:12.025228 28194 slave.cpp:5024] Received oversubscribable
> resources  from the resource estimator
> I0704 18:30:12.025604 28188 slave.cpp:839] Agent terminating
> [       OK ] Endpoint/SlaveEndpointTest.AuthorizedRequest/2 (23 ms)
> [ RUN      ] Endpoint/SlaveEndpointTest.UnauthorizedRequest/0
> I0704 18:30:12.035986 28164 containerizer.cpp:196] Using isolation:
> posix/cpu,posix/mem,filesystem/posix,network/cni
> W0704 18:30:12.036847 28164 backend.cpp:75] Failed to create 'aufs'
> backend: AufsBackend requires root privileges, but is running as user mesos
> W0704 18:30:12.037029 28164 backend.cpp:75] Failed to create 'bind'
> backend: BindBackend requires root privileges
> I0704 18:30:12.040791 28198 slave.cpp:203] Agent started on 543)@
> 172.17.0.2:41465
> I0704 18:30:12.040822 28198 slave.cpp:204] Flags at startup: --acls=""
> --appc_simple_discovery_uri_prefix="http://"
> --appc_store_dir="/tmp/mesos/store/appc" --authenticate_http="true"
> --authenticatee="crammd5" --authorizer="local"
> --cgroups_cpu_enable_pids_and_tids_count="false"
> --cgroups_enable_cfs="false" --cgroups_hierarchy="/sys/fs/cgroup"
> --cgroups_limit_swap="false" --cgroups_root="mesos"
> --container_disk_watch_interval="15secs" --containerizers="mesos"
> --credential="/tmp/Endpoint_SlaveEndpointTest_UnauthorizedRequest_0_Qf1ewK/credential"
> --default_role="*" --disk_watch_interval="1mins" --docker="docker"
> --docker_kill_orphans="true" --docker_registry="
> https://registry-1.docker.io" --docker_remove_delay="6hrs"
> --docker_socket="/var/run/docker.sock" --docker_stop_timeout="0ns"
> --docker_store_dir="/tmp/mesos/store/docker"
> --docker_volume_checkpoint_dir="/var/run/mesos/isolators/docker/volume"
> --enforce_container_disk_quota="false"
> --executor_registration_timeout="1mins"
> --executor_shutdown_grace_period="5secs"
> --fetcher_cache_dir="/tmp/Endpoint_SlaveEndpointTest_UnauthorizedRequest_0_Qf1ewK/fetch"
> --fetcher_cache_size="2GB" --frameworks_home="" --gc_delay="1weeks"
> --gc_disk_headroom="0.1" --hadoop_home="" --help="true"
> --hostname_lookup="true" --http_authenticators="basic"
> --http_command_executor="false"
> --http_credentials="/tmp/Endpoint_SlaveEndpointTest_UnauthorizedRequest_0_Qf1ewK/http_credentials"
> --image_provisioner_backend="copy" --initialize_driver_logging="true"
> --isolation="posix/cpu,posix/mem"
> --launcher_dir="/mesos/mesos-1.0.0/_build/src" --logbufsecs="0"
> --logging_level="INFO" --oversubscribed_resources_interval="15secs"
> --perf_duration="10secs" --perf_interval="1mins"
> --qos_correction_interval_min="0ns" --quiet="false" --recover="reconnect"
> --recovery_timeout="15mins" --registration_backoff_factor="10ms"
> --resources="cpus:2;gpus:0;mem:1024;disk:1024;ports:[31000-32000]"
> --revocable_cpu_low_priority="true"
> --sandbox_directory="/mnt/mesos/sandbox" --strict="true"
> --switch_user="true" --systemd_enable_support="true"
> --systemd_runtime_directory="/run/systemd/system" --version="false"
> --work_dir="/tmp/Endpoint_SlaveEndpointTest_UnauthorizedRequest_0_Qf1ewK"
> I0704 18:30:12.041416 28198 credentials.hpp:86] Loading credential for
> authentication from
> '/tmp/Endpoint_SlaveEndpointTest_UnauthorizedRequest_0_Qf1ewK/credential'
> I0704 18:30:12.041592 28198 slave.cpp:341] Agent using credential for:
> test-principal
> I0704 18:30:12.041625 28198 credentials.hpp:37] Loading credentials for
> authentication from
> '/tmp/Endpoint_SlaveEndpointTest_UnauthorizedRequest_0_Qf1ewK/http_credentials'
> I0704 18:30:12.041877 28198 slave.cpp:393] Using default 'basic' HTTP
> authenticator
> I0704 18:30:12.042163 28198 resources.cpp:572] Parsing resources as JSON
> failed: cpus:2;gpus:0;mem:1024;disk:1024;ports:[31000-32000]
> Trying semicolon-delimited string format instead
> I0704 18:30:12.042498 28198 resources.cpp:572] Parsing resources as JSON
> failed: cpus:2;gpus:0;mem:1024;disk:1024;ports:[31000-32000]
> Trying semicolon-delimited string format instead
> I0704 18:30:12.042822 28198 slave.cpp:592] Agent resources: cpus(*):2;
> mem(*):1024; disk(*):1024; ports(*):[31000-32000]
> I0704 18:30:12.042873 28198 slave.cpp:600] Agent attributes: [  ]
> I0704 18:30:12.042882 28198 slave.cpp:605] Agent hostname: ac08071de0bc
> I0704 18:30:12.043853 28190 state.cpp:57] Recovering state from
> '/tmp/Endpoint_SlaveEndpointTest_UnauthorizedRequest_0_Qf1ewK/meta'
> I0704 18:30:12.043895 28198 process.cpp:3322] Handling HTTP event for
> process 'slave(543)' with path: '/slave(543)/monitor/statistics'
> I0704 18:30:12.044464 28194 status_update_manager.cpp:200] Recovering
> status update manager
> I0704 18:30:12.044756 28198 containerizer.cpp:522] Recovering containerizer
> I0704 18:30:12.044845 28186 http.cpp:765] Authorizing principal
> 'test-principal' to GET the '/monitor/statistics' endpoint
> I0704 18:30:12.046064 28196 provisioner.cpp:253] Provisioner recovery
> complete
> I0704 18:30:12.046385 28183 slave.cpp:4838] Finished recovery
> I0704 18:30:12.046872 28183 slave.cpp:5010] Querying resource estimator
> for oversubscribable resources
> I0704 18:30:12.047003 28183 slave.cpp:5024] Received oversubscribable
> resources  from the resource estimator
> I0704 18:30:12.047338 28191 slave.cpp:839] Agent terminating
> [       OK ] Endpoint/SlaveEndpointTest.UnauthorizedRequest/0 (20 ms)
> [ RUN      ] Endpoint/SlaveEndpointTest.UnauthorizedRequest/1
> I0704 18:30:12.054474 28164 containerizer.cpp:196] Using isolation:
> posix/cpu,posix/mem,filesystem/posix,network/cni
> W0704 18:30:12.055261 28164 backend.cpp:75] Failed to create 'aufs'
> backend: AufsBackend requires root privileges, but is running as user mesos
> W0704 18:30:12.055441 28164 backend.cpp:75] Failed to create 'bind'
> backend: BindBackend requires root privileges
> I0704 18:30:12.059015 28184 slave.cpp:203] Agent started on 544)@
> 172.17.0.2:41465
> I0704 18:30:12.059043 28184 slave.cpp:204] Flags at startup: --acls=""
> --appc_simple_discovery_uri_prefix="http://"
> --appc_store_dir="/tmp/mesos/store/appc" --authenticate_http="true"
> --authenticatee="crammd5" --authorizer="local"
> --cgroups_cpu_enable_pids_and_tids_count="false"
> --cgroups_enable_cfs="false" --cgroups_hierarchy="/sys/fs/cgroup"
> --cgroups_limit_swap="false" --cgroups_root="mesos"
> --container_disk_watch_interval="15secs" --containerizers="mesos"
> --credential="/tmp/Endpoint_SlaveEndpointTest_UnauthorizedRequest_1_iarfpR/credential"
> --default_role="*" --disk_watch_interval="1mins" --docker="docker"
> --docker_kill_orphans="true" --docker_registry="
> https://registry-1.docker.io" --docker_remove_delay="6hrs"
> --docker_socket="/var/run/docker.sock" --docker_stop_timeout="0ns"
> --docker_store_dir="/tmp/mesos/store/docker"
> --docker_volume_checkpoint_dir="/var/run/mesos/isolators/docker/volume"
> --enforce_container_disk_quota="false"
> --executor_registration_timeout="1mins"
> --executor_shutdown_grace_period="5secs"
> --fetcher_cache_dir="/tmp/Endpoint_SlaveEndpointTest_UnauthorizedRequest_1_iarfpR/fetch"
> --fetcher_cache_size="2GB" --frameworks_home="" --gc_delay="1weeks"
> --gc_disk_headroom="0.1" --hadoop_home="" --help="true"
> --hostname_lookup="true" --http_authenticators="basic"
> --http_command_executor="false"
> --http_credentials="/tmp/Endpoint_SlaveEndpointTest_UnauthorizedRequest_1_iarfpR/http_credentials"
> --image_provisioner_backend="copy" --initialize_driver_logging="true"
> --isolation="posix/cpu,posix/mem"
> --launcher_dir="/mesos/mesos-1.0.0/_build/src" --logbufsecs="0"
> --logging_level="INFO" --oversubscribed_resources_interval="15secs"
> --perf_duration="10secs" --perf_interval="1mins"
> --qos_correction_interval_min="0ns" --quiet="false" --recover="reconnect"
> --recovery_timeout="15mins" --registration_backoff_factor="10ms"
> --resources="cpus:2;gpus:0;mem:1024;disk:1024;ports:[31000-32000]"
> --revocable_cpu_low_priority="true"
> --sandbox_directory="/mnt/mesos/sandbox" --strict="true"
> --switch_user="true" --systemd_enable_support="true"
> --systemd_runtime_directory="/run/systemd/system" --version="false"
> --work_dir="/tmp/Endpoint_SlaveEndpointTest_UnauthorizedRequest_1_iarfpR"
> I0704 18:30:12.059626 28184 credentials.hpp:86] Loading credential for
> authentication from
> '/tmp/Endpoint_SlaveEndpointTest_UnauthorizedRequest_1_iarfpR/credential'
> I0704 18:30:12.059805 28184 slave.cpp:341] Agent using credential for:
> test-principal
> I0704 18:30:12.059842 28184 credentials.hpp:37] Loading credentials for
> authentication from
> '/tmp/Endpoint_SlaveEndpointTest_UnauthorizedRequest_1_iarfpR/http_credentials'
> I0704 18:30:12.060127 28184 slave.cpp:393] Using default 'basic' HTTP
> authenticator
> I0704 18:30:12.060621 28184 resources.cpp:572] Parsing resources as JSON
> failed: cpus:2;gpus:0;mem:1024;disk:1024;ports:[31000-32000]
> Trying semicolon-delimited string format instead
> I0704 18:30:12.060981 28184 resources.cpp:572] Parsing resources as JSON
> failed: cpus:2;gpus:0;mem:1024;disk:1024;ports:[31000-32000]
> Trying semicolon-delimited string format instead
> I0704 18:30:12.061491 28184 slave.cpp:592] Agent resources: cpus(*):2;
> mem(*):1024; disk(*):1024; ports(*):[31000-32000]
> I0704 18:30:12.061565 28184 slave.cpp:600] Agent attributes: [  ]
> I0704 18:30:12.061579 28184 slave.cpp:605] Agent hostname: ac08071de0bc
> I0704 18:30:12.063005 28196 state.cpp:57] Recovering state from
> '/tmp/Endpoint_SlaveEndpointTest_UnauthorizedRequest_1_iarfpR/meta'
> I0704 18:30:12.063048 28184 process.cpp:3322] Handling HTTP event for
> process 'slave(544)' with path: '/slave(544)/monitor/statistics.json'
> I0704 18:30:12.063570 28198 status_update_manager.cpp:200] Recovering
> status update manager
> I0704 18:30:12.063825 28197 containerizer.cpp:522] Recovering containerizer
> I0704 18:30:12.064079 28187 http.cpp:765] Authorizing principal
> 'test-principal' to GET the '/monitor/statistics.json' endpoint
> I0704 18:30:12.065471 28183 provisioner.cpp:253] Provisioner recovery
> complete
> I0704 18:30:12.065968 28187 slave.cpp:4838] Finished recovery
> I0704 18:30:12.066700 28187 slave.cpp:5010] Querying resource estimator
> for oversubscribable resources
> I0704 18:30:12.067021 28198 slave.cpp:5024] Received oversubscribable
> resources  from the resource estimator
> I0704 18:30:12.067116 28198 slave.cpp:839] Agent terminating
> [       OK ] Endpoint/SlaveEndpointTest.UnauthorizedRequest/1 (21 ms)
> [ RUN      ] Endpoint/SlaveEndpointTest.UnauthorizedRequest/2
> I0704 18:30:12.076349 28164 containerizer.cpp:196] Using isolation:
> posix/cpu,posix/mem,filesystem/posix,network/cni
> W0704 18:30:12.077138 28164 backend.cpp:75] Failed to create 'aufs'
> backend: AufsBackend requires root privileges, but is running as user mesos
> W0704 18:30:12.077337 28164 backend.cpp:75] Failed to create 'bind'
> backend: BindBackend requires root privileges
> I0704 18:30:12.080318 28184 slave.cpp:203] Agent started on 545)@
> 172.17.0.2:41465
> I0704 18:30:12.080353 28184 slave.cpp:204] Flags at startup: --acls=""
> --appc_simple_discovery_uri_prefix="http://"
> --appc_store_dir="/tmp/mesos/store/appc" --authenticate_http="true"
> --authenticatee="crammd5" --authorizer="local"
> --cgroups_cpu_enable_pids_and_tids_count="false"
> --cgroups_enable_cfs="false" --cgroups_hierarchy="/sys/fs/cgroup"
> --cgroups_limit_swap="false" --cgroups_root="mesos"
> --container_disk_watch_interval="15secs" --containerizers="mesos"
> --credential="/tmp/Endpoint_SlaveEndpointTest_UnauthorizedRequest_2_GViqsY/credential"
> --default_role="*" --disk_watch_interval="1mins" --docker="docker"
> --docker_kill_orphans="true" --docker_registry="
> https://registry-1.docker.io" --docker_remove_delay="6hrs"
> --docker_socket="/var/run/docker.sock" --docker_stop_timeout="0ns"
> --docker_store_dir="/tmp/mesos/store/docker"
> --docker_volume_checkpoint_dir="/var/run/mesos/isolators/docker/volume"
> --enforce_container_disk_quota="false"
> --executor_registration_timeout="1mins"
> --executor_shutdown_grace_period="5secs"
> --fetcher_cache_dir="/tmp/Endpoint_SlaveEndpointTest_UnauthorizedRequest_2_GViqsY/fetch"
> --fetcher_cache_size="2GB" --frameworks_home="" --gc_delay="1weeks"
> --gc_disk_headroom="0.1" --hadoop_home="" --help="true"
> --hostname_lookup="true" --http_authenticators="basic"
> --http_command_executor="false"
> --http_credentials="/tmp/Endpoint_SlaveEndpointTest_UnauthorizedRequest_2_GViqsY/http_credentials"
> --image_provisioner_backend="copy" --initialize_driver_logging="true"
> --isolation="posix/cpu,posix/mem"
> --launcher_dir="/mesos/mesos-1.0.0/_build/src" --logbufsecs="0"
> --logging_level="INFO" --oversubscribed_resources_interval="15secs"
> --perf_duration="10secs" --perf_interval="1mins"
> --qos_correction_interval_min="0ns" --quiet="false" --recover="reconnect"
> --recovery_timeout="15mins" --registration_backoff_factor="10ms"
> --resources="cpus:2;gpus:0;mem:1024;disk:1024;ports:[31000-32000]"
> --revocable_cpu_low_priority="true"
> --sandbox_directory="/mnt/mesos/sandbox" --strict="true"
> --switch_user="true" --systemd_enable_support="true"
> --systemd_runtime_directory="/run/systemd/system" --version="false"
> --work_dir="/tmp/Endpoint_SlaveEndpointTest_UnauthorizedRequest_2_GViqsY"
> I0704 18:30:12.080992 28184 credentials.hpp:86] Loading credential for
> authentication from
> '/tmp/Endpoint_SlaveEndpointTest_UnauthorizedRequest_2_GViqsY/credential'
> I0704 18:30:12.081173 28184 slave.cpp:341] Agent using credential for:
> test-principal
> I0704 18:30:12.081209 28184 credentials.hpp:37] Loading credentials for
> authentication from
> '/tmp/Endpoint_SlaveEndpointTest_UnauthorizedRequest_2_GViqsY/http_credentials'
> I0704 18:30:12.081529 28184 slave.cpp:393] Using default 'basic' HTTP
> authenticator
> I0704 18:30:12.082062 28184 resources.cpp:572] Parsing resources as JSON
> failed: cpus:2;gpus:0;mem:1024;disk:1024;ports:[31000-32000]
> Trying semicolon-delimited string format instead
> I0704 18:30:12.082482 28184 resources.cpp:572] Parsing resources as JSON
> failed: cpus:2;gpus:0;mem:1024;disk:1024;ports:[31000-32000]
> Trying semicolon-delimited string format instead
> I0704 18:30:12.082846 28184 slave.cpp:592] Agent resources: cpus(*):2;
> mem(*):1024; disk(*):1024; ports(*):[31000-32000]
> I0704 18:30:12.082901 28184 slave.cpp:600] Agent attributes: [  ]
> I0704 18:30:12.082916 28184 slave.cpp:605] Agent hostname: ac08071de0bc
> I0704 18:30:12.083947 28191 state.cpp:57] Recovering state from
> '/tmp/Endpoint_SlaveEndpointTest_UnauthorizedRequest_2_GViqsY/meta'
> I0704 18:30:12.084002 28184 process.cpp:3322] Handling HTTP event for
> process 'slave(545)' with path: '/slave(545)/containers'
> I0704 18:30:12.084489 28186 status_update_manager.cpp:200] Recovering
> status update manager
> I0704 18:30:12.084723 28197 containerizer.cpp:522] Recovering containerizer
> I0704 18:30:12.084934 28191 http.cpp:765] Authorizing principal
> 'test-principal' to GET the '/containers' endpoint
> I0704 18:30:12.085944 28185 provisioner.cpp:253] Provisioner recovery
> complete
> I0704 18:30:12.086221 28197 slave.cpp:4838] Finished recovery
> I0704 18:30:12.086695 28197 slave.cpp:5010] Querying resource estimator
> for oversubscribable resources
> I0704 18:30:12.086995 28191 slave.cpp:5024] Received oversubscribable
> resources  from the resource estimator
> I0704 18:30:12.087692 28184 slave.cpp:839] Agent terminating
> [       OK ] Endpoint/SlaveEndpointTest.UnauthorizedRequest/2 (19 ms)
> [ RUN      ] Endpoint/SlaveEndpointTest.NoAuthorizer/0
> I0704 18:30:12.096413 28164 containerizer.cpp:196] Using isolation:
> posix/cpu,posix/mem,filesystem/posix,network/cni
> W0704 18:30:12.097018 28164 backend.cpp:75] Failed to create 'aufs'
> backend: AufsBackend requires root privileges, but is running as user mesos
> W0704 18:30:12.097149 28164 backend.cpp:75] Failed to create 'bind'
> backend: BindBackend requires root privileges
> I0704 18:30:12.098528 28164 cluster.cpp:432] Creating default 'local'
> authorizer
> I0704 18:30:12.100030 28187 slave.cpp:203] Agent started on 546)@
> 172.17.0.2:41465
> I0704 18:30:12.100054 28187 slave.cpp:204] Flags at startup: --acls=""
> --appc_simple_discovery_uri_prefix="http://"
> --appc_store_dir="/tmp/mesos/store/appc" --authenticate_http="true"
> --authenticatee="crammd5" --authorizer="local"
> --cgroups_cpu_enable_pids_and_tids_count="false"
> --cgroups_enable_cfs="false" --cgroups_hierarchy="/sys/fs/cgroup"
> --cgroups_limit_swap="false" --cgroups_root="mesos"
> --container_disk_watch_interval="15secs" --containerizers="mesos"
> --credential="/tmp/Endpoint_SlaveEndpointTest_NoAuthorizer_0_68BaF5/credential"
> --default_role="*" --disk_watch_interval="1mins" --docker="docker"
> --docker_kill_orphans="true" --docker_registry="
> https://registry-1.docker.io" --docker_remove_delay="6hrs"
> --docker_socket="/var/run/docker.sock" --docker_stop_timeout="0ns"
> --docker_store_dir="/tmp/mesos/store/docker"
> --docker_volume_checkpoint_dir="/var/run/mesos/isolators/docker/volume"
> --enforce_container_disk_quota="false"
> --executor_registration_timeout="1mins"
> --executor_shutdown_grace_period="5secs"
> --fetcher_cache_dir="/tmp/Endpoint_SlaveEndpointTest_NoAuthorizer_0_68BaF5/fetch"
> --fetcher_cache_size="2GB" --frameworks_home="" --gc_delay="1weeks"
> --gc_disk_headroom="0.1" --hadoop_home="" --help="false"
> --hostname_lookup="true" --http_authenticators="basic"
> --http_command_executor="false"
> --http_credentials="/tmp/Endpoint_SlaveEndpointTest_NoAuthorizer_0_68BaF5/http_credentials"
> --image_provisioner_backend="copy" --initialize_driver_logging="true"
> --isolation="posix/cpu,posix/mem"
> --launcher_dir="/mesos/mesos-1.0.0/_build/src" --logbufsecs="0"
> --logging_level="INFO" --oversubscribed_resources_interval="15secs"
> --perf_duration="10secs" --perf_interval="1mins"
> --qos_correction_interval_min="0ns" --quiet="false" --recover="reconnect"
> --recovery_timeout="15mins" --registration_backoff_factor="10ms"
> --resources="cpus:2;gpus:0;mem:1024;disk:1024;ports:[31000-32000]"
> --revocable_cpu_low_priority="true"
> --sandbox_directory="/mnt/mesos/sandbox" --strict="true"
> --switch_user="true" --systemd_enable_support="true"
> --systemd_runtime_directory="/run/systemd/system" --version="false"
> --work_dir="/tmp/Endpoint_SlaveEndpointTest_NoAuthorizer_0_68BaF5"
> I0704 18:30:12.100507 28187 credentials.hpp:86] Loading credential for
> authentication from
> '/tmp/Endpoint_SlaveEndpointTest_NoAuthorizer_0_68BaF5/credential'
> I0704 18:30:12.100661 28187 slave.cpp:341] Agent using credential for:
> test-principal
> I0704 18:30:12.100695 28187 credentials.hpp:37] Loading credentials for
> authentication from
> '/tmp/Endpoint_SlaveEndpointTest_NoAuthorizer_0_68BaF5/http_credentials'
> I0704 18:30:12.100941 28187 slave.cpp:393] Using default 'basic' HTTP
> authenticator
> I0704 18:30:12.101469 28187 resources.cpp:572] Parsing resources as JSON
> failed: cpus:2;gpus:0;mem:1024;disk:1024;ports:[31000-32000]
> Trying semicolon-delimited string format instead
> I0704 18:30:12.101893 28187 resources.cpp:572] Parsing resources as JSON
> failed: cpus:2;gpus:0;mem:1024;disk:1024;ports:[31000-32000]
> Trying semicolon-delimited string format instead
> I0704 18:30:12.102421 28187 slave.cpp:592] Agent resources: cpus(*):2;
> mem(*):1024; disk(*):1024; ports(*):[31000-32000]
> I0704 18:30:12.102504 28187 slave.cpp:600] Agent attributes: [  ]
> I0704 18:30:12.102520 28187 slave.cpp:605] Agent hostname: ac08071de0bc
> I0704 18:30:12.103529 28194 state.cpp:57] Recovering state from
> '/tmp/Endpoint_SlaveEndpointTest_NoAuthorizer_0_68BaF5/meta'
> I0704 18:30:12.103549 28187 process.cpp:3322] Handling HTTP event for
> process 'slave(546)' with path: '/slave(546)/monitor/statistics'
> I0704 18:30:12.103941 28185 status_update_manager.cpp:200] Recovering
> status update manager
> I0704 18:30:12.104153 28198 containerizer.cpp:522] Recovering containerizer
> I0704 18:30:12.104218 28189 http.cpp:765] Authorizing principal
> 'test-principal' to GET the '/monitor/statistics' endpoint
> I0704 18:30:12.105217 28192 provisioner.cpp:253] Provisioner recovery
> complete
> I0704 18:30:12.105734 28184 slave.cpp:4838] Finished recovery
> I0704 18:30:12.106184 28184 slave.cpp:5010] Querying resource estimator
> for oversubscribable resources
> I0704 18:30:12.106375 28197 slave.cpp:5024] Received oversubscribable
> resources  from the resource estimator
> I0704 18:30:12.107847 28194 slave.cpp:839] Agent terminating
> [       OK ] Endpoint/SlaveEndpointTest.NoAuthorizer/0 (20 ms)
> [ RUN      ] Endpoint/SlaveEndpointTest.NoAuthorizer/1
> I0704 18:30:12.117621 28164 containerizer.cpp:196] Using isolation:
> posix/cpu,posix/mem,filesystem/posix,network/cni
> W0704 18:30:12.118471 28164 backend.cpp:75] Failed to create 'aufs'
> backend: AufsBackend requires root privileges, but is running as user mesos
> W0704 18:30:12.118676 28164 backend.cpp:75] Failed to create 'bind'
> backend: BindBackend requires root privileges
> I0704 18:30:12.120509 28164 cluster.cpp:432] Creating default 'local'
> authorizer
> I0704 18:30:12.122670 28187 slave.cpp:203] Agent started on 547)@
> 172.17.0.2:41465
> I0704 18:30:12.122697 28187 slave.cpp:204] Flags at startup: --acls=""
> --appc_simple_discovery_uri_prefix="http://"
> --appc_store_dir="/tmp/mesos/store/appc" --authenticate_http="true"
> --authenticatee="crammd5" --authorizer="local"
> --cgroups_cpu_enable_pids_and_tids_count="false"
> --cgroups_enable_cfs="false" --cgroups_hierarchy="/sys/fs/cgroup"
> --cgroups_limit_swap="false" --cgroups_root="mesos"
> --container_disk_watch_interval="15secs" --containerizers="mesos"
> --credential="/tmp/Endpoint_SlaveEndpointTest_NoAuthorizer_1_IZBW1c/credential"
> --default_role="*" --disk_watch_interval="1mins" --docker="docker"
> --docker_kill_orphans="true" --docker_registry="
> https://registry-1.docker.io" --docker_remove_delay="6hrs"
> --docker_socket="/var/run/docker.sock" --docker_stop_timeout="0ns"
> --docker_store_dir="/tmp/mesos/store/docker"
> --docker_volume_checkpoint_dir="/var/run/mesos/isolators/docker/volume"
> --enforce_container_disk_quota="false"
> --executor_registration_timeout="1mins"
> --executor_shutdown_grace_period="5secs"
> --fetcher_cache_dir="/tmp/Endpoint_SlaveEndpointTest_NoAuthorizer_1_IZBW1c/fetch"
> --fetcher_cache_size="2GB" --frameworks_home="" --gc_delay="1weeks"
> --gc_disk_headroom="0.1" --hadoop_home="" --help="false"
> --hostname_lookup="true" --http_authenticators="basic"
> --http_command_executor="false"
> --http_credentials="/tmp/Endpoint_SlaveEndpointTest_NoAuthorizer_1_IZBW1c/http_credentials"
> --image_provisioner_backend="copy" --initialize_driver_logging="true"
> --isolation="posix/cpu,posix/mem"
> --launcher_dir="/mesos/mesos-1.0.0/_build/src" --logbufsecs="0"
> --logging_level="INFO" --oversubscribed_resources_interval="15secs"
> --perf_duration="10secs" --perf_interval="1mins"
> --qos_correction_interval_min="0ns" --quiet="false" --recover="reconnect"
> --recovery_timeout="15mins" --registration_backoff_factor="10ms"
> --resources="cpus:2;gpus:0;mem:1024;disk:1024;ports:[31000-32000]"
> --revocable_cpu_low_priority="true"
> --sandbox_directory="/mnt/mesos/sandbox" --strict="true"
> --switch_user="true" --systemd_enable_support="true"
> --systemd_runtime_directory="/run/systemd/system" --version="false"
> --work_dir="/tmp/Endpoint_SlaveEndpointTest_NoAuthorizer_1_IZBW1c"
> I0704 18:30:12.123250 28187 credentials.hpp:86] Loading credential for
> authentication from
> '/tmp/Endpoint_SlaveEndpointTest_NoAuthorizer_1_IZBW1c/credential'
> I0704 18:30:12.123435 28187 slave.cpp:341] Agent using credential for:
> test-principal
> I0704 18:30:12.123479 28187 credentials.hpp:37] Loading credentials for
> authentication from
> '/tmp/Endpoint_SlaveEndpointTest_NoAuthorizer_1_IZBW1c/http_credentials'
> I0704 18:30:12.123797 28187 slave.cpp:393] Using default 'basic' HTTP
> authenticator
> I0704 18:30:12.124191 28187 resources.cpp:572] Parsing resources as JSON
> failed: cpus:2;gpus:0;mem:1024;disk:1024;ports:[31000-32000]
> Trying semicolon-delimited string format instead
> I0704 18:30:12.124560 28187 resources.cpp:572] Parsing resources as JSON
> failed: cpus:2;gpus:0;mem:1024;disk:1024;ports:[31000-32000]
> Trying semicolon-delimited string format instead
> I0704 18:30:12.125026 28187 slave.cpp:592] Agent resources: cpus(*):2;
> mem(*):1024; disk(*):1024; ports(*):[31000-32000]
> I0704 18:30:12.125102 28187 slave.cpp:600] Agent attributes: [  ]
> I0704 18:30:12.125125 28187 slave.cpp:605] Agent hostname: ac08071de0bc
> I0704 18:30:12.126554 28189 state.cpp:57] Recovering state from
> '/tmp/Endpoint_SlaveEndpointTest_NoAuthorizer_1_IZBW1c/meta'
> I0704 18:30:12.126646 28187 process.cpp:3322] Handling HTTP event for
> process 'slave(547)' with path: '/slave(547)/monitor/statistics.json'
> I0704 18:30:12.127354 28197 status_update_manager.cpp:200] Recovering
> status update manager
> I0704 18:30:12.127638 28192 containerizer.cpp:522] Recovering containerizer
> I0704 18:30:12.127807 28188 http.cpp:765] Authorizing principal
> 'test-principal' to GET the '/monitor/statistics.json' endpoint
> I0704 18:30:12.129140 28193 provisioner.cpp:253] Provisioner recovery
> complete
> I0704 18:30:12.129549 28184 slave.cpp:4838] Finished recovery
> I0704 18:30:12.130100 28184 slave.cpp:5010] Querying resource estimator
> for oversubscribable resources
> I0704 18:30:12.130287 28185 slave.cpp:5024] Received oversubscribable
> resources  from the resource estimator
> I0704 18:30:12.131091 28198 slave.cpp:839] Agent terminating
> [       OK ] Endpoint/SlaveEndpointTest.NoAuthorizer/1 (22 ms)
> [ RUN      ] Endpoint/SlaveEndpointTest.NoAuthorizer/2
> I0704 18:30:12.141939 28164 containerizer.cpp:196] Using isolation:
> posix/cpu,posix/mem,filesystem/posix,network/cni
> W0704 18:30:12.142822 28164 backend.cpp:75] Failed to create 'aufs'
> backend: AufsBackend requires root privileges, but is running as user mesos
> W0704 18:30:12.142977 28164 backend.cpp:75] Failed to create 'bind'
> backend: BindBackend requires root privileges
> I0704 18:30:12.145159 28164 cluster.cpp:432] Creating default 'local'
> authorizer
> I0704 18:30:12.147248 28192 slave.cpp:203] Agent started on 548)@
> 172.17.0.2:41465
> I0704 18:30:12.147274 28192 slave.cpp:204] Flags at startup: --acls=""
> --appc_simple_discovery_uri_prefix="http://"
> --appc_store_dir="/tmp/mesos/store/appc" --authenticate_http="true"
> --authenticatee="crammd5" --authorizer="local"
> --cgroups_cpu_enable_pids_and_tids_count="false"
> --cgroups_enable_cfs="false" --cgroups_hierarchy="/sys/fs/cgroup"
> --cgroups_limit_swap="false" --cgroups_root="mesos"
> --container_disk_watch_interval="15secs" --containerizers="mesos"
> --credential="/tmp/Endpoint_SlaveEndpointTest_NoAuthorizer_2_go9gAk/credential"
> --default_role="*" --disk_watch_interval="1mins" --docker="docker"
> --docker_kill_orphans="true" --docker_registry="
> https://registry-1.docker.io" --docker_remove_delay="6hrs"
> --docker_socket="/var/run/docker.sock" --docker_stop_timeout="0ns"
> --docker_store_dir="/tmp/mesos/store/docker"
> --docker_volume_checkpoint_dir="/var/run/mesos/isolators/docker/volume"
> --enforce_container_disk_quota="false"
> --executor_registration_timeout="1mins"
> --executor_shutdown_grace_period="5secs"
> --fetcher_cache_dir="/tmp/Endpoint_SlaveEndpointTest_NoAuthorizer_2_go9gAk/fetch"
> --fetcher_cache_size="2GB" --frameworks_home="" --gc_delay="1weeks"
> --gc_disk_headroom="0.1" --hadoop_home="" --help="false"
> --hostname_lookup="true" --http_authenticators="basic"
> --http_command_executor="false"
> --http_credentials="/tmp/Endpoint_SlaveEndpointTest_NoAuthorizer_2_go9gAk/http_credentials"
> --image_provisioner_backend="copy" --initialize_driver_logging="true"
> --isolation="posix/cpu,posix/mem"
> --launcher_dir="/mesos/mesos-1.0.0/_build/src" --logbufsecs="0"
> --logging_level="INFO" --oversubscribed_resources_interval="15secs"
> --perf_duration="10secs" --perf_interval="1mins"
> --qos_correction_interval_min="0ns" --quiet="false" --recover="reconnect"
> --recovery_timeout="15mins" --registration_backoff_factor="10ms"
> --resources="cpus:2;gpus:0;mem:1024;disk:1024;ports:[31000-32000]"
> --revocable_cpu_low_priority="true"
> --sandbox_directory="/mnt/mesos/sandbox" --strict="true"
> --switch_user="true" --systemd_enable_support="true"
> --systemd_runtime_directory="/run/systemd/system" --version="false"
> --work_dir="/tmp/Endpoint_SlaveEndpointTest_NoAuthorizer_2_go9gAk"
> I0704 18:30:12.147845 28192 credentials.hpp:86] Loading credential for
> authentication from
> '/tmp/Endpoint_SlaveEndpointTest_NoAuthorizer_2_go9gAk/credential'
> I0704 18:30:12.148020 28192 slave.cpp:341] Agent using credential for:
> test-principal
> I0704 18:30:12.148058 28192 credentials.hpp:37] Loading credentials for
> authentication from
> '/tmp/Endpoint_SlaveEndpointTest_NoAuthorizer_2_go9gAk/http_credentials'
> I0704 18:30:12.148335 28192 slave.cpp:393] Using default 'basic' HTTP
> authenticator
> I0704 18:30:12.148792 28192 resources.cpp:572] Parsing resources as JSON
> failed: cpus:2;gpus:0;mem:1024;disk:1024;ports:[31000-32000]
> Trying semicolon-delimited string format instead
> I0704 18:30:12.149168 28192 resources.cpp:572] Parsing resources as JSON
> failed: cpus:2;gpus:0;mem:1024;disk:1024;ports:[31000-32000]
> Trying semicolon-delimited string format instead
> I0704 18:30:12.149689 28192 slave.cpp:592] Agent resources: cpus(*):2;
> mem(*):1024; disk(*):1024; ports(*):[31000-32000]
> I0704 18:30:12.149762 28192 slave.cpp:600] Agent attributes: [  ]
> I0704 18:30:12.149776 28192 slave.cpp:605] Agent hostname: ac08071de0bc
> I0704 18:30:12.151196 28197 state.cpp:57] Recovering state from
> '/tmp/Endpoint_SlaveEndpointTest_NoAuthorizer_2_go9gAk/meta'
> I0704 18:30:12.151262 28192 process.cpp:3322] Handling HTTP event for
> process 'slave(548)' with path: '/slave(548)/containers'
> I0704 18:30:12.151885 28198 status_update_manager.cpp:200] Recovering
> status update manager
> I0704 18:30:12.152035 28195 containerizer.cpp:522] Recovering containerizer
> I0704 18:30:12.152431 28193 http.cpp:765] Authorizing principal
> 'test-principal' to GET the '/containers' endpoint
> I0704 18:30:12.153421 28194 provisioner.cpp:253] Provisioner recovery
> complete
> I0704 18:30:12.153666 28184 slave.cpp:4838] Finished recovery
> I0704 18:30:12.154168 28184 slave.cpp:5010] Querying resource estimator
> for oversubscribable resources
> I0704 18:30:12.154461 28198 slave.cpp:5024] Received oversubscribable
> resources  from the resource estimator
> I0704 18:30:12.155717 28197 slave.cpp:839] Agent terminating
> [       OK ] Endpoint/SlaveEndpointTest.NoAuthorizer/2 (24 ms)
> [----------] 9 tests from Endpoint/SlaveEndpointTest (195 ms total)
>
> [----------] Global test environment tear-down
> [==========] 1219 tests from 139 test cases ran. (370125 ms total)
> [  PASSED  ] 1218 tests.
> [  FAILED  ] 1 test, listed below:
> [  FAILED  ] DiskQuotaTest.SlaveRecovery
>
>  1 FAILED TEST
>   YOU HAVE 6 DISABLED TESTS
>
> make[4]: *** [check-local] Error 1
> make[4]: Leaving directory `/mesos/mesos-1.0.0/_build/src'
> make[3]: *** [check-am] Error 2
> make[3]: Leaving directory `/mesos/mesos-1.0.0/_build/src'
> make[2]: *** [check] Error 2
> make[2]: Leaving directory `/mesos/mesos-1.0.0/_build/src'
> make[1]: *** [check-recursive] Error 1
> make[1]: Leaving directory `/mesos/mesos-1.0.0/_build'
> make: *** [distcheck] Error 1
> + docker rmi mesos-1467654866-14594
> Untagged: mesos-1467654866-14594:latest
> Deleted: 92760bda188978a8e196fbf4e1210366d13769010def0cccf42aa00175339cdd
> Deleted: feefef545ee395c93ecc4dd42af726563ed0ff993e686cd57aaf7a10d4486ad7
> Deleted: c8566a5f5f9535c9a7bb4e9b977516675f38d57f58396d7ac62c915b67d1e3d9
> Deleted: 0da8f509ee9515e474454178edd6d11870d4a3055184d84cdcf206b5206d3f7e
> Deleted: 05c0db5f877f05542d87ffa117c1e0d3a363965312237682915f50505ec7aeef
> Deleted: 70769ed05beb40780fba723d76e2de94d19bec39fa3122df26e0254660bcc6ab
> Deleted: 9c42935c6c4389ffa1b66a3e9ef1c134d9a2befc2a08cbcfc9944a17e9029fc5
> Deleted: 783f17f063b83898664fb64e700120d2bf412ca28371024244ed02af02c91ecc
> Deleted: 9bd6c2d0da7636926b18326201c6b64bc2697d745ad99201ff4fadfb79326906
> Deleted: 8f0c5d5636df3691821348b2bff6f8c10fe2898f210396bcfebcb7aad67ede0f
> Deleted: 7a4000e9a9b88add7300153439c2cd7e2aa5c8cb4a5d292a5fb669cacd9d2a9d
> Deleted: 77bb8eb2eb2a4ba401d933c18d55fb1e3e315989ea4a77716a3b5a4be30c1e4c
> Deleted: 4e5d1d2f9fc4f6a17e45e82bdd5e3e9438ea6a840bf169a03ab1c656bd4f909b
> Deleted: 4dd91e1d10aa5f9b931678248204a32aac48ce47ff4e4558ec1cabf3bf99b2db
> Deleted: 8de3e16699c9810c2bc145b4c37babd674dae8ee14b2229be59425193f97ec64
> Build step 'Execute shell' marked build as failure
>

Mime
  • Unnamed multipart/alternative (inline, None, 0 bytes)
View raw message