mesos-builds mailing list archives

Site index · List index
Message view « Date » · « Thread »
Top « Date » · « Thread »
From Apache Jenkins Server <jenk...@builds.apache.org>
Subject Build failed in Jenkins: Mesos » autotools,gcc,--verbose,GLOG_v=1 MESOS_VERBOSE=1,centos:7,(docker||Hadoop)&&(!ubuntu-us1)&&(!ubuntu-6) #2475
Date Fri, 08 Jul 2016 15:44:36 GMT
See <https://builds.apache.org/job/Mesos/BUILDTOOL=autotools,COMPILER=gcc,CONFIGURATION=--verbose,ENVIRONMENT=GLOG_v=1%20MESOS_VERBOSE=1,OS=centos%3A7,label_exp=(docker%7C%7CHadoop)&&(!ubuntu-us1)&&(!ubuntu-6)/2475/changes>

Changes:

[vinodkone] Used MESOS_VERSION instead of fixed mesos version string.

------------------------------------------
[...truncated 199188 lines...]
I0708 15:44:36.500687 29161 slave.cpp:607] Agent hostname: 0382d073a49a
I0708 15:44:36.502212 29160 state.cpp:57] Recovering state from '/tmp/Endpoint_SlaveEndpointTest_AuthorizedRequest_1_wQRUXM/meta'
I0708 15:44:36.502292 29161 process.cpp:3322] Handling HTTP event for process 'slave(548)'
with path: '/slave(548)/monitor/statistics.json'
I0708 15:44:36.502779 29158 status_update_manager.cpp:200] Recovering status update manager
I0708 15:44:36.502955 29171 containerizer.cpp:522] Recovering containerizer
I0708 15:44:36.503505 29159 http.cpp:829] Authorizing principal 'test-principal' to GET the
'/monitor/statistics.json' endpoint
I0708 15:44:36.504571 29167 provisioner.cpp:253] Provisioner recovery complete
I0708 15:44:36.505205 29159 slave.cpp:4856] Finished recovery
I0708 15:44:36.505764 29159 slave.cpp:5028] Querying resource estimator for oversubscribable
resources
I0708 15:44:36.506057 29162 slave.cpp:5042] Received oversubscribable resources  from the
resource estimator
I0708 15:44:36.507136 29165 slave.cpp:841] Agent terminating
[       OK ] Endpoint/SlaveEndpointTest.AuthorizedRequest/1 (19 ms)
[ RUN      ] Endpoint/SlaveEndpointTest.AuthorizedRequest/2
I0708 15:44:36.518630 29138 containerizer.cpp:196] Using isolation: posix/cpu,posix/mem,filesystem/posix,network/cni
W0708 15:44:36.519374 29138 backend.cpp:75] Failed to create 'aufs' backend: AufsBackend requires
root privileges, but is running as user mesos
W0708 15:44:36.519531 29138 backend.cpp:75] Failed to create 'bind' backend: BindBackend requires
root privileges
I0708 15:44:36.522722 29164 slave.cpp:205] Agent started on 549)@172.17.0.3:34502
I0708 15:44:36.522743 29164 slave.cpp:206] Flags at startup: --acls="" --appc_simple_discovery_uri_prefix="http://"
--appc_store_dir="/tmp/mesos/store/appc" --authenticate_http="true" --authenticatee="crammd5"
--authentication_backoff_factor="1secs" --authorizer="local" --cgroups_cpu_enable_pids_and_tids_count="false"
--cgroups_enable_cfs="false" --cgroups_hierarchy="/sys/fs/cgroup" --cgroups_limit_swap="false"
--cgroups_root="mesos" --container_disk_watch_interval="15secs" --containerizers="mesos" --credential="/tmp/Endpoint_SlaveEndpointTest_AuthorizedRequest_2_sj5mDI/credential"
--default_role="*" --disk_watch_interval="1mins" --docker="docker" --docker_kill_orphans="true"
--docker_registry="https://registry-1.docker.io" --docker_remove_delay="6hrs" --docker_socket="/var/run/docker.sock"
--docker_stop_timeout="0ns" --docker_store_dir="/tmp/mesos/store/docker" --docker_volume_checkpoint_dir="/var/run/mesos/isolators/docker/volume"
--enforce_container_disk_quota="false" --executor_registration_timeout="1mins" --executor_shutdown_grace_period="5secs"
--fetcher_cache_dir="/tmp/Endpoint_SlaveEndpointTest_AuthorizedRequest_2_sj5mDI/fetch" --fetcher_cache_size="2GB"
--frameworks_home="" --gc_delay="1weeks" --gc_disk_headroom="0.1" --hadoop_home="" --help="true"
--hostname_lookup="true" --http_authenticators="basic" --http_command_executor="false" --http_credentials="/tmp/Endpoint_SlaveEndpointTest_AuthorizedRequest_2_sj5mDI/http_credentials"
--image_provisioner_backend="copy" --initialize_driver_logging="true" --isolation="posix/cpu,posix/mem"
--launcher_dir="/mesos/mesos-1.1.0/_build/src" --logbufsecs="0" --logging_level="INFO" --oversubscribed_resources_interval="15secs"
--perf_duration="10secs" --perf_interval="1mins" --qos_correction_interval_min="0ns" --quiet="false"
--recover="reconnect" --recovery_timeout="15mins" --registration_backoff_factor="10ms" --resources="cpus:2;gpus:0;mem:1024;disk:1024;ports:[31000-32000]"
--revocable_cpu_low_priority="true" --sandbox_directory="/mnt/mesos/sandbox" --strict="true"
--switch_user="true" --systemd_enable_support="true" --systemd_runtime_directory="/run/systemd/system"
--version="false" --work_dir="/tmp/Endpoint_SlaveEndpointTest_AuthorizedRequest_2_sj5mDI"
I0708 15:44:36.523211 29164 credentials.hpp:86] Loading credential for authentication from
'/tmp/Endpoint_SlaveEndpointTest_AuthorizedRequest_2_sj5mDI/credential'
I0708 15:44:36.523386 29164 slave.cpp:343] Agent using credential for: test-principal
I0708 15:44:36.523423 29164 credentials.hpp:37] Loading credentials for authentication from
'/tmp/Endpoint_SlaveEndpointTest_AuthorizedRequest_2_sj5mDI/http_credentials'
I0708 15:44:36.523646 29164 slave.cpp:395] Using default 'basic' HTTP authenticator
I0708 15:44:36.523999 29164 resources.cpp:572] Parsing resources as JSON failed: cpus:2;gpus:0;mem:1024;disk:1024;ports:[31000-32000]
Trying semicolon-delimited string format instead
I0708 15:44:36.524422 29164 resources.cpp:572] Parsing resources as JSON failed: cpus:2;gpus:0;mem:1024;disk:1024;ports:[31000-32000]
Trying semicolon-delimited string format instead
I0708 15:44:36.524777 29164 slave.cpp:594] Agent resources: cpus(*):2; mem(*):1024; disk(*):1024;
ports(*):[31000-32000]
I0708 15:44:36.524835 29164 slave.cpp:602] Agent attributes: [  ]
I0708 15:44:36.524847 29164 slave.cpp:607] Agent hostname: 0382d073a49a
I0708 15:44:36.526101 29162 state.cpp:57] Recovering state from '/tmp/Endpoint_SlaveEndpointTest_AuthorizedRequest_2_sj5mDI/meta'
I0708 15:44:36.526142 29164 process.cpp:3322] Handling HTTP event for process 'slave(549)'
with path: '/slave(549)/containers'
I0708 15:44:36.526716 29165 status_update_manager.cpp:200] Recovering status update manager
I0708 15:44:36.526861 29170 containerizer.cpp:522] Recovering containerizer
I0708 15:44:36.527151 29159 http.cpp:829] Authorizing principal 'test-principal' to GET the
'/containers' endpoint
I0708 15:44:36.528240 29163 provisioner.cpp:253] Provisioner recovery complete
I0708 15:44:36.528663 29161 slave.cpp:4856] Finished recovery
I0708 15:44:36.529166 29161 slave.cpp:5028] Querying resource estimator for oversubscribable
resources
I0708 15:44:36.529487 29163 slave.cpp:5042] Received oversubscribable resources  from the
resource estimator
I0708 15:44:36.529894 29163 slave.cpp:841] Agent terminating
[       OK ] Endpoint/SlaveEndpointTest.AuthorizedRequest/2 (21 ms)
[ RUN      ] Endpoint/SlaveEndpointTest.UnauthorizedRequest/0
I0708 15:44:36.545837 29138 containerizer.cpp:196] Using isolation: posix/cpu,posix/mem,filesystem/posix,network/cni
W0708 15:44:36.546614 29138 backend.cpp:75] Failed to create 'aufs' backend: AufsBackend requires
root privileges, but is running as user mesos
W0708 15:44:36.546785 29138 backend.cpp:75] Failed to create 'bind' backend: BindBackend requires
root privileges
I0708 15:44:36.550148 29169 slave.cpp:205] Agent started on 550)@172.17.0.3:34502
I0708 15:44:36.550178 29169 slave.cpp:206] Flags at startup: --acls="" --appc_simple_discovery_uri_prefix="http://"
--appc_store_dir="/tmp/mesos/store/appc" --authenticate_http="true" --authenticatee="crammd5"
--authentication_backoff_factor="1secs" --authorizer="local" --cgroups_cpu_enable_pids_and_tids_count="false"
--cgroups_enable_cfs="false" --cgroups_hierarchy="/sys/fs/cgroup" --cgroups_limit_swap="false"
--cgroups_root="mesos" --container_disk_watch_interval="15secs" --containerizers="mesos" --credential="/tmp/Endpoint_SlaveEndpointTest_UnauthorizedRequest_0_2jYrvE/credential"
--default_role="*" --disk_watch_interval="1mins" --docker="docker" --docker_kill_orphans="true"
--docker_registry="https://registry-1.docker.io" --docker_remove_delay="6hrs" --docker_socket="/var/run/docker.sock"
--docker_stop_timeout="0ns" --docker_store_dir="/tmp/mesos/store/docker" --docker_volume_checkpoint_dir="/var/run/mesos/isolators/docker/volume"
--enforce_container_disk_quota="false" --executor_registration_timeout="1mins" --executor_shutdown_grace_period="5secs"
--fetcher_cache_dir="/tmp/Endpoint_SlaveEndpointTest_UnauthorizedRequest_0_2jYrvE/fetch" --fetcher_cache_size="2GB"
--frameworks_home="" --gc_delay="1weeks" --gc_disk_headroom="0.1" --hadoop_home="" --help="true"
--hostname_lookup="true" --http_authenticators="basic" --http_command_executor="false" --http_credentials="/tmp/Endpoint_SlaveEndpointTest_UnauthorizedRequest_0_2jYrvE/http_credentials"
--image_provisioner_backend="copy" --initialize_driver_logging="true" --isolation="posix/cpu,posix/mem"
--launcher_dir="/mesos/mesos-1.1.0/_build/src" --logbufsecs="0" --logging_level="INFO" --oversubscribed_resources_interval="15secs"
--perf_duration="10secs" --perf_interval="1mins" --qos_correction_interval_min="0ns" --quiet="false"
--recover="reconnect" --recovery_timeout="15mins" --registration_backoff_factor="10ms" --resources="cpus:2;gpus:0;mem:1024;disk:1024;ports:[31000-32000]"
--revocable_cpu_low_priority="true" --sandbox_directory="/mnt/mesos/sandbox" --strict="true"
--switch_user="true" --systemd_enable_support="true" --systemd_runtime_directory="/run/systemd/system"
--version="false" --work_dir="/tmp/Endpoint_SlaveEndpointTest_UnauthorizedRequest_0_2jYrvE"
I0708 15:44:36.550823 29169 credentials.hpp:86] Loading credential for authentication from
'/tmp/Endpoint_SlaveEndpointTest_UnauthorizedRequest_0_2jYrvE/credential'
I0708 15:44:36.551277 29169 slave.cpp:343] Agent using credential for: test-principal
I0708 15:44:36.551326 29169 credentials.hpp:37] Loading credentials for authentication from
'/tmp/Endpoint_SlaveEndpointTest_UnauthorizedRequest_0_2jYrvE/http_credentials'
I0708 15:44:36.551635 29169 slave.cpp:395] Using default 'basic' HTTP authenticator
I0708 15:44:36.551962 29169 resources.cpp:572] Parsing resources as JSON failed: cpus:2;gpus:0;mem:1024;disk:1024;ports:[31000-32000]
Trying semicolon-delimited string format instead
I0708 15:44:36.552322 29169 resources.cpp:572] Parsing resources as JSON failed: cpus:2;gpus:0;mem:1024;disk:1024;ports:[31000-32000]
Trying semicolon-delimited string format instead
I0708 15:44:36.552815 29169 slave.cpp:594] Agent resources: cpus(*):2; mem(*):1024; disk(*):1024;
ports(*):[31000-32000]
I0708 15:44:36.552898 29169 slave.cpp:602] Agent attributes: [  ]
I0708 15:44:36.552937 29169 slave.cpp:607] Agent hostname: 0382d073a49a
I0708 15:44:36.554656 29161 state.cpp:57] Recovering state from '/tmp/Endpoint_SlaveEndpointTest_UnauthorizedRequest_0_2jYrvE/meta'
I0708 15:44:36.554759 29169 process.cpp:3322] Handling HTTP event for process 'slave(550)'
with path: '/slave(550)/monitor/statistics'
I0708 15:44:36.555333 29168 status_update_manager.cpp:200] Recovering status update manager
I0708 15:44:36.555600 29163 containerizer.cpp:522] Recovering containerizer
I0708 15:44:36.555733 29172 http.cpp:829] Authorizing principal 'test-principal' to GET the
'/monitor/statistics' endpoint
I0708 15:44:36.557137 29167 provisioner.cpp:253] Provisioner recovery complete
I0708 15:44:36.559088 29169 slave.cpp:4856] Finished recovery
I0708 15:44:36.559614 29169 slave.cpp:5028] Querying resource estimator for oversubscribable
resources
I0708 15:44:36.559908 29169 slave.cpp:841] Agent terminating
[       OK ] Endpoint/SlaveEndpointTest.UnauthorizedRequest/0 (22 ms)
[ RUN      ] Endpoint/SlaveEndpointTest.UnauthorizedRequest/1
I0708 15:44:36.573619 29138 containerizer.cpp:196] Using isolation: posix/cpu,posix/mem,filesystem/posix,network/cni
W0708 15:44:36.574484 29138 backend.cpp:75] Failed to create 'aufs' backend: AufsBackend requires
root privileges, but is running as user mesos
W0708 15:44:36.574688 29138 backend.cpp:75] Failed to create 'bind' backend: BindBackend requires
root privileges
I0708 15:44:36.578297 29162 slave.cpp:205] Agent started on 551)@172.17.0.3:34502
I0708 15:44:36.578336 29162 slave.cpp:206] Flags at startup: --acls="" --appc_simple_discovery_uri_prefix="http://"
--appc_store_dir="/tmp/mesos/store/appc" --authenticate_http="true" --authenticatee="crammd5"
--authentication_backoff_factor="1secs" --authorizer="local" --cgroups_cpu_enable_pids_and_tids_count="false"
--cgroups_enable_cfs="false" --cgroups_hierarchy="/sys/fs/cgroup" --cgroups_limit_swap="false"
--cgroups_root="mesos" --container_disk_watch_interval="15secs" --containerizers="mesos" --credential="/tmp/Endpoint_SlaveEndpointTest_UnauthorizedRequest_1_ItgiBA/credential"
--default_role="*" --disk_watch_interval="1mins" --docker="docker" --docker_kill_orphans="true"
--docker_registry="https://registry-1.docker.io" --docker_remove_delay="6hrs" --docker_socket="/var/run/docker.sock"
--docker_stop_timeout="0ns" --docker_store_dir="/tmp/mesos/store/docker" --docker_volume_checkpoint_dir="/var/run/mesos/isolators/docker/volume"
--enforce_container_disk_quota="false" --executor_registration_timeout="1mins" --executor_shutdown_grace_period="5secs"
--fetcher_cache_dir="/tmp/Endpoint_SlaveEndpointTest_UnauthorizedRequest_1_ItgiBA/fetch" --fetcher_cache_size="2GB"
--frameworks_home="" --gc_delay="1weeks" --gc_disk_headroom="0.1" --hadoop_home="" --help="true"
--hostname_lookup="true" --http_authenticators="basic" --http_command_executor="false" --http_credentials="/tmp/Endpoint_SlaveEndpointTest_UnauthorizedRequest_1_ItgiBA/http_credentials"
--image_provisioner_backend="copy" --initialize_driver_logging="true" --isolation="posix/cpu,posix/mem"
--launcher_dir="/mesos/mesos-1.1.0/_build/src" --logbufsecs="0" --logging_level="INFO" --oversubscribed_resources_interval="15secs"
--perf_duration="10secs" --perf_interval="1mins" --qos_correction_interval_min="0ns" --quiet="false"
--recover="reconnect" --recovery_timeout="15mins" --registration_backoff_factor="10ms" --resources="cpus:2;gpus:0;mem:1024;disk:1024;ports:[31000-32000]"
--revocable_cpu_low_priority="true" --sandbox_directory="/mnt/mesos/sandbox" --strict="true"
--switch_user="true" --systemd_enable_support="true" --systemd_runtime_directory="/run/systemd/system"
--version="false" --work_dir="/tmp/Endpoint_SlaveEndpointTest_UnauthorizedRequest_1_ItgiBA"
I0708 15:44:36.579056 29162 credentials.hpp:86] Loading credential for authentication from
'/tmp/Endpoint_SlaveEndpointTest_UnauthorizedRequest_1_ItgiBA/credential'
I0708 15:44:36.579406 29162 slave.cpp:343] Agent using credential for: test-principal
I0708 15:44:36.579442 29162 credentials.hpp:37] Loading credentials for authentication from
'/tmp/Endpoint_SlaveEndpointTest_UnauthorizedRequest_1_ItgiBA/http_credentials'
I0708 15:44:36.579774 29162 slave.cpp:395] Using default 'basic' HTTP authenticator
I0708 15:44:36.580219 29162 resources.cpp:572] Parsing resources as JSON failed: cpus:2;gpus:0;mem:1024;disk:1024;ports:[31000-32000]
Trying semicolon-delimited string format instead
I0708 15:44:36.580725 29162 resources.cpp:572] Parsing resources as JSON failed: cpus:2;gpus:0;mem:1024;disk:1024;ports:[31000-32000]
Trying semicolon-delimited string format instead
I0708 15:44:36.581265 29162 slave.cpp:594] Agent resources: cpus(*):2; mem(*):1024; disk(*):1024;
ports(*):[31000-32000]
I0708 15:44:36.581346 29162 slave.cpp:602] Agent attributes: [  ]
I0708 15:44:36.581360 29162 slave.cpp:607] Agent hostname: 0382d073a49a
I0708 15:44:36.583108 29161 state.cpp:57] Recovering state from '/tmp/Endpoint_SlaveEndpointTest_UnauthorizedRequest_1_ItgiBA/meta'
I0708 15:44:36.583207 29162 process.cpp:3322] Handling HTTP event for process 'slave(551)'
with path: '/slave(551)/monitor/statistics.json'
I0708 15:44:36.583724 29161 status_update_manager.cpp:200] Recovering status update manager
I0708 15:44:36.583884 29161 containerizer.cpp:522] Recovering containerizer
I0708 15:44:36.584792 29168 http.cpp:829] Authorizing principal 'test-principal' to GET the
'/monitor/statistics.json' endpoint
I0708 15:44:36.585443 29168 provisioner.cpp:253] Provisioner recovery complete
I0708 15:44:36.585753 29161 slave.cpp:4856] Finished recovery
I0708 15:44:36.586390 29161 slave.cpp:5028] Querying resource estimator for oversubscribable
resources
I0708 15:44:36.586644 29161 slave.cpp:5042] Received oversubscribable resources  from the
resource estimator
I0708 15:44:36.589013 29138 slave.cpp:841] Agent terminating
[       OK ] Endpoint/SlaveEndpointTest.UnauthorizedRequest/1 (24 ms)
[ RUN      ] Endpoint/SlaveEndpointTest.UnauthorizedRequest/2
I0708 15:44:36.597755 29138 containerizer.cpp:196] Using isolation: posix/cpu,posix/mem,filesystem/posix,network/cni
W0708 15:44:36.598537 29138 backend.cpp:75] Failed to create 'aufs' backend: AufsBackend requires
root privileges, but is running as user mesos
W0708 15:44:36.598712 29138 backend.cpp:75] Failed to create 'bind' backend: BindBackend requires
root privileges
I0708 15:44:36.601876 29163 slave.cpp:205] Agent started on 552)@172.17.0.3:34502
I0708 15:44:36.601995 29163 slave.cpp:206] Flags at startup: --acls="" --appc_simple_discovery_uri_prefix="http://"
--appc_store_dir="/tmp/mesos/store/appc" --authenticate_http="true" --authenticatee="crammd5"
--authentication_backoff_factor="1secs" --authorizer="local" --cgroups_cpu_enable_pids_and_tids_count="false"
--cgroups_enable_cfs="false" --cgroups_hierarchy="/sys/fs/cgroup" --cgroups_limit_swap="false"
--cgroups_root="mesos" --container_disk_watch_interval="15secs" --containerizers="mesos" --credential="/tmp/Endpoint_SlaveEndpointTest_UnauthorizedRequest_2_AiAxTw/credential"
--default_role="*" --disk_watch_interval="1mins" --docker="docker" --docker_kill_orphans="true"
--docker_registry="https://registry-1.docker.io" --docker_remove_delay="6hrs" --docker_socket="/var/run/docker.sock"
--docker_stop_timeout="0ns" --docker_store_dir="/tmp/mesos/store/docker" --docker_volume_checkpoint_dir="/var/run/mesos/isolators/docker/volume"
--enforce_container_disk_quota="false" --executor_registration_timeout="1mins" --executor_shutdown_grace_period="5secs"
--fetcher_cache_dir="/tmp/Endpoint_SlaveEndpointTest_UnauthorizedRequest_2_AiAxTw/fetch" --fetcher_cache_size="2GB"
--frameworks_home="" --gc_delay="1weeks" --gc_disk_headroom="0.1" --hadoop_home="" --help="true"
--hostname_lookup="true" --http_authenticators="basic" --http_command_executor="false" --http_credentials="/tmp/Endpoint_SlaveEndpointTest_UnauthorizedRequest_2_AiAxTw/http_credentials"
--image_provisioner_backend="copy" --initialize_driver_logging="true" --isolation="posix/cpu,posix/mem"
--launcher_dir="/mesos/mesos-1.1.0/_build/src" --logbufsecs="0" --logging_level="INFO" --oversubscribed_resources_interval="15secs"
--perf_duration="10secs" --perf_interval="1mins" --qos_correction_interval_min="0ns" --quiet="false"
--recover="reconnect" --recovery_timeout="15mins" --registration_backoff_factor="10ms" --resources="cpus:2;gpus:0;mem:1024;disk:1024;ports:[31000-32000]"
--revocable_cpu_low_priority="true" --sandbox_directory="/mnt/mesos/sandbox" --strict="true"
--switch_user="true" --systemd_enable_support="true" --systemd_runtime_directory="/run/systemd/system"
--version="false" --work_dir="/tmp/Endpoint_SlaveEndpointTest_UnauthorizedRequest_2_AiAxTw"
I0708 15:44:36.602416 29163 credentials.hpp:86] Loading credential for authentication from
'/tmp/Endpoint_SlaveEndpointTest_UnauthorizedRequest_2_AiAxTw/credential'
I0708 15:44:36.602563 29163 slave.cpp:343] Agent using credential for: test-principal
I0708 15:44:36.602602 29163 credentials.hpp:37] Loading credentials for authentication from
'/tmp/Endpoint_SlaveEndpointTest_UnauthorizedRequest_2_AiAxTw/http_credentials'
I0708 15:44:36.602833 29163 slave.cpp:395] Using default 'basic' HTTP authenticator
I0708 15:44:36.603428 29163 resources.cpp:572] Parsing resources as JSON failed: cpus:2;gpus:0;mem:1024;disk:1024;ports:[31000-32000]
Trying semicolon-delimited string format instead
I0708 15:44:36.603894 29163 resources.cpp:572] Parsing resources as JSON failed: cpus:2;gpus:0;mem:1024;disk:1024;ports:[31000-32000]
Trying semicolon-delimited string format instead
I0708 15:44:36.604429 29163 slave.cpp:594] Agent resources: cpus(*):2; mem(*):1024; disk(*):1024;
ports(*):[31000-32000]
I0708 15:44:36.604492 29163 slave.cpp:602] Agent attributes: [  ]
I0708 15:44:36.604504 29163 slave.cpp:607] Agent hostname: 0382d073a49a
I0708 15:44:36.606050 29162 state.cpp:57] Recovering state from '/tmp/Endpoint_SlaveEndpointTest_UnauthorizedRequest_2_AiAxTw/meta'
I0708 15:44:36.606111 29163 process.cpp:3322] Handling HTTP event for process 'slave(552)'
with path: '/slave(552)/containers'
I0708 15:44:36.606799 29171 status_update_manager.cpp:200] Recovering status update manager
I0708 15:44:36.607131 29164 containerizer.cpp:522] Recovering containerizer
I0708 15:44:36.607247 29171 http.cpp:829] Authorizing principal 'test-principal' to GET the
'/containers' endpoint
I0708 15:44:36.608235 29165 provisioner.cpp:253] Provisioner recovery complete
I0708 15:44:36.608513 29164 slave.cpp:4856] Finished recovery
I0708 15:44:36.609066 29164 slave.cpp:5028] Querying resource estimator for oversubscribable
resources
I0708 15:44:36.609450 29171 slave.cpp:5042] Received oversubscribable resources  from the
resource estimator
I0708 15:44:36.609668 29172 slave.cpp:841] Agent terminating
[       OK ] Endpoint/SlaveEndpointTest.UnauthorizedRequest/2 (20 ms)
[ RUN      ] Endpoint/SlaveEndpointTest.NoAuthorizer/0
I0708 15:44:36.623517 29138 containerizer.cpp:196] Using isolation: posix/cpu,posix/mem,filesystem/posix,network/cni
W0708 15:44:36.625051 29138 backend.cpp:75] Failed to create 'aufs' backend: AufsBackend requires
root privileges, but is running as user mesos
W0708 15:44:36.625380 29138 backend.cpp:75] Failed to create 'bind' backend: BindBackend requires
root privileges
I0708 15:44:36.627845 29138 cluster.cpp:432] Creating default 'local' authorizer
I0708 15:44:36.631973 29169 slave.cpp:205] Agent started on 553)@172.17.0.3:34502
I0708 15:44:36.632100 29169 slave.cpp:206] Flags at startup: --acls="" --appc_simple_discovery_uri_prefix="http://"
--appc_store_dir="/tmp/mesos/store/appc" --authenticate_http="true" --authenticatee="crammd5"
--authentication_backoff_factor="1secs" --authorizer="local" --cgroups_cpu_enable_pids_and_tids_count="false"
--cgroups_enable_cfs="false" --cgroups_hierarchy="/sys/fs/cgroup" --cgroups_limit_swap="false"
--cgroups_root="mesos" --container_disk_watch_interval="15secs" --containerizers="mesos" --credential="/tmp/Endpoint_SlaveEndpointTest_NoAuthorizer_0_iLBYmt/credential"
--default_role="*" --disk_watch_interval="1mins" --docker="docker" --docker_kill_orphans="true"
--docker_registry="https://registry-1.docker.io" --docker_remove_delay="6hrs" --docker_socket="/var/run/docker.sock"
--docker_stop_timeout="0ns" --docker_store_dir="/tmp/mesos/store/docker" --docker_volume_checkpoint_dir="/var/run/mesos/isolators/docker/volume"
--enforce_container_disk_quota="false" --executor_registration_timeout="1mins" --executor_shutdown_grace_period="5secs"
--fetcher_cache_dir="/tmp/Endpoint_SlaveEndpointTest_NoAuthorizer_0_iLBYmt/fetch" --fetcher_cache_size="2GB"
--frameworks_home="" --gc_delay="1weeks" --gc_disk_headroom="0.1" --hadoop_home="" --help="false"
--hostname_lookup="true" --http_authenticators="basic" --http_command_executor="false" --http_credentials="/tmp/Endpoint_SlaveEndpointTest_NoAuthorizer_0_iLBYmt/http_credentials"
--image_provisioner_backend="copy" --initialize_driver_logging="true" --isolation="posix/cpu,posix/mem"
--launcher_dir="/mesos/mesos-1.1.0/_build/src" --logbufsecs="0" --logging_level="INFO" --oversubscribed_resources_interval="15secs"
--perf_duration="10secs" --perf_interval="1mins" --qos_correction_interval_min="0ns" --quiet="false"
--recover="reconnect" --recovery_timeout="15mins" --registration_backoff_factor="10ms" --resources="cpus:2;gpus:0;mem:1024;disk:1024;ports:[31000-32000]"
--revocable_cpu_low_priority="true" --sandbox_directory="/mnt/mesos/sandbox" --strict="true"
--switch_user="true" --systemd_enable_support="true" --systemd_runtime_directory="/run/systemd/system"
--version="false" --work_dir="/tmp/Endpoint_SlaveEndpointTest_NoAuthorizer_0_iLBYmt"
I0708 15:44:36.632936 29169 credentials.hpp:86] Loading credential for authentication from
'/tmp/Endpoint_SlaveEndpointTest_NoAuthorizer_0_iLBYmt/credential'
I0708 15:44:36.633280 29169 slave.cpp:343] Agent using credential for: test-principal
I0708 15:44:36.633378 29169 credentials.hpp:37] Loading credentials for authentication from
'/tmp/Endpoint_SlaveEndpointTest_NoAuthorizer_0_iLBYmt/http_credentials'
I0708 15:44:36.633769 29169 slave.cpp:395] Using default 'basic' HTTP authenticator
I0708 15:44:36.634142 29169 resources.cpp:572] Parsing resources as JSON failed: cpus:2;gpus:0;mem:1024;disk:1024;ports:[31000-32000]
Trying semicolon-delimited string format instead
I0708 15:44:36.634793 29169 resources.cpp:572] Parsing resources as JSON failed: cpus:2;gpus:0;mem:1024;disk:1024;ports:[31000-32000]
Trying semicolon-delimited string format instead
I0708 15:44:36.635398 29169 slave.cpp:594] Agent resources: cpus(*):2; mem(*):1024; disk(*):1024;
ports(*):[31000-32000]
I0708 15:44:36.635545 29169 slave.cpp:602] Agent attributes: [  ]
I0708 15:44:36.635666 29169 slave.cpp:607] Agent hostname: 0382d073a49a
I0708 15:44:36.637616 29157 state.cpp:57] Recovering state from '/tmp/Endpoint_SlaveEndpointTest_NoAuthorizer_0_iLBYmt/meta'
I0708 15:44:36.638053 29157 status_update_manager.cpp:200] Recovering status update manager
I0708 15:44:36.638326 29169 containerizer.cpp:522] Recovering containerizer
I0708 15:44:36.640018 29168 process.cpp:3322] Handling HTTP event for process 'slave(553)'
with path: '/slave(553)/monitor/statistics'
I0708 15:44:36.641268 29169 http.cpp:829] Authorizing principal 'test-principal' to GET the
'/monitor/statistics' endpoint
I0708 15:44:36.641803 29162 provisioner.cpp:253] Provisioner recovery complete
I0708 15:44:36.642483 29169 slave.cpp:4856] Finished recovery
I0708 15:44:36.643285 29169 slave.cpp:5028] Querying resource estimator for oversubscribable
resources
I0708 15:44:36.644600 29169 slave.cpp:5042] Received oversubscribable resources  from the
resource estimator
I0708 15:44:36.654417 29167 slave.cpp:841] Agent terminating
[       OK ] Endpoint/SlaveEndpointTest.NoAuthorizer/0 (72 ms)
[ RUN      ] Endpoint/SlaveEndpointTest.NoAuthorizer/1
I0708 15:44:36.692813 29138 containerizer.cpp:196] Using isolation: posix/cpu,posix/mem,filesystem/posix,network/cni
W0708 15:44:36.693544 29138 backend.cpp:75] Failed to create 'aufs' backend: AufsBackend requires
root privileges, but is running as user mesos
W0708 15:44:36.693689 29138 backend.cpp:75] Failed to create 'bind' backend: BindBackend requires
root privileges
I0708 15:44:36.695130 29138 cluster.cpp:432] Creating default 'local' authorizer
I0708 15:44:36.696790 29160 slave.cpp:205] Agent started on 554)@172.17.0.3:34502
I0708 15:44:36.696812 29160 slave.cpp:206] Flags at startup: --acls="" --appc_simple_discovery_uri_prefix="http://"
--appc_store_dir="/tmp/mesos/store/appc" --authenticate_http="true" --authenticatee="crammd5"
--authentication_backoff_factor="1secs" --authorizer="local" --cgroups_cpu_enable_pids_and_tids_count="false"
--cgroups_enable_cfs="false" --cgroups_hierarchy="/sys/fs/cgroup" --cgroups_limit_swap="false"
--cgroups_root="mesos" --container_disk_watch_interval="15secs" --containerizers="mesos" --credential="/tmp/Endpoint_SlaveEndpointTest_NoAuthorizer_1_8uFkjq/credential"
--default_role="*" --disk_watch_interval="1mins" --docker="docker" --docker_kill_orphans="true"
--docker_registry="https://registry-1.docker.io" --docker_remove_delay="6hrs" --docker_socket="/var/run/docker.sock"
--docker_stop_timeout="0ns" --docker_store_dir="/tmp/mesos/store/docker" --docker_volume_checkpoint_dir="/var/run/mesos/isolators/docker/volume"
--enforce_container_disk_quota="false" --executor_registration_timeout="1mins" --executor_shutdown_grace_period="5secs"
--fetcher_cache_dir="/tmp/Endpoint_SlaveEndpointTest_NoAuthorizer_1_8uFkjq/fetch" --fetcher_cache_size="2GB"
--frameworks_home="" --gc_delay="1weeks" --gc_disk_headroom="0.1" --hadoop_home="" --help="false"
--hostname_lookup="true" --http_authenticators="basic" --http_command_executor="false" --http_credentials="/tmp/Endpoint_SlaveEndpointTest_NoAuthorizer_1_8uFkjq/http_credentials"
--image_provisioner_backend="copy" --initialize_driver_logging="true" --isolation="posix/cpu,posix/mem"
--launcher_dir="/mesos/mesos-1.1.0/_build/src" --logbufsecs="0" --logging_level="INFO" --oversubscribed_resources_interval="15secs"
--perf_duration="10secs" --perf_interval="1mins" --qos_correction_interval_min="0ns" --quiet="false"
--recover="reconnect" --recovery_timeout="15mins" --registration_backoff_factor="10ms" --resources="cpus:2;gpus:0;mem:1024;disk:1024;ports:[31000-32000]"
--revocable_cpu_low_priority="true" --sandbox_directory="/mnt/mesos/sandbox" --strict="true"
--switch_user="true" --systemd_enable_support="true" --systemd_runtime_directory="/run/systemd/system"
--version="false" --work_dir="/tmp/Endpoint_SlaveEndpointTest_NoAuthorizer_1_8uFkjq"
I0708 15:44:36.697268 29160 credentials.hpp:86] Loading credential for authentication from
'/tmp/Endpoint_SlaveEndpointTest_NoAuthorizer_1_8uFkjq/credential'
I0708 15:44:36.697461 29160 slave.cpp:343] Agent using credential for: test-principal
I0708 15:44:36.697495 29160 credentials.hpp:37] Loading credentials for authentication from
'/tmp/Endpoint_SlaveEndpointTest_NoAuthorizer_1_8uFkjq/http_credentials'
I0708 15:44:36.697767 29160 slave.cpp:395] Using default 'basic' HTTP authenticator
I0708 15:44:36.698093 29160 resources.cpp:572] Parsing resources as JSON failed: cpus:2;gpus:0;mem:1024;disk:1024;ports:[31000-32000]
Trying semicolon-delimited string format instead
I0708 15:44:36.698596 29160 resources.cpp:572] Parsing resources as JSON failed: cpus:2;gpus:0;mem:1024;disk:1024;ports:[31000-32000]
Trying semicolon-delimited string format instead
I0708 15:44:36.699028 29160 slave.cpp:594] Agent resources: cpus(*):2; mem(*):1024; disk(*):1024;
ports(*):[31000-32000]
I0708 15:44:36.699179 29160 slave.cpp:602] Agent attributes: [  ]
I0708 15:44:36.699265 29160 slave.cpp:607] Agent hostname: 0382d073a49a
I0708 15:44:36.700819 29166 state.cpp:57] Recovering state from '/tmp/Endpoint_SlaveEndpointTest_NoAuthorizer_1_8uFkjq/meta'
I0708 15:44:36.700901 29160 process.cpp:3322] Handling HTTP event for process 'slave(554)'
with path: '/slave(554)/monitor/statistics.json'
I0708 15:44:36.701323 29166 status_update_manager.cpp:200] Recovering status update manager
I0708 15:44:36.701614 29167 containerizer.cpp:522] Recovering containerizer
I0708 15:44:36.702173 29162 http.cpp:829] Authorizing principal 'test-principal' to GET the
'/monitor/statistics.json' endpoint
I0708 15:44:36.702991 29170 provisioner.cpp:253] Provisioner recovery complete
I0708 15:44:36.703876 29158 slave.cpp:4856] Finished recovery
I0708 15:44:36.704488 29158 slave.cpp:5028] Querying resource estimator for oversubscribable
resources
I0708 15:44:36.704759 29159 slave.cpp:5042] Received oversubscribable resources  from the
resource estimator
I0708 15:44:36.705878 29161 slave.cpp:841] Agent terminating
[       OK ] Endpoint/SlaveEndpointTest.NoAuthorizer/1 (21 ms)
[ RUN      ] Endpoint/SlaveEndpointTest.NoAuthorizer/2
I0708 15:44:36.739540 29138 containerizer.cpp:196] Using isolation: posix/cpu,posix/mem,filesystem/posix,network/cni
W0708 15:44:36.740345 29138 backend.cpp:75] Failed to create 'aufs' backend: AufsBackend requires
root privileges, but is running as user mesos
W0708 15:44:36.740486 29138 backend.cpp:75] Failed to create 'bind' backend: BindBackend requires
root privileges
I0708 15:44:36.742007 29138 cluster.cpp:432] Creating default 'local' authorizer
I0708 15:44:36.743656 29167 slave.cpp:205] Agent started on 555)@172.17.0.3:34502
I0708 15:44:36.743679 29167 slave.cpp:206] Flags at startup: --acls="" --appc_simple_discovery_uri_prefix="http://"
--appc_store_dir="/tmp/mesos/store/appc" --authenticate_http="true" --authenticatee="crammd5"
--authentication_backoff_factor="1secs" --authorizer="local" --cgroups_cpu_enable_pids_and_tids_count="false"
--cgroups_enable_cfs="false" --cgroups_hierarchy="/sys/fs/cgroup" --cgroups_limit_swap="false"
--cgroups_root="mesos" --container_disk_watch_interval="15secs" --containerizers="mesos" --credential="/tmp/Endpoint_SlaveEndpointTest_NoAuthorizer_2_OjvFEn/credential"
--default_role="*" --disk_watch_interval="1mins" --docker="docker" --docker_kill_orphans="true"
--docker_registry="https://registry-1.docker.io" --docker_remove_delay="6hrs" --docker_socket="/var/run/docker.sock"
--docker_stop_timeout="0ns" --docker_store_dir="/tmp/mesos/store/docker" --docker_volume_checkpoint_dir="/var/run/mesos/isolators/docker/volume"
--enforce_container_disk_quota="false" --executor_registration_timeout="1mins" --executor_shutdown_grace_period="5secs"
--fetcher_cache_dir="/tmp/Endpoint_SlaveEndpointTest_NoAuthorizer_2_OjvFEn/fetch" --fetcher_cache_size="2GB"
--frameworks_home="" --gc_delay="1weeks" --gc_disk_headroom="0.1" --hadoop_home="" --help="false"
--hostname_lookup="true" --http_authenticators="basic" --http_command_executor="false" --http_credentials="/tmp/Endpoint_SlaveEndpointTest_NoAuthorizer_2_OjvFEn/http_credentials"
--image_provisioner_backend="copy" --initialize_driver_logging="true" --isolation="posix/cpu,posix/mem"
--launcher_dir="/mesos/mesos-1.1.0/_build/src" --logbufsecs="0" --logging_level="INFO" --oversubscribed_resources_interval="15secs"
--perf_duration="10secs" --perf_interval="1mins" --qos_correction_interval_min="0ns" --quiet="false"
--recover="reconnect" --recovery_timeout="15mins" --registration_backoff_factor="10ms" --resources="cpus:2;gpus:0;mem:1024;disk:1024;ports:[31000-32000]"
--revocable_cpu_low_priority="true" --sandbox_directory="/mnt/mesos/sandbox" --strict="true"
--switch_user="true" --systemd_enable_support="true" --systemd_runtime_directory="/run/systemd/system"
--version="false" --work_dir="/tmp/Endpoint_SlaveEndpointTest_NoAuthorizer_2_OjvFEn"
I0708 15:44:36.744307 29167 credentials.hpp:86] Loading credential for authentication from
'/tmp/Endpoint_SlaveEndpointTest_NoAuthorizer_2_OjvFEn/credential'
I0708 15:44:36.744642 29167 slave.cpp:343] Agent using credential for: test-principal
I0708 15:44:36.744674 29167 credentials.hpp:37] Loading credentials for authentication from
'/tmp/Endpoint_SlaveEndpointTest_NoAuthorizer_2_OjvFEn/http_credentials'
I0708 15:44:36.745007 29167 slave.cpp:395] Using default 'basic' HTTP authenticator
I0708 15:44:36.745414 29167 resources.cpp:572] Parsing resources as JSON failed: cpus:2;gpus:0;mem:1024;disk:1024;ports:[31000-32000]
Trying semicolon-delimited string format instead
I0708 15:44:36.745839 29167 resources.cpp:572] Parsing resources as JSON failed: cpus:2;gpus:0;mem:1024;disk:1024;ports:[31000-32000]
Trying semicolon-delimited string format instead
I0708 15:44:36.746352 29167 slave.cpp:594] Agent resources: cpus(*):2; mem(*):1024; disk(*):1024;
ports(*):[31000-32000]
I0708 15:44:36.746412 29167 slave.cpp:602] Agent attributes: [  ]
I0708 15:44:36.746423 29167 slave.cpp:607] Agent hostname: 0382d073a49a
I0708 15:44:36.747843 29159 state.cpp:57] Recovering state from '/tmp/Endpoint_SlaveEndpointTest_NoAuthorizer_2_OjvFEn/meta'
I0708 15:44:36.747905 29167 process.cpp:3322] Handling HTTP event for process 'slave(555)'
with path: '/slave(555)/containers'
I0708 15:44:36.748626 29167 status_update_manager.cpp:200] Recovering status update manager
I0708 15:44:36.748849 29164 containerizer.cpp:522] Recovering containerizer
I0708 15:44:36.749291 29167 http.cpp:829] Authorizing principal 'test-principal' to GET the
'/containers' endpoint
I0708 15:44:36.750392 29159 provisioner.cpp:253] Provisioner recovery complete
I0708 15:44:36.750692 29170 slave.cpp:4856] Finished recovery
I0708 15:44:36.751565 29170 slave.cpp:5028] Querying resource estimator for oversubscribable
resources
I0708 15:44:36.751940 29164 slave.cpp:5042] Received oversubscribable resources  from the
resource estimator
I0708 15:44:36.753422 29162 slave.cpp:841] Agent terminating
[       OK ] Endpoint/SlaveEndpointTest.NoAuthorizer/2 (24 ms)
[----------] 9 tests from Endpoint/SlaveEndpointTest (299 ms total)

[----------] Global test environment tear-down
[==========] 1237 tests from 140 test cases ran. (914671 ms total)
[  PASSED  ] 1236 tests.
[  FAILED  ] 1 test, listed below:
[  FAILED  ] ContentType/MasterAPITest.Subscribe/0, where GetParam() = application/x-protobuf

 1 FAILED TEST
  YOU HAVE 6 DISABLED TESTS

make[4]: *** [check-local] Error 1
make[4]: Leaving directory `/mesos/mesos-1.1.0/_build/src'
make[3]: *** [check-am] Error 2
make[3]: Leaving directory `/mesos/mesos-1.1.0/_build/src'
make[2]: *** [check] Error 2
make[2]: Leaving directory `/mesos/mesos-1.1.0/_build/src'
make[1]: *** [check-recursive] Error 1
make[1]: Leaving directory `/mesos/mesos-1.1.0/_build'
make: *** [distcheck] Error 1
+ docker rmi mesos-1467989816-5369
Untagged: mesos-1467989816-5369:latest
Deleted: 5db22692495a72e8faea791f04713f7f00523dc0a6b347778535ed24ba210cea
Deleted: fa0369b378211f76484c1e971533df4e1eee3f37e5d0ad56e3f4d3c69aa58fe9
Deleted: 6b66e06992ee9612e4f54c8caca538a570b67f1d6be28b9dfa50052bcbc5ca7e
Deleted: 2771a19286f05c974995fe4ab025ca05d64a4a4e3d6ba87d7268a4a85a9ed9e5
Deleted: 3b24d5380c9f4b93bc24385030b700fe2f12d95c395a070ce523a84bb1f1998f
Deleted: d4de1f61472e69c42e78e86c99fe6cac103e1c72506e27119bd63712d01ef1e3
Deleted: 026915786fd0252a6640ae82d9e6e13741c117b60638ac8593b612bf7da05623
Deleted: 7fbfb2e1c9f9c7af3002736b4d60e25dd14921a70ba26980f8178d2be638f05c
Deleted: 0f7563935240de2d58f971416e7c99e35d45e1617c766c3bee4ec4b423500e0c
Deleted: 85ba7bb9b1a68983412d44bb68b76da91677234b622ab62fe8eef055d94bb87d
Deleted: cf985e7c621712ac1cad41b01bafeb3cc320d76f28d200385dc028a0a2085d95
Deleted: c9e35795099c3575731a8a9a67830aa23478687399337c7ed2b0b54ea325e426
Deleted: 7f4c331b7fa98fe1ae936d22ec98eb3b7218d04a199466cc96bbea5e44fd1ed0
Deleted: 954b930e1c35938c20571967283e53af3a8d41a9dd29a7335043b4b76a90f973
Deleted: 4e88aa33535a62cf5d23112b65d2c4a311ee116e0dfe72efb5d67f1408e6ebe0
Deleted: ef86a9769a7cd5ca79b2a1e84eaed3db8898e19cf9949fca0aafc860a9ce2c39
Build step 'Execute shell' marked build as failure

Mime
View raw message