mesos-builds mailing list archives

Site index · List index
Message view « Date » · « Thread »
Top « Date » · « Thread »
From Apache Jenkins Server <jenk...@builds.apache.org>
Subject Build failed in Jenkins: Mesos » autotools,gcc,--verbose --enable-libevent --enable-ssl,GLOG_v=1 MESOS_VERBOSE=1,ubuntu:14.04,(docker||Hadoop)&&(!ubuntu-us1)&&(!ubuntu-6) #2474
Date Fri, 08 Jul 2016 14:39:48 GMT
See <https://builds.apache.org/job/Mesos/BUILDTOOL=autotools,COMPILER=gcc,CONFIGURATION=--verbose%20--enable-libevent%20--enable-ssl,ENVIRONMENT=GLOG_v=1%20MESOS_VERBOSE=1,OS=ubuntu%3A14.04,label_exp=(docker%7C%7CHadoop)&&(!ubuntu-us1)&&(!ubuntu-6)/2474/changes>

Changes:

[alexr] Added self to contributors list.

------------------------------------------
[...truncated 196345 lines...]
I0708 14:39:50.375653 29455 slave.cpp:594] Agent resources: cpus(*):2; mem(*):1024; disk(*):1024;
ports(*):[31000-32000]
I0708 14:39:50.375726 29455 slave.cpp:602] Agent attributes: [  ]
I0708 14:39:50.375740 29455 slave.cpp:607] Agent hostname: c743b2754ad0
I0708 14:39:50.377266 29452 state.cpp:57] Recovering state from '/tmp/Endpoint_SlaveEndpointTest_AuthorizedRequest_1_lmv3gO/meta'
I0708 14:39:50.377351 29455 process.cpp:3322] Handling HTTP event for process 'slave(550)'
with path: '/slave(550)/monitor/statistics.json'
I0708 14:39:50.377972 29452 status_update_manager.cpp:200] Recovering status update manager
I0708 14:39:50.378226 29452 containerizer.cpp:522] Recovering containerizer
I0708 14:39:50.378468 29455 http.cpp:829] Authorizing principal 'test-principal' to GET the
'/monitor/statistics.json' endpoint
I0708 14:39:50.380043 29452 provisioner.cpp:253] Provisioner recovery complete
I0708 14:39:50.380473 29462 slave.cpp:4856] Finished recovery
I0708 14:39:50.380966 29462 slave.cpp:5028] Querying resource estimator for oversubscribable
resources
I0708 14:39:50.381186 29459 slave.cpp:5042] Received oversubscribable resources  from the
resource estimator
I0708 14:39:50.382797 29455 slave.cpp:841] Agent terminating
[       OK ] Endpoint/SlaveEndpointTest.AuthorizedRequest/1 (24 ms)
[ RUN      ] Endpoint/SlaveEndpointTest.AuthorizedRequest/2
I0708 14:39:50.392123 29428 containerizer.cpp:196] Using isolation: posix/cpu,posix/mem,filesystem/posix,network/cni
W0708 14:39:50.392844 29428 backend.cpp:75] Failed to create 'aufs' backend: AufsBackend requires
root privileges, but is running as user mesos
W0708 14:39:50.392973 29428 backend.cpp:75] Failed to create 'bind' backend: BindBackend requires
root privileges
I0708 14:39:50.395951 29454 slave.cpp:205] Agent started on 551)@172.17.0.3:46414
I0708 14:39:50.395977 29454 slave.cpp:206] Flags at startup: --acls="" --appc_simple_discovery_uri_prefix="http://"
--appc_store_dir="/tmp/mesos/store/appc" --authenticate_http="true" --authenticatee="crammd5"
--authentication_backoff_factor="1secs" --authorizer="local" --cgroups_cpu_enable_pids_and_tids_count="false"
--cgroups_enable_cfs="false" --cgroups_hierarchy="/sys/fs/cgroup" --cgroups_limit_swap="false"
--cgroups_root="mesos" --container_disk_watch_interval="15secs" --containerizers="mesos" --credential="/tmp/Endpoint_SlaveEndpointTest_AuthorizedRequest_2_fb1EFj/credential"
--default_role="*" --disk_watch_interval="1mins" --docker="docker" --docker_kill_orphans="true"
--docker_registry="https://registry-1.docker.io" --docker_remove_delay="6hrs" --docker_socket="/var/run/docker.sock"
--docker_stop_timeout="0ns" --docker_store_dir="/tmp/mesos/store/docker" --docker_volume_checkpoint_dir="/var/run/mesos/isolators/docker/volume"
--enforce_container_disk_quota="false" --executor_registration_timeout="1mins" --executor_shutdown_grace_period="5secs"
--fetcher_cache_dir="/tmp/Endpoint_SlaveEndpointTest_AuthorizedRequest_2_fb1EFj/fetch" --fetcher_cache_size="2GB"
--frameworks_home="" --gc_delay="1weeks" --gc_disk_headroom="0.1" --hadoop_home="" --help="false"
--hostname_lookup="true" --http_authenticators="basic" --http_command_executor="false" --http_credentials="/tmp/Endpoint_SlaveEndpointTest_AuthorizedRequest_2_fb1EFj/http_credentials"
--image_provisioner_backend="copy" --initialize_driver_logging="true" --isolation="posix/cpu,posix/mem"
--launcher_dir="/mesos/mesos-1.1.0/_build/src" --logbufsecs="0" --logging_level="INFO" --oversubscribed_resources_interval="15secs"
--perf_duration="10secs" --perf_interval="1mins" --qos_correction_interval_min="0ns" --quiet="false"
--recover="reconnect" --recovery_timeout="15mins" --registration_backoff_factor="10ms" --resources="cpus:2;gpus:0;mem:1024;disk:1024;ports:[31000-32000]"
--revocable_cpu_low_priority="true" --sandbox_directory="/mnt/mesos/sandbox" --strict="true"
--switch_user="true" --systemd_enable_support="true" --systemd_runtime_directory="/run/systemd/system"
--version="false" --work_dir="/tmp/Endpoint_SlaveEndpointTest_AuthorizedRequest_2_fb1EFj"
I0708 14:39:50.396499 29454 credentials.hpp:86] Loading credential for authentication from
'/tmp/Endpoint_SlaveEndpointTest_AuthorizedRequest_2_fb1EFj/credential'
I0708 14:39:50.396658 29454 slave.cpp:343] Agent using credential for: test-principal
I0708 14:39:50.396693 29454 credentials.hpp:37] Loading credentials for authentication from
'/tmp/Endpoint_SlaveEndpointTest_AuthorizedRequest_2_fb1EFj/http_credentials'
I0708 14:39:50.396924 29454 slave.cpp:395] Using default 'basic' HTTP authenticator
I0708 14:39:50.397274 29454 resources.cpp:572] Parsing resources as JSON failed: cpus:2;gpus:0;mem:1024;disk:1024;ports:[31000-32000]
Trying semicolon-delimited string format instead
I0708 14:39:50.397591 29454 resources.cpp:572] Parsing resources as JSON failed: cpus:2;gpus:0;mem:1024;disk:1024;ports:[31000-32000]
Trying semicolon-delimited string format instead
I0708 14:39:50.397972 29454 slave.cpp:594] Agent resources: cpus(*):2; mem(*):1024; disk(*):1024;
ports(*):[31000-32000]
I0708 14:39:50.398030 29454 slave.cpp:602] Agent attributes: [  ]
I0708 14:39:50.398041 29454 slave.cpp:607] Agent hostname: c743b2754ad0
I0708 14:39:50.399307 29453 state.cpp:57] Recovering state from '/tmp/Endpoint_SlaveEndpointTest_AuthorizedRequest_2_fb1EFj/meta'
I0708 14:39:50.399376 29454 process.cpp:3322] Handling HTTP event for process 'slave(551)'
with path: '/slave(551)/containers'
I0708 14:39:50.399824 29458 status_update_manager.cpp:200] Recovering status update manager
I0708 14:39:50.399955 29451 containerizer.cpp:522] Recovering containerizer
I0708 14:39:50.400238 29449 http.cpp:829] Authorizing principal 'test-principal' to GET the
'/containers' endpoint
I0708 14:39:50.401291 29458 provisioner.cpp:253] Provisioner recovery complete
I0708 14:39:50.401638 29454 slave.cpp:4856] Finished recovery
I0708 14:39:50.402215 29454 slave.cpp:5028] Querying resource estimator for oversubscribable
resources
I0708 14:39:50.402400 29462 slave.cpp:5042] Received oversubscribable resources  from the
resource estimator
I0708 14:39:50.403705 29450 slave.cpp:841] Agent terminating
[       OK ] Endpoint/SlaveEndpointTest.AuthorizedRequest/2 (21 ms)
[ RUN      ] Endpoint/SlaveEndpointTest.UnauthorizedRequest/0
I0708 14:39:50.412716 29428 containerizer.cpp:196] Using isolation: posix/cpu,posix/mem,filesystem/posix,network/cni
W0708 14:39:50.413422 29428 backend.cpp:75] Failed to create 'aufs' backend: AufsBackend requires
root privileges, but is running as user mesos
W0708 14:39:50.413580 29428 backend.cpp:75] Failed to create 'bind' backend: BindBackend requires
root privileges
I0708 14:39:50.416596 29448 slave.cpp:205] Agent started on 552)@172.17.0.3:46414
I0708 14:39:50.416621 29448 slave.cpp:206] Flags at startup: --acls="" --appc_simple_discovery_uri_prefix="http://"
--appc_store_dir="/tmp/mesos/store/appc" --authenticate_http="true" --authenticatee="crammd5"
--authentication_backoff_factor="1secs" --authorizer="local" --cgroups_cpu_enable_pids_and_tids_count="false"
--cgroups_enable_cfs="false" --cgroups_hierarchy="/sys/fs/cgroup" --cgroups_limit_swap="false"
--cgroups_root="mesos" --container_disk_watch_interval="15secs" --containerizers="mesos" --credential="/tmp/Endpoint_SlaveEndpointTest_UnauthorizedRequest_0_X61peP/credential"
--default_role="*" --disk_watch_interval="1mins" --docker="docker" --docker_kill_orphans="true"
--docker_registry="https://registry-1.docker.io" --docker_remove_delay="6hrs" --docker_socket="/var/run/docker.sock"
--docker_stop_timeout="0ns" --docker_store_dir="/tmp/mesos/store/docker" --docker_volume_checkpoint_dir="/var/run/mesos/isolators/docker/volume"
--enforce_container_disk_quota="false" --executor_registration_timeout="1mins" --executor_shutdown_grace_period="5secs"
--fetcher_cache_dir="/tmp/Endpoint_SlaveEndpointTest_UnauthorizedRequest_0_X61peP/fetch" --fetcher_cache_size="2GB"
--frameworks_home="" --gc_delay="1weeks" --gc_disk_headroom="0.1" --hadoop_home="" --help="false"
--hostname_lookup="true" --http_authenticators="basic" --http_command_executor="false" --http_credentials="/tmp/Endpoint_SlaveEndpointTest_UnauthorizedRequest_0_X61peP/http_credentials"
--image_provisioner_backend="copy" --initialize_driver_logging="true" --isolation="posix/cpu,posix/mem"
--launcher_dir="/mesos/mesos-1.1.0/_build/src" --logbufsecs="0" --logging_level="INFO" --oversubscribed_resources_interval="15secs"
--perf_duration="10secs" --perf_interval="1mins" --qos_correction_interval_min="0ns" --quiet="false"
--recover="reconnect" --recovery_timeout="15mins" --registration_backoff_factor="10ms" --resources="cpus:2;gpus:0;mem:1024;disk:1024;ports:[31000-32000]"
--revocable_cpu_low_priority="true" --sandbox_directory="/mnt/mesos/sandbox" --strict="true"
--switch_user="true" --systemd_enable_support="true" --systemd_runtime_directory="/run/systemd/system"
--version="false" --work_dir="/tmp/Endpoint_SlaveEndpointTest_UnauthorizedRequest_0_X61peP"
I0708 14:39:50.417120 29448 credentials.hpp:86] Loading credential for authentication from
'/tmp/Endpoint_SlaveEndpointTest_UnauthorizedRequest_0_X61peP/credential'
I0708 14:39:50.417309 29448 slave.cpp:343] Agent using credential for: test-principal
I0708 14:39:50.417341 29448 credentials.hpp:37] Loading credentials for authentication from
'/tmp/Endpoint_SlaveEndpointTest_UnauthorizedRequest_0_X61peP/http_credentials'
I0708 14:39:50.417577 29448 slave.cpp:395] Using default 'basic' HTTP authenticator
I0708 14:39:50.418093 29448 resources.cpp:572] Parsing resources as JSON failed: cpus:2;gpus:0;mem:1024;disk:1024;ports:[31000-32000]
Trying semicolon-delimited string format instead
I0708 14:39:50.418560 29448 resources.cpp:572] Parsing resources as JSON failed: cpus:2;gpus:0;mem:1024;disk:1024;ports:[31000-32000]
Trying semicolon-delimited string format instead
I0708 14:39:50.419082 29448 slave.cpp:594] Agent resources: cpus(*):2; mem(*):1024; disk(*):1024;
ports(*):[31000-32000]
I0708 14:39:50.419157 29448 slave.cpp:602] Agent attributes: [  ]
I0708 14:39:50.419169 29448 slave.cpp:607] Agent hostname: c743b2754ad0
I0708 14:39:50.420706 29451 state.cpp:57] Recovering state from '/tmp/Endpoint_SlaveEndpointTest_UnauthorizedRequest_0_X61peP/meta'
I0708 14:39:50.420760 29448 process.cpp:3322] Handling HTTP event for process 'slave(552)'
with path: '/slave(552)/monitor/statistics'
I0708 14:39:50.421407 29449 status_update_manager.cpp:200] Recovering status update manager
I0708 14:39:50.421634 29448 containerizer.cpp:522] Recovering containerizer
I0708 14:39:50.421821 29456 http.cpp:829] Authorizing principal 'test-principal' to GET the
'/monitor/statistics' endpoint
I0708 14:39:50.423032 29455 provisioner.cpp:253] Provisioner recovery complete
I0708 14:39:50.423771 29456 slave.cpp:4856] Finished recovery
I0708 14:39:50.424274 29456 slave.cpp:5028] Querying resource estimator for oversubscribable
resources
I0708 14:39:50.424444 29456 slave.cpp:841] Agent terminating
[       OK ] Endpoint/SlaveEndpointTest.UnauthorizedRequest/0 (20 ms)
[ RUN      ] Endpoint/SlaveEndpointTest.UnauthorizedRequest/1
I0708 14:39:50.433631 29428 containerizer.cpp:196] Using isolation: posix/cpu,posix/mem,filesystem/posix,network/cni
W0708 14:39:50.434326 29428 backend.cpp:75] Failed to create 'aufs' backend: AufsBackend requires
root privileges, but is running as user mesos
W0708 14:39:50.434492 29428 backend.cpp:75] Failed to create 'bind' backend: BindBackend requires
root privileges
I0708 14:39:50.437468 29455 slave.cpp:205] Agent started on 553)@172.17.0.3:46414
I0708 14:39:50.437552 29455 slave.cpp:206] Flags at startup: --acls="" --appc_simple_discovery_uri_prefix="http://"
--appc_store_dir="/tmp/mesos/store/appc" --authenticate_http="true" --authenticatee="crammd5"
--authentication_backoff_factor="1secs" --authorizer="local" --cgroups_cpu_enable_pids_and_tids_count="false"
--cgroups_enable_cfs="false" --cgroups_hierarchy="/sys/fs/cgroup" --cgroups_limit_swap="false"
--cgroups_root="mesos" --container_disk_watch_interval="15secs" --containerizers="mesos" --credential="/tmp/Endpoint_SlaveEndpointTest_UnauthorizedRequest_1_7hzyXk/credential"
--default_role="*" --disk_watch_interval="1mins" --docker="docker" --docker_kill_orphans="true"
--docker_registry="https://registry-1.docker.io" --docker_remove_delay="6hrs" --docker_socket="/var/run/docker.sock"
--docker_stop_timeout="0ns" --docker_store_dir="/tmp/mesos/store/docker" --docker_volume_checkpoint_dir="/var/run/mesos/isolators/docker/volume"
--enforce_container_disk_quota="false" --executor_registration_timeout="1mins" --executor_shutdown_grace_period="5secs"
--fetcher_cache_dir="/tmp/Endpoint_SlaveEndpointTest_UnauthorizedRequest_1_7hzyXk/fetch" --fetcher_cache_size="2GB"
--frameworks_home="" --gc_delay="1weeks" --gc_disk_headroom="0.1" --hadoop_home="" --help="false"
--hostname_lookup="true" --http_authenticators="basic" --http_command_executor="false" --http_credentials="/tmp/Endpoint_SlaveEndpointTest_UnauthorizedRequest_1_7hzyXk/http_credentials"
--image_provisioner_backend="copy" --initialize_driver_logging="true" --isolation="posix/cpu,posix/mem"
--launcher_dir="/mesos/mesos-1.1.0/_build/src" --logbufsecs="0" --logging_level="INFO" --oversubscribed_resources_interval="15secs"
--perf_duration="10secs" --perf_interval="1mins" --qos_correction_interval_min="0ns" --quiet="false"
--recover="reconnect" --recovery_timeout="15mins" --registration_backoff_factor="10ms" --resources="cpus:2;gpus:0;mem:1024;disk:1024;ports:[31000-32000]"
--revocable_cpu_low_priority="true" --sandbox_directory="/mnt/mesos/sandbox" --strict="true"
--switch_user="true" --systemd_enable_support="true" --systemd_runtime_directory="/run/systemd/system"
--version="false" --work_dir="/tmp/Endpoint_SlaveEndpointTest_UnauthorizedRequest_1_7hzyXk"
I0708 14:39:50.438072 29455 credentials.hpp:86] Loading credential for authentication from
'/tmp/Endpoint_SlaveEndpointTest_UnauthorizedRequest_1_7hzyXk/credential'
I0708 14:39:50.438261 29455 slave.cpp:343] Agent using credential for: test-principal
I0708 14:39:50.438302 29455 credentials.hpp:37] Loading credentials for authentication from
'/tmp/Endpoint_SlaveEndpointTest_UnauthorizedRequest_1_7hzyXk/http_credentials'
I0708 14:39:50.438578 29455 slave.cpp:395] Using default 'basic' HTTP authenticator
I0708 14:39:50.438956 29455 resources.cpp:572] Parsing resources as JSON failed: cpus:2;gpus:0;mem:1024;disk:1024;ports:[31000-32000]
Trying semicolon-delimited string format instead
I0708 14:39:50.439314 29455 resources.cpp:572] Parsing resources as JSON failed: cpus:2;gpus:0;mem:1024;disk:1024;ports:[31000-32000]
Trying semicolon-delimited string format instead
I0708 14:39:50.439776 29455 slave.cpp:594] Agent resources: cpus(*):2; mem(*):1024; disk(*):1024;
ports(*):[31000-32000]
I0708 14:39:50.439844 29455 slave.cpp:602] Agent attributes: [  ]
I0708 14:39:50.439864 29455 slave.cpp:607] Agent hostname: c743b2754ad0
I0708 14:39:50.441268 29459 state.cpp:57] Recovering state from '/tmp/Endpoint_SlaveEndpointTest_UnauthorizedRequest_1_7hzyXk/meta'
I0708 14:39:50.441329 29455 process.cpp:3322] Handling HTTP event for process 'slave(553)'
with path: '/slave(553)/monitor/statistics.json'
I0708 14:39:50.441968 29453 status_update_manager.cpp:200] Recovering status update manager
I0708 14:39:50.442265 29448 containerizer.cpp:522] Recovering containerizer
I0708 14:39:50.442469 29447 http.cpp:829] Authorizing principal 'test-principal' to GET the
'/monitor/statistics.json' endpoint
I0708 14:39:50.443670 29451 provisioner.cpp:253] Provisioner recovery complete
I0708 14:39:50.444242 29450 slave.cpp:4856] Finished recovery
I0708 14:39:50.444820 29450 slave.cpp:5028] Querying resource estimator for oversubscribable
resources
I0708 14:39:50.445114 29450 slave.cpp:841] Agent terminating
[       OK ] Endpoint/SlaveEndpointTest.UnauthorizedRequest/1 (22 ms)
[ RUN      ] Endpoint/SlaveEndpointTest.UnauthorizedRequest/2
I0708 14:39:50.455523 29428 containerizer.cpp:196] Using isolation: posix/cpu,posix/mem,filesystem/posix,network/cni
W0708 14:39:50.456308 29428 backend.cpp:75] Failed to create 'aufs' backend: AufsBackend requires
root privileges, but is running as user mesos
W0708 14:39:50.456497 29428 backend.cpp:75] Failed to create 'bind' backend: BindBackend requires
root privileges
I0708 14:39:50.460166 29452 slave.cpp:205] Agent started on 554)@172.17.0.3:46414
I0708 14:39:50.460189 29452 slave.cpp:206] Flags at startup: --acls="" --appc_simple_discovery_uri_prefix="http://"
--appc_store_dir="/tmp/mesos/store/appc" --authenticate_http="true" --authenticatee="crammd5"
--authentication_backoff_factor="1secs" --authorizer="local" --cgroups_cpu_enable_pids_and_tids_count="false"
--cgroups_enable_cfs="false" --cgroups_hierarchy="/sys/fs/cgroup" --cgroups_limit_swap="false"
--cgroups_root="mesos" --container_disk_watch_interval="15secs" --containerizers="mesos" --credential="/tmp/Endpoint_SlaveEndpointTest_UnauthorizedRequest_2_RYhbRQ/credential"
--default_role="*" --disk_watch_interval="1mins" --docker="docker" --docker_kill_orphans="true"
--docker_registry="https://registry-1.docker.io" --docker_remove_delay="6hrs" --docker_socket="/var/run/docker.sock"
--docker_stop_timeout="0ns" --docker_store_dir="/tmp/mesos/store/docker" --docker_volume_checkpoint_dir="/var/run/mesos/isolators/docker/volume"
--enforce_container_disk_quota="false" --executor_registration_timeout="1mins" --executor_shutdown_grace_period="5secs"
--fetcher_cache_dir="/tmp/Endpoint_SlaveEndpointTest_UnauthorizedRequest_2_RYhbRQ/fetch" --fetcher_cache_size="2GB"
--frameworks_home="" --gc_delay="1weeks" --gc_disk_headroom="0.1" --hadoop_home="" --help="false"
--hostname_lookup="true" --http_authenticators="basic" --http_command_executor="false" --http_credentials="/tmp/Endpoint_SlaveEndpointTest_UnauthorizedRequest_2_RYhbRQ/http_credentials"
--image_provisioner_backend="copy" --initialize_driver_logging="true" --isolation="posix/cpu,posix/mem"
--launcher_dir="/mesos/mesos-1.1.0/_build/src" --logbufsecs="0" --logging_level="INFO" --oversubscribed_resources_interval="15secs"
--perf_duration="10secs" --perf_interval="1mins" --qos_correction_interval_min="0ns" --quiet="false"
--recover="reconnect" --recovery_timeout="15mins" --registration_backoff_factor="10ms" --resources="cpus:2;gpus:0;mem:1024;disk:1024;ports:[31000-32000]"
--revocable_cpu_low_priority="true" --sandbox_directory="/mnt/mesos/sandbox" --strict="true"
--switch_user="true" --systemd_enable_support="true" --systemd_runtime_directory="/run/systemd/system"
--version="false" --work_dir="/tmp/Endpoint_SlaveEndpointTest_UnauthorizedRequest_2_RYhbRQ"
I0708 14:39:50.460763 29452 credentials.hpp:86] Loading credential for authentication from
'/tmp/Endpoint_SlaveEndpointTest_UnauthorizedRequest_2_RYhbRQ/credential'
I0708 14:39:50.460989 29452 slave.cpp:343] Agent using credential for: test-principal
I0708 14:39:50.461024 29452 credentials.hpp:37] Loading credentials for authentication from
'/tmp/Endpoint_SlaveEndpointTest_UnauthorizedRequest_2_RYhbRQ/http_credentials'
I0708 14:39:50.461305 29452 slave.cpp:395] Using default 'basic' HTTP authenticator
I0708 14:39:50.461637 29452 resources.cpp:572] Parsing resources as JSON failed: cpus:2;gpus:0;mem:1024;disk:1024;ports:[31000-32000]
Trying semicolon-delimited string format instead
I0708 14:39:50.461995 29452 resources.cpp:572] Parsing resources as JSON failed: cpus:2;gpus:0;mem:1024;disk:1024;ports:[31000-32000]
Trying semicolon-delimited string format instead
I0708 14:39:50.462466 29452 slave.cpp:594] Agent resources: cpus(*):2; mem(*):1024; disk(*):1024;
ports(*):[31000-32000]
I0708 14:39:50.462520 29452 slave.cpp:602] Agent attributes: [  ]
I0708 14:39:50.462529 29452 slave.cpp:607] Agent hostname: c743b2754ad0
I0708 14:39:50.463508 29452 process.cpp:3322] Handling HTTP event for process 'slave(554)'
with path: '/slave(554)/containers'
I0708 14:39:50.463518 29457 state.cpp:57] Recovering state from '/tmp/Endpoint_SlaveEndpointTest_UnauthorizedRequest_2_RYhbRQ/meta'
I0708 14:39:50.464046 29449 status_update_manager.cpp:200] Recovering status update manager
I0708 14:39:50.464345 29448 containerizer.cpp:522] Recovering containerizer
I0708 14:39:50.464509 29450 http.cpp:829] Authorizing principal 'test-principal' to GET the
'/containers' endpoint
I0708 14:39:50.465447 29459 provisioner.cpp:253] Provisioner recovery complete
I0708 14:39:50.465759 29447 slave.cpp:4856] Finished recovery
I0708 14:39:50.466275 29447 slave.cpp:5028] Querying resource estimator for oversubscribable
resources
I0708 14:39:50.466485 29447 slave.cpp:841] Agent terminating
[       OK ] Endpoint/SlaveEndpointTest.UnauthorizedRequest/2 (19 ms)
[ RUN      ] Endpoint/SlaveEndpointTest.NoAuthorizer/0
I0708 14:39:50.474126 29428 containerizer.cpp:196] Using isolation: posix/cpu,posix/mem,filesystem/posix,network/cni
W0708 14:39:50.474736 29428 backend.cpp:75] Failed to create 'aufs' backend: AufsBackend requires
root privileges, but is running as user mesos
W0708 14:39:50.474910 29428 backend.cpp:75] Failed to create 'bind' backend: BindBackend requires
root privileges
I0708 14:39:50.476733 29428 cluster.cpp:432] Creating default 'local' authorizer
I0708 14:39:50.478837 29458 slave.cpp:205] Agent started on 555)@172.17.0.3:46414
I0708 14:39:50.478868 29458 slave.cpp:206] Flags at startup: --acls="" --appc_simple_discovery_uri_prefix="http://"
--appc_store_dir="/tmp/mesos/store/appc" --authenticate_http="true" --authenticatee="crammd5"
--authentication_backoff_factor="1secs" --authorizer="local" --cgroups_cpu_enable_pids_and_tids_count="false"
--cgroups_enable_cfs="false" --cgroups_hierarchy="/sys/fs/cgroup" --cgroups_limit_swap="false"
--cgroups_root="mesos" --container_disk_watch_interval="15secs" --containerizers="mesos" --credential="/tmp/Endpoint_SlaveEndpointTest_NoAuthorizer_0_t6GuUm/credential"
--default_role="*" --disk_watch_interval="1mins" --docker="docker" --docker_kill_orphans="true"
--docker_registry="https://registry-1.docker.io" --docker_remove_delay="6hrs" --docker_socket="/var/run/docker.sock"
--docker_stop_timeout="0ns" --docker_store_dir="/tmp/mesos/store/docker" --docker_volume_checkpoint_dir="/var/run/mesos/isolators/docker/volume"
--enforce_container_disk_quota="false" --executor_registration_timeout="1mins" --executor_shutdown_grace_period="5secs"
--fetcher_cache_dir="/tmp/Endpoint_SlaveEndpointTest_NoAuthorizer_0_t6GuUm/fetch" --fetcher_cache_size="2GB"
--frameworks_home="" --gc_delay="1weeks" --gc_disk_headroom="0.1" --hadoop_home="" --help="false"
--hostname_lookup="true" --http_authenticators="basic" --http_command_executor="false" --http_credentials="/tmp/Endpoint_SlaveEndpointTest_NoAuthorizer_0_t6GuUm/http_credentials"
--image_provisioner_backend="copy" --initialize_driver_logging="true" --isolation="posix/cpu,posix/mem"
--launcher_dir="/mesos/mesos-1.1.0/_build/src" --logbufsecs="0" --logging_level="INFO" --oversubscribed_resources_interval="15secs"
--perf_duration="10secs" --perf_interval="1mins" --qos_correction_interval_min="0ns" --quiet="false"
--recover="reconnect" --recovery_timeout="15mins" --registration_backoff_factor="10ms" --resources="cpus:2;gpus:0;mem:1024;disk:1024;ports:[31000-32000]"
--revocable_cpu_low_priority="true" --sandbox_directory="/mnt/mesos/sandbox" --strict="true"
--switch_user="true" --systemd_enable_support="true" --systemd_runtime_directory="/run/systemd/system"
--version="false" --work_dir="/tmp/Endpoint_SlaveEndpointTest_NoAuthorizer_0_t6GuUm"
I0708 14:39:50.479467 29458 credentials.hpp:86] Loading credential for authentication from
'/tmp/Endpoint_SlaveEndpointTest_NoAuthorizer_0_t6GuUm/credential'
I0708 14:39:50.479642 29458 slave.cpp:343] Agent using credential for: test-principal
I0708 14:39:50.479686 29458 credentials.hpp:37] Loading credentials for authentication from
'/tmp/Endpoint_SlaveEndpointTest_NoAuthorizer_0_t6GuUm/http_credentials'
I0708 14:39:50.479981 29458 slave.cpp:395] Using default 'basic' HTTP authenticator
I0708 14:39:50.480432 29458 resources.cpp:572] Parsing resources as JSON failed: cpus:2;gpus:0;mem:1024;disk:1024;ports:[31000-32000]
Trying semicolon-delimited string format instead
I0708 14:39:50.480819 29458 resources.cpp:572] Parsing resources as JSON failed: cpus:2;gpus:0;mem:1024;disk:1024;ports:[31000-32000]
Trying semicolon-delimited string format instead
I0708 14:39:50.481295 29458 slave.cpp:594] Agent resources: cpus(*):2; mem(*):1024; disk(*):1024;
ports(*):[31000-32000]
I0708 14:39:50.481387 29458 slave.cpp:602] Agent attributes: [  ]
I0708 14:39:50.481403 29458 slave.cpp:607] Agent hostname: c743b2754ad0
I0708 14:39:50.483099 29455 state.cpp:57] Recovering state from '/tmp/Endpoint_SlaveEndpointTest_NoAuthorizer_0_t6GuUm/meta'
I0708 14:39:50.483109 29458 process.cpp:3322] Handling HTTP event for process 'slave(555)'
with path: '/slave(555)/monitor/statistics'
I0708 14:39:50.483973 29447 status_update_manager.cpp:200] Recovering status update manager
I0708 14:39:50.484290 29448 containerizer.cpp:522] Recovering containerizer
I0708 14:39:50.484438 29452 http.cpp:829] Authorizing principal 'test-principal' to GET the
'/monitor/statistics' endpoint
I0708 14:39:50.485746 29448 provisioner.cpp:253] Provisioner recovery complete
I0708 14:39:50.486306 29451 slave.cpp:4856] Finished recovery
I0708 14:39:50.486892 29451 slave.cpp:5028] Querying resource estimator for oversubscribable
resources
I0708 14:39:50.487252 29454 slave.cpp:5042] Received oversubscribable resources  from the
resource estimator
I0708 14:39:50.488529 29450 slave.cpp:841] Agent terminating
[       OK ] Endpoint/SlaveEndpointTest.NoAuthorizer/0 (22 ms)
[ RUN      ] Endpoint/SlaveEndpointTest.NoAuthorizer/1
I0708 14:39:50.497084 29428 containerizer.cpp:196] Using isolation: posix/cpu,posix/mem,filesystem/posix,network/cni
W0708 14:39:50.497987 29428 backend.cpp:75] Failed to create 'aufs' backend: AufsBackend requires
root privileges, but is running as user mesos
W0708 14:39:50.498150 29428 backend.cpp:75] Failed to create 'bind' backend: BindBackend requires
root privileges
I0708 14:39:50.500015 29428 cluster.cpp:432] Creating default 'local' authorizer
I0708 14:39:50.502050 29458 slave.cpp:205] Agent started on 556)@172.17.0.3:46414
I0708 14:39:50.502084 29458 slave.cpp:206] Flags at startup: --acls="" --appc_simple_discovery_uri_prefix="http://"
--appc_store_dir="/tmp/mesos/store/appc" --authenticate_http="true" --authenticatee="crammd5"
--authentication_backoff_factor="1secs" --authorizer="local" --cgroups_cpu_enable_pids_and_tids_count="false"
--cgroups_enable_cfs="false" --cgroups_hierarchy="/sys/fs/cgroup" --cgroups_limit_swap="false"
--cgroups_root="mesos" --container_disk_watch_interval="15secs" --containerizers="mesos" --credential="/tmp/Endpoint_SlaveEndpointTest_NoAuthorizer_1_NJot8S/credential"
--default_role="*" --disk_watch_interval="1mins" --docker="docker" --docker_kill_orphans="true"
--docker_registry="https://registry-1.docker.io" --docker_remove_delay="6hrs" --docker_socket="/var/run/docker.sock"
--docker_stop_timeout="0ns" --docker_store_dir="/tmp/mesos/store/docker" --docker_volume_checkpoint_dir="/var/run/mesos/isolators/docker/volume"
--enforce_container_disk_quota="false" --executor_registration_timeout="1mins" --executor_shutdown_grace_period="5secs"
--fetcher_cache_dir="/tmp/Endpoint_SlaveEndpointTest_NoAuthorizer_1_NJot8S/fetch" --fetcher_cache_size="2GB"
--frameworks_home="" --gc_delay="1weeks" --gc_disk_headroom="0.1" --hadoop_home="" --help="false"
--hostname_lookup="true" --http_authenticators="basic" --http_command_executor="false" --http_credentials="/tmp/Endpoint_SlaveEndpointTest_NoAuthorizer_1_NJot8S/http_credentials"
--image_provisioner_backend="copy" --initialize_driver_logging="true" --isolation="posix/cpu,posix/mem"
--launcher_dir="/mesos/mesos-1.1.0/_build/src" --logbufsecs="0" --logging_level="INFO" --oversubscribed_resources_interval="15secs"
--perf_duration="10secs" --perf_interval="1mins" --qos_correction_interval_min="0ns" --quiet="false"
--recover="reconnect" --recovery_timeout="15mins" --registration_backoff_factor="10ms" --resources="cpus:2;gpus:0;mem:1024;disk:1024;ports:[31000-32000]"
--revocable_cpu_low_priority="true" --sandbox_directory="/mnt/mesos/sandbox" --strict="true"
--switch_user="true" --systemd_enable_support="true" --systemd_runtime_directory="/run/systemd/system"
--version="false" --work_dir="/tmp/Endpoint_SlaveEndpointTest_NoAuthorizer_1_NJot8S"
I0708 14:39:50.502598 29458 credentials.hpp:86] Loading credential for authentication from
'/tmp/Endpoint_SlaveEndpointTest_NoAuthorizer_1_NJot8S/credential'
I0708 14:39:50.502718 29458 slave.cpp:343] Agent using credential for: test-principal
I0708 14:39:50.502748 29458 credentials.hpp:37] Loading credentials for authentication from
'/tmp/Endpoint_SlaveEndpointTest_NoAuthorizer_1_NJot8S/http_credentials'
I0708 14:39:50.502944 29458 slave.cpp:395] Using default 'basic' HTTP authenticator
I0708 14:39:50.503429 29458 resources.cpp:572] Parsing resources as JSON failed: cpus:2;gpus:0;mem:1024;disk:1024;ports:[31000-32000]
Trying semicolon-delimited string format instead
I0708 14:39:50.503828 29458 resources.cpp:572] Parsing resources as JSON failed: cpus:2;gpus:0;mem:1024;disk:1024;ports:[31000-32000]
Trying semicolon-delimited string format instead
I0708 14:39:50.504323 29458 slave.cpp:594] Agent resources: cpus(*):2; mem(*):1024; disk(*):1024;
ports(*):[31000-32000]
I0708 14:39:50.504417 29458 slave.cpp:602] Agent attributes: [  ]
I0708 14:39:50.504431 29458 slave.cpp:607] Agent hostname: c743b2754ad0
I0708 14:39:50.505841 29453 state.cpp:57] Recovering state from '/tmp/Endpoint_SlaveEndpointTest_NoAuthorizer_1_NJot8S/meta'
I0708 14:39:50.505902 29458 process.cpp:3322] Handling HTTP event for process 'slave(556)'
with path: '/slave(556)/monitor/statistics.json'
I0708 14:39:50.506407 29449 status_update_manager.cpp:200] Recovering status update manager
I0708 14:39:50.506582 29451 containerizer.cpp:522] Recovering containerizer
I0708 14:39:50.507067 29455 http.cpp:829] Authorizing principal 'test-principal' to GET the
'/monitor/statistics.json' endpoint
I0708 14:39:50.507930 29458 provisioner.cpp:253] Provisioner recovery complete
I0708 14:39:50.508821 29449 slave.cpp:4856] Finished recovery
I0708 14:39:50.509354 29449 slave.cpp:5028] Querying resource estimator for oversubscribable
resources
I0708 14:39:50.509838 29447 slave.cpp:5042] Received oversubscribable resources  from the
resource estimator
I0708 14:39:50.510855 29450 slave.cpp:841] Agent terminating
[       OK ] Endpoint/SlaveEndpointTest.NoAuthorizer/1 (22 ms)
[ RUN      ] Endpoint/SlaveEndpointTest.NoAuthorizer/2
I0708 14:39:50.520153 29428 containerizer.cpp:196] Using isolation: posix/cpu,posix/mem,filesystem/posix,network/cni
W0708 14:39:50.520946 29428 backend.cpp:75] Failed to create 'aufs' backend: AufsBackend requires
root privileges, but is running as user mesos
W0708 14:39:50.521113 29428 backend.cpp:75] Failed to create 'bind' backend: BindBackend requires
root privileges
I0708 14:39:50.522977 29428 cluster.cpp:432] Creating default 'local' authorizer
I0708 14:39:50.524725 29451 slave.cpp:205] Agent started on 557)@172.17.0.3:46414
I0708 14:39:50.524749 29451 slave.cpp:206] Flags at startup: --acls="" --appc_simple_discovery_uri_prefix="http://"
--appc_store_dir="/tmp/mesos/store/appc" --authenticate_http="true" --authenticatee="crammd5"
--authentication_backoff_factor="1secs" --authorizer="local" --cgroups_cpu_enable_pids_and_tids_count="false"
--cgroups_enable_cfs="false" --cgroups_hierarchy="/sys/fs/cgroup" --cgroups_limit_swap="false"
--cgroups_root="mesos" --container_disk_watch_interval="15secs" --containerizers="mesos" --credential="/tmp/Endpoint_SlaveEndpointTest_NoAuthorizer_2_t38pxp/credential"
--default_role="*" --disk_watch_interval="1mins" --docker="docker" --docker_kill_orphans="true"
--docker_registry="https://registry-1.docker.io" --docker_remove_delay="6hrs" --docker_socket="/var/run/docker.sock"
--docker_stop_timeout="0ns" --docker_store_dir="/tmp/mesos/store/docker" --docker_volume_checkpoint_dir="/var/run/mesos/isolators/docker/volume"
--enforce_container_disk_quota="false" --executor_registration_timeout="1mins" --executor_shutdown_grace_period="5secs"
--fetcher_cache_dir="/tmp/Endpoint_SlaveEndpointTest_NoAuthorizer_2_t38pxp/fetch" --fetcher_cache_size="2GB"
--frameworks_home="" --gc_delay="1weeks" --gc_disk_headroom="0.1" --hadoop_home="" --help="false"
--hostname_lookup="true" --http_authenticators="basic" --http_command_executor="false" --http_credentials="/tmp/Endpoint_SlaveEndpointTest_NoAuthorizer_2_t38pxp/http_credentials"
--image_provisioner_backend="copy" --initialize_driver_logging="true" --isolation="posix/cpu,posix/mem"
--launcher_dir="/mesos/mesos-1.1.0/_build/src" --logbufsecs="0" --logging_level="INFO" --oversubscribed_resources_interval="15secs"
--perf_duration="10secs" --perf_interval="1mins" --qos_correction_interval_min="0ns" --quiet="false"
--recover="reconnect" --recovery_timeout="15mins" --registration_backoff_factor="10ms" --resources="cpus:2;gpus:0;mem:1024;disk:1024;ports:[31000-32000]"
--revocable_cpu_low_priority="true" --sandbox_directory="/mnt/mesos/sandbox" --strict="true"
--switch_user="true" --systemd_enable_support="true" --systemd_runtime_directory="/run/systemd/system"
--version="false" --work_dir="/tmp/Endpoint_SlaveEndpointTest_NoAuthorizer_2_t38pxp"
I0708 14:39:50.525339 29451 credentials.hpp:86] Loading credential for authentication from
'/tmp/Endpoint_SlaveEndpointTest_NoAuthorizer_2_t38pxp/credential'
I0708 14:39:50.525573 29451 slave.cpp:343] Agent using credential for: test-principal
I0708 14:39:50.525606 29451 credentials.hpp:37] Loading credentials for authentication from
'/tmp/Endpoint_SlaveEndpointTest_NoAuthorizer_2_t38pxp/http_credentials'
I0708 14:39:50.525871 29451 slave.cpp:395] Using default 'basic' HTTP authenticator
I0708 14:39:50.526223 29451 resources.cpp:572] Parsing resources as JSON failed: cpus:2;gpus:0;mem:1024;disk:1024;ports:[31000-32000]
Trying semicolon-delimited string format instead
I0708 14:39:50.526561 29451 resources.cpp:572] Parsing resources as JSON failed: cpus:2;gpus:0;mem:1024;disk:1024;ports:[31000-32000]
Trying semicolon-delimited string format instead
I0708 14:39:50.527001 29451 slave.cpp:594] Agent resources: cpus(*):2; mem(*):1024; disk(*):1024;
ports(*):[31000-32000]
I0708 14:39:50.527071 29451 slave.cpp:602] Agent attributes: [  ]
I0708 14:39:50.527084 29451 slave.cpp:607] Agent hostname: c743b2754ad0
I0708 14:39:50.528455 29454 state.cpp:57] Recovering state from '/tmp/Endpoint_SlaveEndpointTest_NoAuthorizer_2_t38pxp/meta'
I0708 14:39:50.528537 29451 process.cpp:3322] Handling HTTP event for process 'slave(557)'
with path: '/slave(557)/containers'
I0708 14:39:50.529042 29457 status_update_manager.cpp:200] Recovering status update manager
I0708 14:39:50.529222 29453 containerizer.cpp:522] Recovering containerizer
I0708 14:39:50.529577 29451 http.cpp:829] Authorizing principal 'test-principal' to GET the
'/containers' endpoint
I0708 14:39:50.530596 29451 provisioner.cpp:253] Provisioner recovery complete
I0708 14:39:50.530977 29457 slave.cpp:4856] Finished recovery
I0708 14:39:50.531533 29457 slave.cpp:5028] Querying resource estimator for oversubscribable
resources
I0708 14:39:50.531891 29460 slave.cpp:5042] Received oversubscribable resources  from the
resource estimator
I0708 14:39:50.532970 29459 slave.cpp:841] Agent terminating
[       OK ] Endpoint/SlaveEndpointTest.NoAuthorizer/2 (21 ms)
[----------] 9 tests from Endpoint/SlaveEndpointTest (195 ms total)

[----------] Global test environment tear-down
[==========] 1236 tests from 139 test cases ran. (399736 ms total)
[  PASSED  ] 1234 tests.
[  FAILED  ] 2 tests, listed below:
[  FAILED  ] ContentType/MasterAPITest.GetAgents/0, where GetParam() = application/x-protobuf
[  FAILED  ] ContentType/MasterAPITest.GetAgents/1, where GetParam() = application/json

 2 FAILED TESTS
  YOU HAVE 6 DISABLED TESTS

make[4]: *** [check-local] Error 1
make[4]: Leaving directory `/mesos/mesos-1.1.0/_build/src'
make[3]: *** [check-am] Error 2
make[3]: Leaving directory `/mesos/mesos-1.1.0/_build/src'
make[2]: *** [check] Error 2
make[2]: Leaving directory `/mesos/mesos-1.1.0/_build/src'
make[1]: *** [check-recursive] Error 1
make[1]: Leaving directory `/mesos/mesos-1.1.0/_build'
make: *** [distcheck] Error 1
+ docker rmi mesos-1467986638-4256
Untagged: mesos-1467986638-4256:latest
Deleted: 9d7da1444458f6acd28316d41cd87f64bbc40dec7664a38bfc8de0c581cb2747
Deleted: e6ffc468aa135936e798bdb2bd5b9e3016383c6372803a705639b03b2e6c18f7
Deleted: aa617e3e8a8dc3e47c5aca2e84e8408302ae70ff99d819ecadfd95b563567cba
Deleted: b9f8be6e0f9f66e0fbdf9c27bbf3daa8f5e5b8779971a3b0186d642dfdda87c8
Deleted: 8fa74c8bb093eef28fae0c2a27e10c4f3753caaa0c092617987a1fb3cc1a9fd2
Deleted: 7a2dc5259cfa5dd050d0030f9cb7ddc4b702cb145cee36072faca9673d3390c9
Deleted: 2dee68b6fd0be28d14e61afbd42f8d5da20a40b6a94c3f6948856e68f22ac654
Deleted: aecae95e111e81bd6af9881afdc32421d4343dcbefeda769fdcf0ed6506c03f1
Deleted: 60ac59fe99576809781d580398fe7662fc6b65b58f7baae736b7f0cec3c21415
Deleted: 14472aad8ecc277dae4fa61e2b67b5ab0da14ef3335e680013a0162c1934c488
Deleted: 58ed5aada5a96e08b8f3cffd910b7740270da736f82e0330f2915f68d7541d4b
Deleted: ea93e02cc4e5422317e983265393639ebd4b5a9315e5319f40c01ce92e8e1e0f
Deleted: e0340208f515cdb3355e770b83015ad14c130e46dbb791be88e6c2dbc1abcdbc
Deleted: 02002f657dd9f13ccffbcc7c118f0ee354a8a0b5c1b350742e9dec4d5bc14bac
Deleted: 622024bcc4144debaea2f600dc27c6aacd39e9098db3bad0856a179b98aa4e04
Build step 'Execute shell' marked build as failure

Mime
View raw message