mesos-builds mailing list archives

Site index · List index
Message view « Date » · « Thread »
Top « Date » · « Thread »
From Apache Jenkins Server <jenk...@builds.apache.org>
Subject Build failed in Jenkins: mesos-reviewbot #14220
Date Fri, 08 Jul 2016 13:14:11 GMT
See <https://builds.apache.org/job/mesos-reviewbot/14220/>

------------------------------------------
[...truncated 199836 lines...]
Trying semicolon-delimited string format instead
I0708 13:14:12.499868 28118 slave.cpp:594] Agent resources: cpus(*):2; mem(*):1024; disk(*):1024;
ports(*):[31000-32000]
I0708 13:14:12.499959 28118 slave.cpp:602] Agent attributes: [  ]
I0708 13:14:12.499974 28118 slave.cpp:607] Agent hostname: 72d2e563dc88
I0708 13:14:12.501617 28118 process.cpp:3322] Handling HTTP event for process 'slave(550)'
with path: '/slave(550)/monitor/statistics.json'
I0708 13:14:12.501976 28119 state.cpp:57] Recovering state from '/tmp/Endpoint_SlaveEndpointTest_AuthorizedRequest_1_H9cpg1/meta'
I0708 13:14:12.502429 28114 status_update_manager.cpp:200] Recovering status update manager
I0708 13:14:12.502624 28118 containerizer.cpp:522] Recovering containerizer
I0708 13:14:12.502733 28114 http.cpp:829] Authorizing principal 'test-principal' to GET the
'/monitor/statistics.json' endpoint
I0708 13:14:12.506248 28094 slave.cpp:841] Agent terminating
I0708 13:14:12.506525 28114 provisioner.cpp:253] Provisioner recovery complete
[       OK ] Endpoint/SlaveEndpointTest.AuthorizedRequest/1 (22 ms)
[ RUN      ] Endpoint/SlaveEndpointTest.AuthorizedRequest/2
I0708 13:14:12.514401 28094 containerizer.cpp:196] Using isolation: posix/cpu,posix/mem,filesystem/posix,network/cni
W0708 13:14:12.515147 28094 backend.cpp:75] Failed to create 'aufs' backend: AufsBackend requires
root privileges, but is running as user mesos
W0708 13:14:12.515282 28094 backend.cpp:75] Failed to create 'bind' backend: BindBackend requires
root privileges
I0708 13:14:12.518735 28121 slave.cpp:205] Agent started on 551)@172.17.0.2:46132
I0708 13:14:12.518764 28121 slave.cpp:206] Flags at startup: --acls="" --appc_simple_discovery_uri_prefix="http://"
--appc_store_dir="/tmp/mesos/store/appc" --authenticate_http="true" --authenticatee="crammd5"
--authentication_backoff_factor="1secs" --authorizer="local" --cgroups_cpu_enable_pids_and_tids_count="false"
--cgroups_enable_cfs="false" --cgroups_hierarchy="/sys/fs/cgroup" --cgroups_limit_swap="false"
--cgroups_root="mesos" --container_disk_watch_interval="15secs" --containerizers="mesos" --credential="/tmp/Endpoint_SlaveEndpointTest_AuthorizedRequest_2_REyFEm/credential"
--default_role="*" --disk_watch_interval="1mins" --docker="docker" --docker_kill_orphans="true"
--docker_registry="https://registry-1.docker.io" --docker_remove_delay="6hrs" --docker_socket="/var/run/docker.sock"
--docker_stop_timeout="0ns" --docker_store_dir="/tmp/mesos/store/docker" --docker_volume_checkpoint_dir="/var/run/mesos/isolators/docker/volume"
--enforce_container_disk_quota="false" --executor_registration_timeout="1mins" --executor_shutdown_grace_period="5secs"
--fetcher_cache_dir="/tmp/Endpoint_SlaveEndpointTest_AuthorizedRequest_2_REyFEm/fetch" --fetcher_cache_size="2GB"
--frameworks_home="" --gc_delay="1weeks" --gc_disk_headroom="0.1" --hadoop_home="" --help="false"
--hostname_lookup="true" --http_authenticators="basic" --http_command_executor="false" --http_credentials="/tmp/Endpoint_SlaveEndpointTest_AuthorizedRequest_2_REyFEm/http_credentials"
--image_provisioner_backend="copy" --initialize_driver_logging="true" --isolation="posix/cpu,posix/mem"
--launcher_dir="/mesos/mesos-1.1.0/_build/src" --logbufsecs="0" --logging_level="INFO" --oversubscribed_resources_interval="15secs"
--perf_duration="10secs" --perf_interval="1mins" --qos_correction_interval_min="0ns" --quiet="false"
--recover="reconnect" --recovery_timeout="15mins" --registration_backoff_factor="10ms" --resources="cpus:2;gpus:0;mem:1024;disk:1024;ports:[31000-32000]"
--revocable_cpu_low_priority="true" --sandbox_directory="/mnt/mesos/sandbox" --strict="true"
--switch_user="true" --systemd_enable_support="true" --systemd_runtime_directory="/run/systemd/system"
--version="false" --work_dir="/tmp/Endpoint_SlaveEndpointTest_AuthorizedRequest_2_REyFEm"
I0708 13:14:12.519681 28121 credentials.hpp:86] Loading credential for authentication from
'/tmp/Endpoint_SlaveEndpointTest_AuthorizedRequest_2_REyFEm/credential'
I0708 13:14:12.520225 28121 slave.cpp:343] Agent using credential for: test-principal
I0708 13:14:12.520499 28121 credentials.hpp:37] Loading credentials for authentication from
'/tmp/Endpoint_SlaveEndpointTest_AuthorizedRequest_2_REyFEm/http_credentials'
I0708 13:14:12.520746 28121 slave.cpp:395] Using default 'basic' HTTP authenticator
I0708 13:14:12.521204 28121 resources.cpp:572] Parsing resources as JSON failed: cpus:2;gpus:0;mem:1024;disk:1024;ports:[31000-32000]
Trying semicolon-delimited string format instead
I0708 13:14:12.521512 28121 resources.cpp:572] Parsing resources as JSON failed: cpus:2;gpus:0;mem:1024;disk:1024;ports:[31000-32000]
Trying semicolon-delimited string format instead
I0708 13:14:12.521850 28121 slave.cpp:594] Agent resources: cpus(*):2; mem(*):1024; disk(*):1024;
ports(*):[31000-32000]
I0708 13:14:12.521910 28121 slave.cpp:602] Agent attributes: [  ]
I0708 13:14:12.521947 28121 slave.cpp:607] Agent hostname: 72d2e563dc88
I0708 13:14:12.523362 28117 state.cpp:57] Recovering state from '/tmp/Endpoint_SlaveEndpointTest_AuthorizedRequest_2_REyFEm/meta'
I0708 13:14:12.523422 28121 process.cpp:3322] Handling HTTP event for process 'slave(551)'
with path: '/slave(551)/containers'
I0708 13:14:12.524022 28125 status_update_manager.cpp:200] Recovering status update manager
I0708 13:14:12.524333 28117 containerizer.cpp:522] Recovering containerizer
I0708 13:14:12.524694 28121 http.cpp:829] Authorizing principal 'test-principal' to GET the
'/containers' endpoint
I0708 13:14:12.525866 28123 provisioner.cpp:253] Provisioner recovery complete
I0708 13:14:12.526546 28128 slave.cpp:4856] Finished recovery
I0708 13:14:12.527364 28128 slave.cpp:5028] Querying resource estimator for oversubscribable
resources
I0708 13:14:12.527832 28128 slave.cpp:5042] Received oversubscribable resources  from the
resource estimator
I0708 13:14:12.528817 28127 slave.cpp:841] Agent terminating
[       OK ] Endpoint/SlaveEndpointTest.AuthorizedRequest/2 (23 ms)
[ RUN      ] Endpoint/SlaveEndpointTest.UnauthorizedRequest/0
I0708 13:14:12.539899 28094 containerizer.cpp:196] Using isolation: posix/cpu,posix/mem,filesystem/posix,network/cni
W0708 13:14:12.540549 28094 backend.cpp:75] Failed to create 'aufs' backend: AufsBackend requires
root privileges, but is running as user mesos
W0708 13:14:12.540681 28094 backend.cpp:75] Failed to create 'bind' backend: BindBackend requires
root privileges
I0708 13:14:12.543251 28128 slave.cpp:205] Agent started on 552)@172.17.0.2:46132
I0708 13:14:12.543274 28128 slave.cpp:206] Flags at startup: --acls="" --appc_simple_discovery_uri_prefix="http://"
--appc_store_dir="/tmp/mesos/store/appc" --authenticate_http="true" --authenticatee="crammd5"
--authentication_backoff_factor="1secs" --authorizer="local" --cgroups_cpu_enable_pids_and_tids_count="false"
--cgroups_enable_cfs="false" --cgroups_hierarchy="/sys/fs/cgroup" --cgroups_limit_swap="false"
--cgroups_root="mesos" --container_disk_watch_interval="15secs" --containerizers="mesos" --credential="/tmp/Endpoint_SlaveEndpointTest_UnauthorizedRequest_0_B3v0Un/credential"
--default_role="*" --disk_watch_interval="1mins" --docker="docker" --docker_kill_orphans="true"
--docker_registry="https://registry-1.docker.io" --docker_remove_delay="6hrs" --docker_socket="/var/run/docker.sock"
--docker_stop_timeout="0ns" --docker_store_dir="/tmp/mesos/store/docker" --docker_volume_checkpoint_dir="/var/run/mesos/isolators/docker/volume"
--enforce_container_disk_quota="false" --executor_registration_timeout="1mins" --executor_shutdown_grace_period="5secs"
--fetcher_cache_dir="/tmp/Endpoint_SlaveEndpointTest_UnauthorizedRequest_0_B3v0Un/fetch" --fetcher_cache_size="2GB"
--frameworks_home="" --gc_delay="1weeks" --gc_disk_headroom="0.1" --hadoop_home="" --help="false"
--hostname_lookup="true" --http_authenticators="basic" --http_command_executor="false" --http_credentials="/tmp/Endpoint_SlaveEndpointTest_UnauthorizedRequest_0_B3v0Un/http_credentials"
--image_provisioner_backend="copy" --initialize_driver_logging="true" --isolation="posix/cpu,posix/mem"
--launcher_dir="/mesos/mesos-1.1.0/_build/src" --logbufsecs="0" --logging_level="INFO" --oversubscribed_resources_interval="15secs"
--perf_duration="10secs" --perf_interval="1mins" --qos_correction_interval_min="0ns" --quiet="false"
--recover="reconnect" --recovery_timeout="15mins" --registration_backoff_factor="10ms" --resources="cpus:2;gpus:0;mem:1024;disk:1024;ports:[31000-32000]"
--revocable_cpu_low_priority="true" --sandbox_directory="/mnt/mesos/sandbox" --strict="true"
--switch_user="true" --systemd_enable_support="true" --systemd_runtime_directory="/run/systemd/system"
--version="false" --work_dir="/tmp/Endpoint_SlaveEndpointTest_UnauthorizedRequest_0_B3v0Un"
I0708 13:14:12.543676 28128 credentials.hpp:86] Loading credential for authentication from
'/tmp/Endpoint_SlaveEndpointTest_UnauthorizedRequest_0_B3v0Un/credential'
I0708 13:14:12.543840 28128 slave.cpp:343] Agent using credential for: test-principal
I0708 13:14:12.543875 28128 credentials.hpp:37] Loading credentials for authentication from
'/tmp/Endpoint_SlaveEndpointTest_UnauthorizedRequest_0_B3v0Un/http_credentials'
I0708 13:14:12.544101 28128 slave.cpp:395] Using default 'basic' HTTP authenticator
I0708 13:14:12.544308 28128 resources.cpp:572] Parsing resources as JSON failed: cpus:2;gpus:0;mem:1024;disk:1024;ports:[31000-32000]
Trying semicolon-delimited string format instead
I0708 13:14:12.544589 28128 resources.cpp:572] Parsing resources as JSON failed: cpus:2;gpus:0;mem:1024;disk:1024;ports:[31000-32000]
Trying semicolon-delimited string format instead
I0708 13:14:12.545022 28128 slave.cpp:594] Agent resources: cpus(*):2; mem(*):1024; disk(*):1024;
ports(*):[31000-32000]
I0708 13:14:12.545099 28128 slave.cpp:602] Agent attributes: [  ]
I0708 13:14:12.545112 28128 slave.cpp:607] Agent hostname: 72d2e563dc88
I0708 13:14:12.546579 28126 state.cpp:57] Recovering state from '/tmp/Endpoint_SlaveEndpointTest_UnauthorizedRequest_0_B3v0Un/meta'
I0708 13:14:12.546661 28128 process.cpp:3322] Handling HTTP event for process 'slave(552)'
with path: '/slave(552)/monitor/statistics'
I0708 13:14:12.547150 28122 status_update_manager.cpp:200] Recovering status update manager
I0708 13:14:12.547324 28126 containerizer.cpp:522] Recovering containerizer
I0708 13:14:12.547693 28117 http.cpp:829] Authorizing principal 'test-principal' to GET the
'/monitor/statistics' endpoint
I0708 13:14:12.548568 28114 provisioner.cpp:253] Provisioner recovery complete
I0708 13:14:12.548838 28121 slave.cpp:4856] Finished recovery
I0708 13:14:12.549425 28121 slave.cpp:5028] Querying resource estimator for oversubscribable
resources
I0708 13:14:12.549856 28118 slave.cpp:5042] Received oversubscribable resources  from the
resource estimator
I0708 13:14:12.549948 28118 slave.cpp:841] Agent terminating
[       OK ] Endpoint/SlaveEndpointTest.UnauthorizedRequest/0 (18 ms)
[ RUN      ] Endpoint/SlaveEndpointTest.UnauthorizedRequest/1
I0708 13:14:12.558565 28094 containerizer.cpp:196] Using isolation: posix/cpu,posix/mem,filesystem/posix,network/cni
W0708 13:14:12.559267 28094 backend.cpp:75] Failed to create 'aufs' backend: AufsBackend requires
root privileges, but is running as user mesos
W0708 13:14:12.559420 28094 backend.cpp:75] Failed to create 'bind' backend: BindBackend requires
root privileges
I0708 13:14:12.562403 28116 slave.cpp:205] Agent started on 553)@172.17.0.2:46132
I0708 13:14:12.562433 28116 slave.cpp:206] Flags at startup: --acls="" --appc_simple_discovery_uri_prefix="http://"
--appc_store_dir="/tmp/mesos/store/appc" --authenticate_http="true" --authenticatee="crammd5"
--authentication_backoff_factor="1secs" --authorizer="local" --cgroups_cpu_enable_pids_and_tids_count="false"
--cgroups_enable_cfs="false" --cgroups_hierarchy="/sys/fs/cgroup" --cgroups_limit_swap="false"
--cgroups_root="mesos" --container_disk_watch_interval="15secs" --containerizers="mesos" --credential="/tmp/Endpoint_SlaveEndpointTest_UnauthorizedRequest_1_JT7Qkp/credential"
--default_role="*" --disk_watch_interval="1mins" --docker="docker" --docker_kill_orphans="true"
--docker_registry="https://registry-1.docker.io" --docker_remove_delay="6hrs" --docker_socket="/var/run/docker.sock"
--docker_stop_timeout="0ns" --docker_store_dir="/tmp/mesos/store/docker" --docker_volume_checkpoint_dir="/var/run/mesos/isolators/docker/volume"
--enforce_container_disk_quota="false" --executor_registration_timeout="1mins" --executor_shutdown_grace_period="5secs"
--fetcher_cache_dir="/tmp/Endpoint_SlaveEndpointTest_UnauthorizedRequest_1_JT7Qkp/fetch" --fetcher_cache_size="2GB"
--frameworks_home="" --gc_delay="1weeks" --gc_disk_headroom="0.1" --hadoop_home="" --help="false"
--hostname_lookup="true" --http_authenticators="basic" --http_command_executor="false" --http_credentials="/tmp/Endpoint_SlaveEndpointTest_UnauthorizedRequest_1_JT7Qkp/http_credentials"
--image_provisioner_backend="copy" --initialize_driver_logging="true" --isolation="posix/cpu,posix/mem"
--launcher_dir="/mesos/mesos-1.1.0/_build/src" --logbufsecs="0" --logging_level="INFO" --oversubscribed_resources_interval="15secs"
--perf_duration="10secs" --perf_interval="1mins" --qos_correction_interval_min="0ns" --quiet="false"
--recover="reconnect" --recovery_timeout="15mins" --registration_backoff_factor="10ms" --resources="cpus:2;gpus:0;mem:1024;disk:1024;ports:[31000-32000]"
--revocable_cpu_low_priority="true" --sandbox_directory="/mnt/mesos/sandbox" --strict="true"
--switch_user="true" --systemd_enable_support="true" --systemd_runtime_directory="/run/systemd/system"
--version="false" --work_dir="/tmp/Endpoint_SlaveEndpointTest_UnauthorizedRequest_1_JT7Qkp"
I0708 13:14:12.562889 28116 credentials.hpp:86] Loading credential for authentication from
'/tmp/Endpoint_SlaveEndpointTest_UnauthorizedRequest_1_JT7Qkp/credential'
I0708 13:14:12.563079 28116 slave.cpp:343] Agent using credential for: test-principal
I0708 13:14:12.563117 28116 credentials.hpp:37] Loading credentials for authentication from
'/tmp/Endpoint_SlaveEndpointTest_UnauthorizedRequest_1_JT7Qkp/http_credentials'
I0708 13:14:12.563370 28116 slave.cpp:395] Using default 'basic' HTTP authenticator
I0708 13:14:12.563843 28116 resources.cpp:572] Parsing resources as JSON failed: cpus:2;gpus:0;mem:1024;disk:1024;ports:[31000-32000]
Trying semicolon-delimited string format instead
I0708 13:14:12.564286 28116 resources.cpp:572] Parsing resources as JSON failed: cpus:2;gpus:0;mem:1024;disk:1024;ports:[31000-32000]
Trying semicolon-delimited string format instead
I0708 13:14:12.564771 28116 slave.cpp:594] Agent resources: cpus(*):2; mem(*):1024; disk(*):1024;
ports(*):[31000-32000]
I0708 13:14:12.564846 28116 slave.cpp:602] Agent attributes: [  ]
I0708 13:14:12.564858 28116 slave.cpp:607] Agent hostname: 72d2e563dc88
I0708 13:14:12.566417 28117 state.cpp:57] Recovering state from '/tmp/Endpoint_SlaveEndpointTest_UnauthorizedRequest_1_JT7Qkp/meta'
I0708 13:14:12.566491 28116 process.cpp:3322] Handling HTTP event for process 'slave(553)'
with path: '/slave(553)/monitor/statistics.json'
I0708 13:14:12.566910 28119 status_update_manager.cpp:200] Recovering status update manager
I0708 13:14:12.567118 28113 containerizer.cpp:522] Recovering containerizer
I0708 13:14:12.567440 28116 http.cpp:829] Authorizing principal 'test-principal' to GET the
'/monitor/statistics.json' endpoint
I0708 13:14:12.568495 28128 provisioner.cpp:253] Provisioner recovery complete
I0708 13:14:12.568745 28117 slave.cpp:4856] Finished recovery
I0708 13:14:12.569272 28117 slave.cpp:5028] Querying resource estimator for oversubscribable
resources
I0708 13:14:12.569452 28113 slave.cpp:5042] Received oversubscribable resources  from the
resource estimator
I0708 13:14:12.569654 28113 slave.cpp:841] Agent terminating
[       OK ] Endpoint/SlaveEndpointTest.UnauthorizedRequest/1 (20 ms)
[ RUN      ] Endpoint/SlaveEndpointTest.UnauthorizedRequest/2
I0708 13:14:12.578691 28094 containerizer.cpp:196] Using isolation: posix/cpu,posix/mem,filesystem/posix,network/cni
W0708 13:14:12.579509 28094 backend.cpp:75] Failed to create 'aufs' backend: AufsBackend requires
root privileges, but is running as user mesos
W0708 13:14:12.579689 28094 backend.cpp:75] Failed to create 'bind' backend: BindBackend requires
root privileges
I0708 13:14:12.582988 28119 slave.cpp:205] Agent started on 554)@172.17.0.2:46132
I0708 13:14:12.583016 28119 slave.cpp:206] Flags at startup: --acls="" --appc_simple_discovery_uri_prefix="http://"
--appc_store_dir="/tmp/mesos/store/appc" --authenticate_http="true" --authenticatee="crammd5"
--authentication_backoff_factor="1secs" --authorizer="local" --cgroups_cpu_enable_pids_and_tids_count="false"
--cgroups_enable_cfs="false" --cgroups_hierarchy="/sys/fs/cgroup" --cgroups_limit_swap="false"
--cgroups_root="mesos" --container_disk_watch_interval="15secs" --containerizers="mesos" --credential="/tmp/Endpoint_SlaveEndpointTest_UnauthorizedRequest_2_me0jUq/credential"
--default_role="*" --disk_watch_interval="1mins" --docker="docker" --docker_kill_orphans="true"
--docker_registry="https://registry-1.docker.io" --docker_remove_delay="6hrs" --docker_socket="/var/run/docker.sock"
--docker_stop_timeout="0ns" --docker_store_dir="/tmp/mesos/store/docker" --docker_volume_checkpoint_dir="/var/run/mesos/isolators/docker/volume"
--enforce_container_disk_quota="false" --executor_registration_timeout="1mins" --executor_shutdown_grace_period="5secs"
--fetcher_cache_dir="/tmp/Endpoint_SlaveEndpointTest_UnauthorizedRequest_2_me0jUq/fetch" --fetcher_cache_size="2GB"
--frameworks_home="" --gc_delay="1weeks" --gc_disk_headroom="0.1" --hadoop_home="" --help="false"
--hostname_lookup="true" --http_authenticators="basic" --http_command_executor="false" --http_credentials="/tmp/Endpoint_SlaveEndpointTest_UnauthorizedRequest_2_me0jUq/http_credentials"
--image_provisioner_backend="copy" --initialize_driver_logging="true" --isolation="posix/cpu,posix/mem"
--launcher_dir="/mesos/mesos-1.1.0/_build/src" --logbufsecs="0" --logging_level="INFO" --oversubscribed_resources_interval="15secs"
--perf_duration="10secs" --perf_interval="1mins" --qos_correction_interval_min="0ns" --quiet="false"
--recover="reconnect" --recovery_timeout="15mins" --registration_backoff_factor="10ms" --resources="cpus:2;gpus:0;mem:1024;disk:1024;ports:[31000-32000]"
--revocable_cpu_low_priority="true" --sandbox_directory="/mnt/mesos/sandbox" --strict="true"
--switch_user="true" --systemd_enable_support="true" --systemd_runtime_directory="/run/systemd/system"
--version="false" --work_dir="/tmp/Endpoint_SlaveEndpointTest_UnauthorizedRequest_2_me0jUq"
I0708 13:14:12.583499 28119 credentials.hpp:86] Loading credential for authentication from
'/tmp/Endpoint_SlaveEndpointTest_UnauthorizedRequest_2_me0jUq/credential'
I0708 13:14:12.583667 28119 slave.cpp:343] Agent using credential for: test-principal
I0708 13:14:12.583703 28119 credentials.hpp:37] Loading credentials for authentication from
'/tmp/Endpoint_SlaveEndpointTest_UnauthorizedRequest_2_me0jUq/http_credentials'
I0708 13:14:12.583997 28119 slave.cpp:395] Using default 'basic' HTTP authenticator
I0708 13:14:12.584599 28119 resources.cpp:572] Parsing resources as JSON failed: cpus:2;gpus:0;mem:1024;disk:1024;ports:[31000-32000]
Trying semicolon-delimited string format instead
I0708 13:14:12.585055 28119 resources.cpp:572] Parsing resources as JSON failed: cpus:2;gpus:0;mem:1024;disk:1024;ports:[31000-32000]
Trying semicolon-delimited string format instead
I0708 13:14:12.585557 28119 slave.cpp:594] Agent resources: cpus(*):2; mem(*):1024; disk(*):1024;
ports(*):[31000-32000]
I0708 13:14:12.585631 28119 slave.cpp:602] Agent attributes: [  ]
I0708 13:14:12.585654 28119 slave.cpp:607] Agent hostname: 72d2e563dc88
I0708 13:14:12.587374 28116 state.cpp:57] Recovering state from '/tmp/Endpoint_SlaveEndpointTest_UnauthorizedRequest_2_me0jUq/meta'
I0708 13:14:12.587430 28119 process.cpp:3322] Handling HTTP event for process 'slave(554)'
with path: '/slave(554)/containers'
I0708 13:14:12.587935 28127 status_update_manager.cpp:200] Recovering status update manager
I0708 13:14:12.588106 28127 containerizer.cpp:522] Recovering containerizer
I0708 13:14:12.588626 28122 http.cpp:829] Authorizing principal 'test-principal' to GET the
'/containers' endpoint
I0708 13:14:12.589303 28123 provisioner.cpp:253] Provisioner recovery complete
I0708 13:14:12.590121 28124 slave.cpp:4856] Finished recovery
I0708 13:14:12.590654 28124 slave.cpp:5028] Querying resource estimator for oversubscribable
resources
I0708 13:14:12.590819 28124 slave.cpp:841] Agent terminating
[       OK ] Endpoint/SlaveEndpointTest.UnauthorizedRequest/2 (20 ms)
[ RUN      ] Endpoint/SlaveEndpointTest.NoAuthorizer/0
I0708 13:14:12.598202 28094 containerizer.cpp:196] Using isolation: posix/cpu,posix/mem,filesystem/posix,network/cni
W0708 13:14:12.598850 28094 backend.cpp:75] Failed to create 'aufs' backend: AufsBackend requires
root privileges, but is running as user mesos
W0708 13:14:12.599009 28094 backend.cpp:75] Failed to create 'bind' backend: BindBackend requires
root privileges
I0708 13:14:12.600322 28094 cluster.cpp:432] Creating default 'local' authorizer
I0708 13:14:12.601794 28127 slave.cpp:205] Agent started on 555)@172.17.0.2:46132
I0708 13:14:12.601814 28127 slave.cpp:206] Flags at startup: --acls="" --appc_simple_discovery_uri_prefix="http://"
--appc_store_dir="/tmp/mesos/store/appc" --authenticate_http="true" --authenticatee="crammd5"
--authentication_backoff_factor="1secs" --authorizer="local" --cgroups_cpu_enable_pids_and_tids_count="false"
--cgroups_enable_cfs="false" --cgroups_hierarchy="/sys/fs/cgroup" --cgroups_limit_swap="false"
--cgroups_root="mesos" --container_disk_watch_interval="15secs" --containerizers="mesos" --credential="/tmp/Endpoint_SlaveEndpointTest_NoAuthorizer_0_yStODs/credential"
--default_role="*" --disk_watch_interval="1mins" --docker="docker" --docker_kill_orphans="true"
--docker_registry="https://registry-1.docker.io" --docker_remove_delay="6hrs" --docker_socket="/var/run/docker.sock"
--docker_stop_timeout="0ns" --docker_store_dir="/tmp/mesos/store/docker" --docker_volume_checkpoint_dir="/var/run/mesos/isolators/docker/volume"
--enforce_container_disk_quota="false" --executor_registration_timeout="1mins" --executor_shutdown_grace_period="5secs"
--fetcher_cache_dir="/tmp/Endpoint_SlaveEndpointTest_NoAuthorizer_0_yStODs/fetch" --fetcher_cache_size="2GB"
--frameworks_home="" --gc_delay="1weeks" --gc_disk_headroom="0.1" --hadoop_home="" --help="false"
--hostname_lookup="true" --http_authenticators="basic" --http_command_executor="false" --http_credentials="/tmp/Endpoint_SlaveEndpointTest_NoAuthorizer_0_yStODs/http_credentials"
--image_provisioner_backend="copy" --initialize_driver_logging="true" --isolation="posix/cpu,posix/mem"
--launcher_dir="/mesos/mesos-1.1.0/_build/src" --logbufsecs="0" --logging_level="INFO" --oversubscribed_resources_interval="15secs"
--perf_duration="10secs" --perf_interval="1mins" --qos_correction_interval_min="0ns" --quiet="false"
--recover="reconnect" --recovery_timeout="15mins" --registration_backoff_factor="10ms" --resources="cpus:2;gpus:0;mem:1024;disk:1024;ports:[31000-32000]"
--revocable_cpu_low_priority="true" --sandbox_directory="/mnt/mesos/sandbox" --strict="true"
--switch_user="true" --systemd_enable_support="true" --systemd_runtime_directory="/run/systemd/system"
--version="false" --work_dir="/tmp/Endpoint_SlaveEndpointTest_NoAuthorizer_0_yStODs"
I0708 13:14:12.602252 28127 credentials.hpp:86] Loading credential for authentication from
'/tmp/Endpoint_SlaveEndpointTest_NoAuthorizer_0_yStODs/credential'
I0708 13:14:12.602424 28127 slave.cpp:343] Agent using credential for: test-principal
I0708 13:14:12.602452 28127 credentials.hpp:37] Loading credentials for authentication from
'/tmp/Endpoint_SlaveEndpointTest_NoAuthorizer_0_yStODs/http_credentials'
I0708 13:14:12.602699 28127 slave.cpp:395] Using default 'basic' HTTP authenticator
I0708 13:14:12.603029 28127 resources.cpp:572] Parsing resources as JSON failed: cpus:2;gpus:0;mem:1024;disk:1024;ports:[31000-32000]
Trying semicolon-delimited string format instead
I0708 13:14:12.603338 28127 resources.cpp:572] Parsing resources as JSON failed: cpus:2;gpus:0;mem:1024;disk:1024;ports:[31000-32000]
Trying semicolon-delimited string format instead
I0708 13:14:12.603759 28127 slave.cpp:594] Agent resources: cpus(*):2; mem(*):1024; disk(*):1024;
ports(*):[31000-32000]
I0708 13:14:12.603813 28127 slave.cpp:602] Agent attributes: [  ]
I0708 13:14:12.603823 28127 slave.cpp:607] Agent hostname: 72d2e563dc88
I0708 13:14:12.605145 28116 state.cpp:57] Recovering state from '/tmp/Endpoint_SlaveEndpointTest_NoAuthorizer_0_yStODs/meta'
I0708 13:14:12.605204 28127 process.cpp:3322] Handling HTTP event for process 'slave(555)'
with path: '/slave(555)/monitor/statistics'
I0708 13:14:12.605578 28120 status_update_manager.cpp:200] Recovering status update manager
I0708 13:14:12.605711 28120 containerizer.cpp:522] Recovering containerizer
I0708 13:14:12.606060 28115 http.cpp:829] Authorizing principal 'test-principal' to GET the
'/monitor/statistics' endpoint
I0708 13:14:12.606750 28121 provisioner.cpp:253] Provisioner recovery complete
I0708 13:14:12.607619 28122 slave.cpp:4856] Finished recovery
I0708 13:14:12.608124 28122 slave.cpp:5028] Querying resource estimator for oversubscribable
resources
I0708 13:14:12.608386 28123 slave.cpp:5042] Received oversubscribable resources  from the
resource estimator
I0708 13:14:12.609396 28123 slave.cpp:841] Agent terminating
[       OK ] Endpoint/SlaveEndpointTest.NoAuthorizer/0 (19 ms)
[ RUN      ] Endpoint/SlaveEndpointTest.NoAuthorizer/1
I0708 13:14:12.617208 28094 containerizer.cpp:196] Using isolation: posix/cpu,posix/mem,filesystem/posix,network/cni
W0708 13:14:12.617844 28094 backend.cpp:75] Failed to create 'aufs' backend: AufsBackend requires
root privileges, but is running as user mesos
W0708 13:14:12.618000 28094 backend.cpp:75] Failed to create 'bind' backend: BindBackend requires
root privileges
I0708 13:14:12.619248 28094 cluster.cpp:432] Creating default 'local' authorizer
I0708 13:14:12.620662 28117 slave.cpp:205] Agent started on 556)@172.17.0.2:46132
I0708 13:14:12.620687 28117 slave.cpp:206] Flags at startup: --acls="" --appc_simple_discovery_uri_prefix="http://"
--appc_store_dir="/tmp/mesos/store/appc" --authenticate_http="true" --authenticatee="crammd5"
--authentication_backoff_factor="1secs" --authorizer="local" --cgroups_cpu_enable_pids_and_tids_count="false"
--cgroups_enable_cfs="false" --cgroups_hierarchy="/sys/fs/cgroup" --cgroups_limit_swap="false"
--cgroups_root="mesos" --container_disk_watch_interval="15secs" --containerizers="mesos" --credential="/tmp/Endpoint_SlaveEndpointTest_NoAuthorizer_1_MtQjwu/credential"
--default_role="*" --disk_watch_interval="1mins" --docker="docker" --docker_kill_orphans="true"
--docker_registry="https://registry-1.docker.io" --docker_remove_delay="6hrs" --docker_socket="/var/run/docker.sock"
--docker_stop_timeout="0ns" --docker_store_dir="/tmp/mesos/store/docker" --docker_volume_checkpoint_dir="/var/run/mesos/isolators/docker/volume"
--enforce_container_disk_quota="false" --executor_registration_timeout="1mins" --executor_shutdown_grace_period="5secs"
--fetcher_cache_dir="/tmp/Endpoint_SlaveEndpointTest_NoAuthorizer_1_MtQjwu/fetch" --fetcher_cache_size="2GB"
--frameworks_home="" --gc_delay="1weeks" --gc_disk_headroom="0.1" --hadoop_home="" --help="false"
--hostname_lookup="true" --http_authenticators="basic" --http_command_executor="false" --http_credentials="/tmp/Endpoint_SlaveEndpointTest_NoAuthorizer_1_MtQjwu/http_credentials"
--image_provisioner_backend="copy" --initialize_driver_logging="true" --isolation="posix/cpu,posix/mem"
--launcher_dir="/mesos/mesos-1.1.0/_build/src" --logbufsecs="0" --logging_level="INFO" --oversubscribed_resources_interval="15secs"
--perf_duration="10secs" --perf_interval="1mins" --qos_correction_interval_min="0ns" --quiet="false"
--recover="reconnect" --recovery_timeout="15mins" --registration_backoff_factor="10ms" --resources="cpus:2;gpus:0;mem:1024;disk:1024;ports:[31000-32000]"
--revocable_cpu_low_priority="true" --sandbox_directory="/mnt/mesos/sandbox" --strict="true"
--switch_user="true" --systemd_enable_support="true" --systemd_runtime_directory="/run/systemd/system"
--version="false" --work_dir="/tmp/Endpoint_SlaveEndpointTest_NoAuthorizer_1_MtQjwu"
I0708 13:14:12.621135 28117 credentials.hpp:86] Loading credential for authentication from
'/tmp/Endpoint_SlaveEndpointTest_NoAuthorizer_1_MtQjwu/credential'
I0708 13:14:12.621287 28117 slave.cpp:343] Agent using credential for: test-principal
I0708 13:14:12.621384 28117 credentials.hpp:37] Loading credentials for authentication from
'/tmp/Endpoint_SlaveEndpointTest_NoAuthorizer_1_MtQjwu/http_credentials'
I0708 13:14:12.621672 28117 slave.cpp:395] Using default 'basic' HTTP authenticator
I0708 13:14:12.621984 28117 resources.cpp:572] Parsing resources as JSON failed: cpus:2;gpus:0;mem:1024;disk:1024;ports:[31000-32000]
Trying semicolon-delimited string format instead
I0708 13:14:12.622280 28117 resources.cpp:572] Parsing resources as JSON failed: cpus:2;gpus:0;mem:1024;disk:1024;ports:[31000-32000]
Trying semicolon-delimited string format instead
I0708 13:14:12.622701 28117 slave.cpp:594] Agent resources: cpus(*):2; mem(*):1024; disk(*):1024;
ports(*):[31000-32000]
I0708 13:14:12.622759 28117 slave.cpp:602] Agent attributes: [  ]
I0708 13:14:12.622776 28117 slave.cpp:607] Agent hostname: 72d2e563dc88
I0708 13:14:12.624001 28121 state.cpp:57] Recovering state from '/tmp/Endpoint_SlaveEndpointTest_NoAuthorizer_1_MtQjwu/meta'
I0708 13:14:12.624083 28117 process.cpp:3322] Handling HTTP event for process 'slave(556)'
with path: '/slave(556)/monitor/statistics.json'
I0708 13:14:12.624503 28126 status_update_manager.cpp:200] Recovering status update manager
I0708 13:14:12.624793 28127 containerizer.cpp:522] Recovering containerizer
I0708 13:14:12.624874 28115 http.cpp:829] Authorizing principal 'test-principal' to GET the
'/monitor/statistics.json' endpoint
I0708 13:14:12.625973 28121 provisioner.cpp:253] Provisioner recovery complete
I0708 13:14:12.626348 28118 slave.cpp:4856] Finished recovery
I0708 13:14:12.626824 28118 slave.cpp:5028] Querying resource estimator for oversubscribable
resources
I0708 13:14:12.627153 28118 slave.cpp:5042] Received oversubscribable resources  from the
resource estimator
I0708 13:14:12.627902 28113 slave.cpp:841] Agent terminating
[       OK ] Endpoint/SlaveEndpointTest.NoAuthorizer/1 (18 ms)
[ RUN      ] Endpoint/SlaveEndpointTest.NoAuthorizer/2
I0708 13:14:12.635448 28094 containerizer.cpp:196] Using isolation: posix/cpu,posix/mem,filesystem/posix,network/cni
W0708 13:14:12.636126 28094 backend.cpp:75] Failed to create 'aufs' backend: AufsBackend requires
root privileges, but is running as user mesos
W0708 13:14:12.636252 28094 backend.cpp:75] Failed to create 'bind' backend: BindBackend requires
root privileges
I0708 13:14:12.637522 28094 cluster.cpp:432] Creating default 'local' authorizer
I0708 13:14:12.638962 28128 slave.cpp:205] Agent started on 557)@172.17.0.2:46132
I0708 13:14:12.638986 28128 slave.cpp:206] Flags at startup: --acls="" --appc_simple_discovery_uri_prefix="http://"
--appc_store_dir="/tmp/mesos/store/appc" --authenticate_http="true" --authenticatee="crammd5"
--authentication_backoff_factor="1secs" --authorizer="local" --cgroups_cpu_enable_pids_and_tids_count="false"
--cgroups_enable_cfs="false" --cgroups_hierarchy="/sys/fs/cgroup" --cgroups_limit_swap="false"
--cgroups_root="mesos" --container_disk_watch_interval="15secs" --containerizers="mesos" --credential="/tmp/Endpoint_SlaveEndpointTest_NoAuthorizer_2_gzrNxw/credential"
--default_role="*" --disk_watch_interval="1mins" --docker="docker" --docker_kill_orphans="true"
--docker_registry="https://registry-1.docker.io" --docker_remove_delay="6hrs" --docker_socket="/var/run/docker.sock"
--docker_stop_timeout="0ns" --docker_store_dir="/tmp/mesos/store/docker" --docker_volume_checkpoint_dir="/var/run/mesos/isolators/docker/volume"
--enforce_container_disk_quota="false" --executor_registration_timeout="1mins" --executor_shutdown_grace_period="5secs"
--fetcher_cache_dir="/tmp/Endpoint_SlaveEndpointTest_NoAuthorizer_2_gzrNxw/fetch" --fetcher_cache_size="2GB"
--frameworks_home="" --gc_delay="1weeks" --gc_disk_headroom="0.1" --hadoop_home="" --help="false"
--hostname_lookup="true" --http_authenticators="basic" --http_command_executor="false" --http_credentials="/tmp/Endpoint_SlaveEndpointTest_NoAuthorizer_2_gzrNxw/http_credentials"
--image_provisioner_backend="copy" --initialize_driver_logging="true" --isolation="posix/cpu,posix/mem"
--launcher_dir="/mesos/mesos-1.1.0/_build/src" --logbufsecs="0" --logging_level="INFO" --oversubscribed_resources_interval="15secs"
--perf_duration="10secs" --perf_interval="1mins" --qos_correction_interval_min="0ns" --quiet="false"
--recover="reconnect" --recovery_timeout="15mins" --registration_backoff_factor="10ms" --resources="cpus:2;gpus:0;mem:1024;disk:1024;ports:[31000-32000]"
--revocable_cpu_low_priority="true" --sandbox_directory="/mnt/mesos/sandbox" --strict="true"
--switch_user="true" --systemd_enable_support="true" --systemd_runtime_directory="/run/systemd/system"
--version="false" --work_dir="/tmp/Endpoint_SlaveEndpointTest_NoAuthorizer_2_gzrNxw"
I0708 13:14:12.639364 28128 credentials.hpp:86] Loading credential for authentication from
'/tmp/Endpoint_SlaveEndpointTest_NoAuthorizer_2_gzrNxw/credential'
I0708 13:14:12.639533 28128 slave.cpp:343] Agent using credential for: test-principal
I0708 13:14:12.639566 28128 credentials.hpp:37] Loading credentials for authentication from
'/tmp/Endpoint_SlaveEndpointTest_NoAuthorizer_2_gzrNxw/http_credentials'
I0708 13:14:12.639817 28128 slave.cpp:395] Using default 'basic' HTTP authenticator
I0708 13:14:12.640146 28128 resources.cpp:572] Parsing resources as JSON failed: cpus:2;gpus:0;mem:1024;disk:1024;ports:[31000-32000]
Trying semicolon-delimited string format instead
I0708 13:14:12.640409 28128 resources.cpp:572] Parsing resources as JSON failed: cpus:2;gpus:0;mem:1024;disk:1024;ports:[31000-32000]
Trying semicolon-delimited string format instead
I0708 13:14:12.640771 28128 slave.cpp:594] Agent resources: cpus(*):2; mem(*):1024; disk(*):1024;
ports(*):[31000-32000]
I0708 13:14:12.640827 28128 slave.cpp:602] Agent attributes: [  ]
I0708 13:14:12.640837 28128 slave.cpp:607] Agent hostname: 72d2e563dc88
I0708 13:14:12.642128 28117 state.cpp:57] Recovering state from '/tmp/Endpoint_SlaveEndpointTest_NoAuthorizer_2_gzrNxw/meta'
I0708 13:14:12.642180 28128 process.cpp:3322] Handling HTTP event for process 'slave(557)'
with path: '/slave(557)/containers'
I0708 13:14:12.642616 28114 status_update_manager.cpp:200] Recovering status update manager
I0708 13:14:12.642858 28113 containerizer.cpp:522] Recovering containerizer
I0708 13:14:12.642994 28119 http.cpp:829] Authorizing principal 'test-principal' to GET the
'/containers' endpoint
I0708 13:14:12.643966 28119 provisioner.cpp:253] Provisioner recovery complete
I0708 13:14:12.644266 28115 slave.cpp:4856] Finished recovery
I0708 13:14:12.644778 28115 slave.cpp:5028] Querying resource estimator for oversubscribable
resources
I0708 13:14:12.644979 28122 slave.cpp:5042] Received oversubscribable resources  from the
resource estimator
I0708 13:14:12.645967 28116 slave.cpp:841] Agent terminating
[       OK ] Endpoint/SlaveEndpointTest.NoAuthorizer/2 (18 ms)
[----------] 9 tests from Endpoint/SlaveEndpointTest (191 ms total)

[----------] Global test environment tear-down
[==========] 1236 tests from 139 test cases ran. (841850 ms total)
[  PASSED  ] 1234 tests.
[  FAILED  ] 2 tests, listed below:
[  FAILED  ] ContentType/MasterAPITest.GetAgents/0, where GetParam() = application/x-protobuf
[  FAILED  ] ContentType/MasterAPITest.GetAgents/1, where GetParam() = application/json

 2 FAILED TESTS
  YOU HAVE 6 DISABLED TESTS

make[4]: *** [check-local] Error 1
make[4]: Leaving directory `/mesos/mesos-1.1.0/_build/src'
make[3]: *** [check-am] Error 2
make[3]: Leaving directory `/mesos/mesos-1.1.0/_build/src'
make[2]: *** [check] Error 2
make[2]: Leaving directory `/mesos/mesos-1.1.0/_build/src'
make[1]: Leaving directory `/mesos/mesos-1.1.0/_build'
make[1]: *** [check-recursive] Error 1
make: *** [distcheck] Error 1
+ docker rmi mesos-1467980592-19153
Untagged: mesos-1467980592-19153:latest
Deleted: dee789bb55c37826182a84be0d08a58a19f00ab845c326b26f2e8df86d803701
Deleted: 9cef705cccdca55f277a37d050869f2df3f430daa233198e29469af80128ac92
Deleted: f457511b30120aa780e3a8aaa86b6490842dba703a271340064b1c4435dcfe70
Deleted: 6703b876134474e6d2ca6edeba6a47824fc2a0cf5b408feda141e383001fca06
Deleted: 392b38263b413f1f9902958d741f5041920418da6abf23d3a5dc7f843f55ec91
Deleted: ee33e893337dedfc58b15f95d2d1546eaf79b2031c4f754a142119b21d9e3245
Deleted: bbecd3c2468a4f7ce9f2b36af011d6b30dbc772d3ba97144409ac79051dde503
Deleted: 2322696cd368ecde3a24389479f92de4a4207f890eed2b32835b9439d9ca233e
Deleted: 26db9bf75b8d205cd0ab982f9c683b6fdf5218572d662e01ff575a677ea64bb9
Deleted: fcafb7ddc6e1fa8b446d9d22b22946543dd6f8c03b6e8b1ae4c31b0fc27e001c
Deleted: 80c504acf46872be1fc1d0f1e4a2ef0f56b8da2b6d4d94b22b837241f6bab792
Deleted: 23867ac8a38f11c46516fe1165eb519f8f890647cf468491e1f04e90f1040871
Deleted: 51b98f08e8b817314ec2f229848d5475315654d0c3588d36e25f44207b29c28c
Deleted: 1a81ef3aa331672d95a436dd04421ec62c92a774d9cb1ecdacefcbe3a5dcd7dd
Deleted: c67aa22b61ca2fba10e0ef014f7452772bdf3e64887e6a174eae2b46831f31ee
Build step 'Execute shell' marked build as failure

Mime
View raw message