mesos-builds mailing list archives

Site index · List index
Message view « Date » · « Thread »
Top « Date » · « Thread »
From Apache Jenkins Server <jenk...@builds.apache.org>
Subject Build failed in Jenkins: Mesos » autotools,gcc,--verbose --enable-libevent --enable-ssl,GLOG_v=1 MESOS_VERBOSE=1,centos:7,(docker||Hadoop)&&(!ubuntu-us1)&&(!ubuntu-6) #2459
Date Thu, 07 Jul 2016 01:19:02 GMT
See <https://builds.apache.org/job/Mesos/BUILDTOOL=autotools,COMPILER=gcc,CONFIGURATION=--verbose%20--enable-libevent%20--enable-ssl,ENVIRONMENT=GLOG_v=1%20MESOS_VERBOSE=1,OS=centos%3A7,label_exp=(docker%7C%7CHadoop)&&(!ubuntu-us1)&&(!ubuntu-6)/2459/changes>

Changes:

[idownes] Add Ian Downes to contributors.

[yujie.jay] Increased the timeout in DiskQuotaTest.SlaveRecovery.

------------------------------------------
[...truncated 194527 lines...]
I0707 01:19:01.161034 30411 resources.cpp:572] Parsing resources as JSON failed: cpus:2;gpus:0;mem:1024;disk:1024;ports:[31000-32000]
Trying semicolon-delimited string format instead
I0707 01:19:01.161489 30411 slave.cpp:594] Agent resources: cpus(*):2; mem(*):1024; disk(*):1024;
ports(*):[31000-32000]
I0707 01:19:01.161563 30411 slave.cpp:602] Agent attributes: [  ]
I0707 01:19:01.161577 30411 slave.cpp:607] Agent hostname: 70c6b0ee4f3a
I0707 01:19:01.163005 30397 state.cpp:57] Recovering state from '/tmp/Endpoint_SlaveEndpointTest_AuthorizedRequest_1_yVHr5n/meta'
I0707 01:19:01.163048 30411 process.cpp:3322] Handling HTTP event for process 'slave(544)'
with path: '/slave(544)/monitor/statistics.json'
I0707 01:19:01.163588 30407 status_update_manager.cpp:200] Recovering status update manager
I0707 01:19:01.163883 30401 containerizer.cpp:522] Recovering containerizer
I0707 01:19:01.163959 30404 http.cpp:767] Authorizing principal 'test-principal' to GET the
'/monitor/statistics.json' endpoint
I0707 01:19:01.165077 30397 provisioner.cpp:253] Provisioner recovery complete
I0707 01:19:01.165560 30404 slave.cpp:4856] Finished recovery
I0707 01:19:01.166035 30404 slave.cpp:5028] Querying resource estimator for oversubscribable
resources
I0707 01:19:01.166322 30411 slave.cpp:5042] Received oversubscribable resources  from the
resource estimator
I0707 01:19:01.167523 30378 slave.cpp:841] Agent terminating
[       OK ] Endpoint/SlaveEndpointTest.AuthorizedRequest/1 (23 ms)
[ RUN      ] Endpoint/SlaveEndpointTest.AuthorizedRequest/2
I0707 01:19:01.178222 30378 containerizer.cpp:196] Using isolation: posix/cpu,posix/mem,filesystem/posix,network/cni
W0707 01:19:01.179085 30378 backend.cpp:75] Failed to create 'aufs' backend: AufsBackend requires
root privileges, but is running as user mesos
W0707 01:19:01.179261 30378 backend.cpp:75] Failed to create 'bind' backend: BindBackend requires
root privileges
I0707 01:19:01.183131 30401 slave.cpp:205] Agent started on 545)@172.17.0.3:41411
I0707 01:19:01.183152 30401 slave.cpp:206] Flags at startup: --acls="" --appc_simple_discovery_uri_prefix="http://"
--appc_store_dir="/tmp/mesos/store/appc" --authenticate_http="true" --authenticatee="crammd5"
--authentication_backoff_factor="1secs" --authorizer="local" --cgroups_cpu_enable_pids_and_tids_count="false"
--cgroups_enable_cfs="false" --cgroups_hierarchy="/sys/fs/cgroup" --cgroups_limit_swap="false"
--cgroups_root="mesos" --container_disk_watch_interval="15secs" --containerizers="mesos" --credential="/tmp/Endpoint_SlaveEndpointTest_AuthorizedRequest_2_2gVMkA/credential"
--default_role="*" --disk_watch_interval="1mins" --docker="docker" --docker_kill_orphans="true"
--docker_registry="https://registry-1.docker.io" --docker_remove_delay="6hrs" --docker_socket="/var/run/docker.sock"
--docker_stop_timeout="0ns" --docker_store_dir="/tmp/mesos/store/docker" --docker_volume_checkpoint_dir="/var/run/mesos/isolators/docker/volume"
--enforce_container_disk_quota="false" --executor_registration_timeout="1mins" --executor_shutdown_grace_period="5secs"
--fetcher_cache_dir="/tmp/Endpoint_SlaveEndpointTest_AuthorizedRequest_2_2gVMkA/fetch" --fetcher_cache_size="2GB"
--frameworks_home="" --gc_delay="1weeks" --gc_disk_headroom="0.1" --hadoop_home="" --help="true"
--hostname_lookup="true" --http_authenticators="basic" --http_command_executor="false" --http_credentials="/tmp/Endpoint_SlaveEndpointTest_AuthorizedRequest_2_2gVMkA/http_credentials"
--image_provisioner_backend="copy" --initialize_driver_logging="true" --isolation="posix/cpu,posix/mem"
--launcher_dir="/mesos/mesos-1.0.0/_build/src" --logbufsecs="0" --logging_level="INFO" --oversubscribed_resources_interval="15secs"
--perf_duration="10secs" --perf_interval="1mins" --qos_correction_interval_min="0ns" --quiet="false"
--recover="reconnect" --recovery_timeout="15mins" --registration_backoff_factor="10ms" --resources="cpus:2;gpus:0;mem:1024;disk:1024;ports:[31000-32000]"
--revocable_cpu_low_priority="true" --sandbox_directory="/mnt/mesos/sandbox" --strict="true"
--switch_user="true" --systemd_enable_support="true" --systemd_runtime_directory="/run/systemd/system"
--version="false" --work_dir="/tmp/Endpoint_SlaveEndpointTest_AuthorizedRequest_2_2gVMkA"
I0707 01:19:01.183543 30401 credentials.hpp:86] Loading credential for authentication from
'/tmp/Endpoint_SlaveEndpointTest_AuthorizedRequest_2_2gVMkA/credential'
I0707 01:19:01.183688 30401 slave.cpp:343] Agent using credential for: test-principal
I0707 01:19:01.183740 30401 credentials.hpp:37] Loading credentials for authentication from
'/tmp/Endpoint_SlaveEndpointTest_AuthorizedRequest_2_2gVMkA/http_credentials'
I0707 01:19:01.184029 30401 slave.cpp:395] Using default 'basic' HTTP authenticator
I0707 01:19:01.184394 30401 resources.cpp:572] Parsing resources as JSON failed: cpus:2;gpus:0;mem:1024;disk:1024;ports:[31000-32000]
Trying semicolon-delimited string format instead
I0707 01:19:01.184659 30401 resources.cpp:572] Parsing resources as JSON failed: cpus:2;gpus:0;mem:1024;disk:1024;ports:[31000-32000]
Trying semicolon-delimited string format instead
I0707 01:19:01.185042 30401 slave.cpp:594] Agent resources: cpus(*):2; mem(*):1024; disk(*):1024;
ports(*):[31000-32000]
I0707 01:19:01.185096 30401 slave.cpp:602] Agent attributes: [  ]
I0707 01:19:01.185106 30401 slave.cpp:607] Agent hostname: 70c6b0ee4f3a
I0707 01:19:01.186379 30404 state.cpp:57] Recovering state from '/tmp/Endpoint_SlaveEndpointTest_AuthorizedRequest_2_2gVMkA/meta'
I0707 01:19:01.186436 30401 process.cpp:3322] Handling HTTP event for process 'slave(545)'
with path: '/slave(545)/containers'
I0707 01:19:01.186880 30403 status_update_manager.cpp:200] Recovering status update manager
I0707 01:19:01.187099 30409 containerizer.cpp:522] Recovering containerizer
I0707 01:19:01.187230 30411 http.cpp:767] Authorizing principal 'test-principal' to GET the
'/containers' endpoint
I0707 01:19:01.188364 30406 provisioner.cpp:253] Provisioner recovery complete
I0707 01:19:01.188689 30398 slave.cpp:4856] Finished recovery
I0707 01:19:01.189191 30398 slave.cpp:5028] Querying resource estimator for oversubscribable
resources
I0707 01:19:01.189872 30410 slave.cpp:5042] Received oversubscribable resources  from the
resource estimator
I0707 01:19:01.190302 30411 slave.cpp:841] Agent terminating
[       OK ] Endpoint/SlaveEndpointTest.AuthorizedRequest/2 (20 ms)
[ RUN      ] Endpoint/SlaveEndpointTest.UnauthorizedRequest/0
I0707 01:19:01.198789 30378 containerizer.cpp:196] Using isolation: posix/cpu,posix/mem,filesystem/posix,network/cni
W0707 01:19:01.199618 30378 backend.cpp:75] Failed to create 'aufs' backend: AufsBackend requires
root privileges, but is running as user mesos
W0707 01:19:01.199827 30378 backend.cpp:75] Failed to create 'bind' backend: BindBackend requires
root privileges
I0707 01:19:01.203339 30410 slave.cpp:205] Agent started on 546)@172.17.0.3:41411
I0707 01:19:01.203362 30410 slave.cpp:206] Flags at startup: --acls="" --appc_simple_discovery_uri_prefix="http://"
--appc_store_dir="/tmp/mesos/store/appc" --authenticate_http="true" --authenticatee="crammd5"
--authentication_backoff_factor="1secs" --authorizer="local" --cgroups_cpu_enable_pids_and_tids_count="false"
--cgroups_enable_cfs="false" --cgroups_hierarchy="/sys/fs/cgroup" --cgroups_limit_swap="false"
--cgroups_root="mesos" --container_disk_watch_interval="15secs" --containerizers="mesos" --credential="/tmp/Endpoint_SlaveEndpointTest_UnauthorizedRequest_0_0fjCKM/credential"
--default_role="*" --disk_watch_interval="1mins" --docker="docker" --docker_kill_orphans="true"
--docker_registry="https://registry-1.docker.io" --docker_remove_delay="6hrs" --docker_socket="/var/run/docker.sock"
--docker_stop_timeout="0ns" --docker_store_dir="/tmp/mesos/store/docker" --docker_volume_checkpoint_dir="/var/run/mesos/isolators/docker/volume"
--enforce_container_disk_quota="false" --executor_registration_timeout="1mins" --executor_shutdown_grace_period="5secs"
--fetcher_cache_dir="/tmp/Endpoint_SlaveEndpointTest_UnauthorizedRequest_0_0fjCKM/fetch" --fetcher_cache_size="2GB"
--frameworks_home="" --gc_delay="1weeks" --gc_disk_headroom="0.1" --hadoop_home="" --help="true"
--hostname_lookup="true" --http_authenticators="basic" --http_command_executor="false" --http_credentials="/tmp/Endpoint_SlaveEndpointTest_UnauthorizedRequest_0_0fjCKM/http_credentials"
--image_provisioner_backend="copy" --initialize_driver_logging="true" --isolation="posix/cpu,posix/mem"
--launcher_dir="/mesos/mesos-1.0.0/_build/src" --logbufsecs="0" --logging_level="INFO" --oversubscribed_resources_interval="15secs"
--perf_duration="10secs" --perf_interval="1mins" --qos_correction_interval_min="0ns" --quiet="false"
--recover="reconnect" --recovery_timeout="15mins" --registration_backoff_factor="10ms" --resources="cpus:2;gpus:0;mem:1024;disk:1024;ports:[31000-32000]"
--revocable_cpu_low_priority="true" --sandbox_directory="/mnt/mesos/sandbox" --strict="true"
--switch_user="true" --systemd_enable_support="true" --systemd_runtime_directory="/run/systemd/system"
--version="false" --work_dir="/tmp/Endpoint_SlaveEndpointTest_UnauthorizedRequest_0_0fjCKM"
I0707 01:19:01.203959 30410 credentials.hpp:86] Loading credential for authentication from
'/tmp/Endpoint_SlaveEndpointTest_UnauthorizedRequest_0_0fjCKM/credential'
I0707 01:19:01.204123 30410 slave.cpp:343] Agent using credential for: test-principal
I0707 01:19:01.204221 30410 credentials.hpp:37] Loading credentials for authentication from
'/tmp/Endpoint_SlaveEndpointTest_UnauthorizedRequest_0_0fjCKM/http_credentials'
I0707 01:19:01.204486 30410 slave.cpp:395] Using default 'basic' HTTP authenticator
I0707 01:19:01.204869 30410 resources.cpp:572] Parsing resources as JSON failed: cpus:2;gpus:0;mem:1024;disk:1024;ports:[31000-32000]
Trying semicolon-delimited string format instead
I0707 01:19:01.205164 30410 resources.cpp:572] Parsing resources as JSON failed: cpus:2;gpus:0;mem:1024;disk:1024;ports:[31000-32000]
Trying semicolon-delimited string format instead
I0707 01:19:01.205538 30410 slave.cpp:594] Agent resources: cpus(*):2; mem(*):1024; disk(*):1024;
ports(*):[31000-32000]
I0707 01:19:01.205595 30410 slave.cpp:602] Agent attributes: [  ]
I0707 01:19:01.205611 30410 slave.cpp:607] Agent hostname: 70c6b0ee4f3a
I0707 01:19:01.206754 30410 process.cpp:3322] Handling HTTP event for process 'slave(546)'
with path: '/slave(546)/monitor/statistics'
I0707 01:19:01.206780 30409 state.cpp:57] Recovering state from '/tmp/Endpoint_SlaveEndpointTest_UnauthorizedRequest_0_0fjCKM/meta'
I0707 01:19:01.207146 30397 status_update_manager.cpp:200] Recovering status update manager
I0707 01:19:01.207273 30397 containerizer.cpp:522] Recovering containerizer
I0707 01:19:01.207551 30409 http.cpp:767] Authorizing principal 'test-principal' to GET the
'/monitor/statistics' endpoint
I0707 01:19:01.208539 30405 provisioner.cpp:253] Provisioner recovery complete
I0707 01:19:01.208976 30403 slave.cpp:4856] Finished recovery
I0707 01:19:01.209467 30403 slave.cpp:5028] Querying resource estimator for oversubscribable
resources
I0707 01:19:01.209576 30403 slave.cpp:841] Agent terminating
[       OK ] Endpoint/SlaveEndpointTest.UnauthorizedRequest/0 (19 ms)
[ RUN      ] Endpoint/SlaveEndpointTest.UnauthorizedRequest/1
I0707 01:19:01.218142 30378 containerizer.cpp:196] Using isolation: posix/cpu,posix/mem,filesystem/posix,network/cni
W0707 01:19:01.219049 30378 backend.cpp:75] Failed to create 'aufs' backend: AufsBackend requires
root privileges, but is running as user mesos
W0707 01:19:01.219234 30378 backend.cpp:75] Failed to create 'bind' backend: BindBackend requires
root privileges
I0707 01:19:01.222966 30404 slave.cpp:205] Agent started on 547)@172.17.0.3:41411
I0707 01:19:01.222986 30404 slave.cpp:206] Flags at startup: --acls="" --appc_simple_discovery_uri_prefix="http://"
--appc_store_dir="/tmp/mesos/store/appc" --authenticate_http="true" --authenticatee="crammd5"
--authentication_backoff_factor="1secs" --authorizer="local" --cgroups_cpu_enable_pids_and_tids_count="false"
--cgroups_enable_cfs="false" --cgroups_hierarchy="/sys/fs/cgroup" --cgroups_limit_swap="false"
--cgroups_root="mesos" --container_disk_watch_interval="15secs" --containerizers="mesos" --credential="/tmp/Endpoint_SlaveEndpointTest_UnauthorizedRequest_1_IO7XjZ/credential"
--default_role="*" --disk_watch_interval="1mins" --docker="docker" --docker_kill_orphans="true"
--docker_registry="https://registry-1.docker.io" --docker_remove_delay="6hrs" --docker_socket="/var/run/docker.sock"
--docker_stop_timeout="0ns" --docker_store_dir="/tmp/mesos/store/docker" --docker_volume_checkpoint_dir="/var/run/mesos/isolators/docker/volume"
--enforce_container_disk_quota="false" --executor_registration_timeout="1mins" --executor_shutdown_grace_period="5secs"
--fetcher_cache_dir="/tmp/Endpoint_SlaveEndpointTest_UnauthorizedRequest_1_IO7XjZ/fetch" --fetcher_cache_size="2GB"
--frameworks_home="" --gc_delay="1weeks" --gc_disk_headroom="0.1" --hadoop_home="" --help="true"
--hostname_lookup="true" --http_authenticators="basic" --http_command_executor="false" --http_credentials="/tmp/Endpoint_SlaveEndpointTest_UnauthorizedRequest_1_IO7XjZ/http_credentials"
--image_provisioner_backend="copy" --initialize_driver_logging="true" --isolation="posix/cpu,posix/mem"
--launcher_dir="/mesos/mesos-1.0.0/_build/src" --logbufsecs="0" --logging_level="INFO" --oversubscribed_resources_interval="15secs"
--perf_duration="10secs" --perf_interval="1mins" --qos_correction_interval_min="0ns" --quiet="false"
--recover="reconnect" --recovery_timeout="15mins" --registration_backoff_factor="10ms" --resources="cpus:2;gpus:0;mem:1024;disk:1024;ports:[31000-32000]"
--revocable_cpu_low_priority="true" --sandbox_directory="/mnt/mesos/sandbox" --strict="true"
--switch_user="true" --systemd_enable_support="true" --systemd_runtime_directory="/run/systemd/system"
--version="false" --work_dir="/tmp/Endpoint_SlaveEndpointTest_UnauthorizedRequest_1_IO7XjZ"
I0707 01:19:01.223379 30404 credentials.hpp:86] Loading credential for authentication from
'/tmp/Endpoint_SlaveEndpointTest_UnauthorizedRequest_1_IO7XjZ/credential'
I0707 01:19:01.223536 30404 slave.cpp:343] Agent using credential for: test-principal
I0707 01:19:01.223572 30404 credentials.hpp:37] Loading credentials for authentication from
'/tmp/Endpoint_SlaveEndpointTest_UnauthorizedRequest_1_IO7XjZ/http_credentials'
I0707 01:19:01.223817 30404 slave.cpp:395] Using default 'basic' HTTP authenticator
I0707 01:19:01.224009 30404 resources.cpp:572] Parsing resources as JSON failed: cpus:2;gpus:0;mem:1024;disk:1024;ports:[31000-32000]
Trying semicolon-delimited string format instead
I0707 01:19:01.224253 30404 resources.cpp:572] Parsing resources as JSON failed: cpus:2;gpus:0;mem:1024;disk:1024;ports:[31000-32000]
Trying semicolon-delimited string format instead
I0707 01:19:01.224568 30404 slave.cpp:594] Agent resources: cpus(*):2; mem(*):1024; disk(*):1024;
ports(*):[31000-32000]
I0707 01:19:01.224622 30404 slave.cpp:602] Agent attributes: [  ]
I0707 01:19:01.224632 30404 slave.cpp:607] Agent hostname: 70c6b0ee4f3a
I0707 01:19:01.225726 30397 state.cpp:57] Recovering state from '/tmp/Endpoint_SlaveEndpointTest_UnauthorizedRequest_1_IO7XjZ/meta'
I0707 01:19:01.225774 30404 process.cpp:3322] Handling HTTP event for process 'slave(547)'
with path: '/slave(547)/monitor/statistics.json'
I0707 01:19:01.226140 30407 status_update_manager.cpp:200] Recovering status update manager
I0707 01:19:01.226380 30411 containerizer.cpp:522] Recovering containerizer
I0707 01:19:01.226511 30409 http.cpp:767] Authorizing principal 'test-principal' to GET the
'/monitor/statistics.json' endpoint
I0707 01:19:01.227485 30409 provisioner.cpp:253] Provisioner recovery complete
I0707 01:19:01.227756 30407 slave.cpp:4856] Finished recovery
I0707 01:19:01.228267 30407 slave.cpp:5028] Querying resource estimator for oversubscribable
resources
I0707 01:19:01.228446 30407 slave.cpp:841] Agent terminating
[       OK ] Endpoint/SlaveEndpointTest.UnauthorizedRequest/1 (18 ms)
[ RUN      ] Endpoint/SlaveEndpointTest.UnauthorizedRequest/2
I0707 01:19:01.235488 30378 containerizer.cpp:196] Using isolation: posix/cpu,posix/mem,filesystem/posix,network/cni
W0707 01:19:01.236395 30378 backend.cpp:75] Failed to create 'aufs' backend: AufsBackend requires
root privileges, but is running as user mesos
W0707 01:19:01.236647 30378 backend.cpp:75] Failed to create 'bind' backend: BindBackend requires
root privileges
I0707 01:19:01.240607 30404 slave.cpp:205] Agent started on 548)@172.17.0.3:41411
I0707 01:19:01.240736 30404 slave.cpp:206] Flags at startup: --acls="" --appc_simple_discovery_uri_prefix="http://"
--appc_store_dir="/tmp/mesos/store/appc" --authenticate_http="true" --authenticatee="crammd5"
--authentication_backoff_factor="1secs" --authorizer="local" --cgroups_cpu_enable_pids_and_tids_count="false"
--cgroups_enable_cfs="false" --cgroups_hierarchy="/sys/fs/cgroup" --cgroups_limit_swap="false"
--cgroups_root="mesos" --container_disk_watch_interval="15secs" --containerizers="mesos" --credential="/tmp/Endpoint_SlaveEndpointTest_UnauthorizedRequest_2_GTjl2b/credential"
--default_role="*" --disk_watch_interval="1mins" --docker="docker" --docker_kill_orphans="true"
--docker_registry="https://registry-1.docker.io" --docker_remove_delay="6hrs" --docker_socket="/var/run/docker.sock"
--docker_stop_timeout="0ns" --docker_store_dir="/tmp/mesos/store/docker" --docker_volume_checkpoint_dir="/var/run/mesos/isolators/docker/volume"
--enforce_container_disk_quota="false" --executor_registration_timeout="1mins" --executor_shutdown_grace_period="5secs"
--fetcher_cache_dir="/tmp/Endpoint_SlaveEndpointTest_UnauthorizedRequest_2_GTjl2b/fetch" --fetcher_cache_size="2GB"
--frameworks_home="" --gc_delay="1weeks" --gc_disk_headroom="0.1" --hadoop_home="" --help="true"
--hostname_lookup="true" --http_authenticators="basic" --http_command_executor="false" --http_credentials="/tmp/Endpoint_SlaveEndpointTest_UnauthorizedRequest_2_GTjl2b/http_credentials"
--image_provisioner_backend="copy" --initialize_driver_logging="true" --isolation="posix/cpu,posix/mem"
--launcher_dir="/mesos/mesos-1.0.0/_build/src" --logbufsecs="0" --logging_level="INFO" --oversubscribed_resources_interval="15secs"
--perf_duration="10secs" --perf_interval="1mins" --qos_correction_interval_min="0ns" --quiet="false"
--recover="reconnect" --recovery_timeout="15mins" --registration_backoff_factor="10ms" --resources="cpus:2;gpus:0;mem:1024;disk:1024;ports:[31000-32000]"
--revocable_cpu_low_priority="true" --sandbox_directory="/mnt/mesos/sandbox" --strict="true"
--switch_user="true" --systemd_enable_support="true" --systemd_runtime_directory="/run/systemd/system"
--version="false" --work_dir="/tmp/Endpoint_SlaveEndpointTest_UnauthorizedRequest_2_GTjl2b"
I0707 01:19:01.241333 30404 credentials.hpp:86] Loading credential for authentication from
'/tmp/Endpoint_SlaveEndpointTest_UnauthorizedRequest_2_GTjl2b/credential'
I0707 01:19:01.241519 30404 slave.cpp:343] Agent using credential for: test-principal
I0707 01:19:01.241556 30404 credentials.hpp:37] Loading credentials for authentication from
'/tmp/Endpoint_SlaveEndpointTest_UnauthorizedRequest_2_GTjl2b/http_credentials'
I0707 01:19:01.241855 30404 slave.cpp:395] Using default 'basic' HTTP authenticator
I0707 01:19:01.242231 30404 resources.cpp:572] Parsing resources as JSON failed: cpus:2;gpus:0;mem:1024;disk:1024;ports:[31000-32000]
Trying semicolon-delimited string format instead
I0707 01:19:01.242585 30404 resources.cpp:572] Parsing resources as JSON failed: cpus:2;gpus:0;mem:1024;disk:1024;ports:[31000-32000]
Trying semicolon-delimited string format instead
I0707 01:19:01.243080 30404 slave.cpp:594] Agent resources: cpus(*):2; mem(*):1024; disk(*):1024;
ports(*):[31000-32000]
I0707 01:19:01.243157 30404 slave.cpp:602] Agent attributes: [  ]
I0707 01:19:01.243172 30404 slave.cpp:607] Agent hostname: 70c6b0ee4f3a
I0707 01:19:01.244642 30397 state.cpp:57] Recovering state from '/tmp/Endpoint_SlaveEndpointTest_UnauthorizedRequest_2_GTjl2b/meta'
I0707 01:19:01.244693 30404 process.cpp:3322] Handling HTTP event for process 'slave(548)'
with path: '/slave(548)/containers'
I0707 01:19:01.245448 30398 status_update_manager.cpp:200] Recovering status update manager
I0707 01:19:01.245664 30405 containerizer.cpp:522] Recovering containerizer
I0707 01:19:01.245779 30400 http.cpp:767] Authorizing principal 'test-principal' to GET the
'/containers' endpoint
I0707 01:19:01.247350 30409 provisioner.cpp:253] Provisioner recovery complete
I0707 01:19:01.247787 30398 slave.cpp:841] Agent terminating
[       OK ] Endpoint/SlaveEndpointTest.UnauthorizedRequest/2 (21 ms)
[ RUN      ] Endpoint/SlaveEndpointTest.NoAuthorizer/0
I0707 01:19:01.258165 30378 containerizer.cpp:196] Using isolation: posix/cpu,posix/mem,filesystem/posix,network/cni
W0707 01:19:01.258939 30378 backend.cpp:75] Failed to create 'aufs' backend: AufsBackend requires
root privileges, but is running as user mesos
W0707 01:19:01.259131 30378 backend.cpp:75] Failed to create 'bind' backend: BindBackend requires
root privileges
I0707 01:19:01.260978 30378 cluster.cpp:432] Creating default 'local' authorizer
I0707 01:19:01.263253 30404 slave.cpp:205] Agent started on 549)@172.17.0.3:41411
I0707 01:19:01.263272 30404 slave.cpp:206] Flags at startup: --acls="" --appc_simple_discovery_uri_prefix="http://"
--appc_store_dir="/tmp/mesos/store/appc" --authenticate_http="true" --authenticatee="crammd5"
--authentication_backoff_factor="1secs" --authorizer="local" --cgroups_cpu_enable_pids_and_tids_count="false"
--cgroups_enable_cfs="false" --cgroups_hierarchy="/sys/fs/cgroup" --cgroups_limit_swap="false"
--cgroups_root="mesos" --container_disk_watch_interval="15secs" --containerizers="mesos" --credential="/tmp/Endpoint_SlaveEndpointTest_NoAuthorizer_0_mTSJiF/credential"
--default_role="*" --disk_watch_interval="1mins" --docker="docker" --docker_kill_orphans="true"
--docker_registry="https://registry-1.docker.io" --docker_remove_delay="6hrs" --docker_socket="/var/run/docker.sock"
--docker_stop_timeout="0ns" --docker_store_dir="/tmp/mesos/store/docker" --docker_volume_checkpoint_dir="/var/run/mesos/isolators/docker/volume"
--enforce_container_disk_quota="false" --executor_registration_timeout="1mins" --executor_shutdown_grace_period="5secs"
--fetcher_cache_dir="/tmp/Endpoint_SlaveEndpointTest_NoAuthorizer_0_mTSJiF/fetch" --fetcher_cache_size="2GB"
--frameworks_home="" --gc_delay="1weeks" --gc_disk_headroom="0.1" --hadoop_home="" --help="false"
--hostname_lookup="true" --http_authenticators="basic" --http_command_executor="false" --http_credentials="/tmp/Endpoint_SlaveEndpointTest_NoAuthorizer_0_mTSJiF/http_credentials"
--image_provisioner_backend="copy" --initialize_driver_logging="true" --isolation="posix/cpu,posix/mem"
--launcher_dir="/mesos/mesos-1.0.0/_build/src" --logbufsecs="0" --logging_level="INFO" --oversubscribed_resources_interval="15secs"
--perf_duration="10secs" --perf_interval="1mins" --qos_correction_interval_min="0ns" --quiet="false"
--recover="reconnect" --recovery_timeout="15mins" --registration_backoff_factor="10ms" --resources="cpus:2;gpus:0;mem:1024;disk:1024;ports:[31000-32000]"
--revocable_cpu_low_priority="true" --sandbox_directory="/mnt/mesos/sandbox" --strict="true"
--switch_user="true" --systemd_enable_support="true" --systemd_runtime_directory="/run/systemd/system"
--version="false" --work_dir="/tmp/Endpoint_SlaveEndpointTest_NoAuthorizer_0_mTSJiF"
I0707 01:19:01.263689 30404 credentials.hpp:86] Loading credential for authentication from
'/tmp/Endpoint_SlaveEndpointTest_NoAuthorizer_0_mTSJiF/credential'
I0707 01:19:01.263885 30404 slave.cpp:343] Agent using credential for: test-principal
I0707 01:19:01.263926 30404 credentials.hpp:37] Loading credentials for authentication from
'/tmp/Endpoint_SlaveEndpointTest_NoAuthorizer_0_mTSJiF/http_credentials'
I0707 01:19:01.264259 30404 slave.cpp:395] Using default 'basic' HTTP authenticator
I0707 01:19:01.264768 30404 resources.cpp:572] Parsing resources as JSON failed: cpus:2;gpus:0;mem:1024;disk:1024;ports:[31000-32000]
Trying semicolon-delimited string format instead
I0707 01:19:01.265108 30404 resources.cpp:572] Parsing resources as JSON failed: cpus:2;gpus:0;mem:1024;disk:1024;ports:[31000-32000]
Trying semicolon-delimited string format instead
I0707 01:19:01.265573 30404 slave.cpp:594] Agent resources: cpus(*):2; mem(*):1024; disk(*):1024;
ports(*):[31000-32000]
I0707 01:19:01.265647 30404 slave.cpp:602] Agent attributes: [  ]
I0707 01:19:01.265661 30404 slave.cpp:607] Agent hostname: 70c6b0ee4f3a
I0707 01:19:01.267124 30400 state.cpp:57] Recovering state from '/tmp/Endpoint_SlaveEndpointTest_NoAuthorizer_0_mTSJiF/meta'
I0707 01:19:01.267148 30404 process.cpp:3322] Handling HTTP event for process 'slave(549)'
with path: '/slave(549)/monitor/statistics'
I0707 01:19:01.267655 30401 status_update_manager.cpp:200] Recovering status update manager
I0707 01:19:01.268097 30406 containerizer.cpp:522] Recovering containerizer
I0707 01:19:01.268309 30407 http.cpp:767] Authorizing principal 'test-principal' to GET the
'/monitor/statistics' endpoint
I0707 01:19:01.269403 30412 provisioner.cpp:253] Provisioner recovery complete
I0707 01:19:01.270413 30402 slave.cpp:4856] Finished recovery
I0707 01:19:01.271153 30402 slave.cpp:5028] Querying resource estimator for oversubscribable
resources
I0707 01:19:01.271445 30410 slave.cpp:5042] Received oversubscribable resources  from the
resource estimator
I0707 01:19:01.272182 30402 slave.cpp:841] Agent terminating
[       OK ] Endpoint/SlaveEndpointTest.NoAuthorizer/0 (23 ms)
[ RUN      ] Endpoint/SlaveEndpointTest.NoAuthorizer/1
I0707 01:19:01.281869 30378 containerizer.cpp:196] Using isolation: posix/cpu,posix/mem,filesystem/posix,network/cni
W0707 01:19:01.282691 30378 backend.cpp:75] Failed to create 'aufs' backend: AufsBackend requires
root privileges, but is running as user mesos
W0707 01:19:01.282886 30378 backend.cpp:75] Failed to create 'bind' backend: BindBackend requires
root privileges
I0707 01:19:01.284301 30378 cluster.cpp:432] Creating default 'local' authorizer
I0707 01:19:01.285936 30410 slave.cpp:205] Agent started on 550)@172.17.0.3:41411
I0707 01:19:01.285958 30410 slave.cpp:206] Flags at startup: --acls="" --appc_simple_discovery_uri_prefix="http://"
--appc_store_dir="/tmp/mesos/store/appc" --authenticate_http="true" --authenticatee="crammd5"
--authentication_backoff_factor="1secs" --authorizer="local" --cgroups_cpu_enable_pids_and_tids_count="false"
--cgroups_enable_cfs="false" --cgroups_hierarchy="/sys/fs/cgroup" --cgroups_limit_swap="false"
--cgroups_root="mesos" --container_disk_watch_interval="15secs" --containerizers="mesos" --credential="/tmp/Endpoint_SlaveEndpointTest_NoAuthorizer_1_SJmLmS/credential"
--default_role="*" --disk_watch_interval="1mins" --docker="docker" --docker_kill_orphans="true"
--docker_registry="https://registry-1.docker.io" --docker_remove_delay="6hrs" --docker_socket="/var/run/docker.sock"
--docker_stop_timeout="0ns" --docker_store_dir="/tmp/mesos/store/docker" --docker_volume_checkpoint_dir="/var/run/mesos/isolators/docker/volume"
--enforce_container_disk_quota="false" --executor_registration_timeout="1mins" --executor_shutdown_grace_period="5secs"
--fetcher_cache_dir="/tmp/Endpoint_SlaveEndpointTest_NoAuthorizer_1_SJmLmS/fetch" --fetcher_cache_size="2GB"
--frameworks_home="" --gc_delay="1weeks" --gc_disk_headroom="0.1" --hadoop_home="" --help="false"
--hostname_lookup="true" --http_authenticators="basic" --http_command_executor="false" --http_credentials="/tmp/Endpoint_SlaveEndpointTest_NoAuthorizer_1_SJmLmS/http_credentials"
--image_provisioner_backend="copy" --initialize_driver_logging="true" --isolation="posix/cpu,posix/mem"
--launcher_dir="/mesos/mesos-1.0.0/_build/src" --logbufsecs="0" --logging_level="INFO" --oversubscribed_resources_interval="15secs"
--perf_duration="10secs" --perf_interval="1mins" --qos_correction_interval_min="0ns" --quiet="false"
--recover="reconnect" --recovery_timeout="15mins" --registration_backoff_factor="10ms" --resources="cpus:2;gpus:0;mem:1024;disk:1024;ports:[31000-32000]"
--revocable_cpu_low_priority="true" --sandbox_directory="/mnt/mesos/sandbox" --strict="true"
--switch_user="true" --systemd_enable_support="true" --systemd_runtime_directory="/run/systemd/system"
--version="false" --work_dir="/tmp/Endpoint_SlaveEndpointTest_NoAuthorizer_1_SJmLmS"
I0707 01:19:01.286464 30410 credentials.hpp:86] Loading credential for authentication from
'/tmp/Endpoint_SlaveEndpointTest_NoAuthorizer_1_SJmLmS/credential'
I0707 01:19:01.286638 30410 slave.cpp:343] Agent using credential for: test-principal
I0707 01:19:01.286808 30410 credentials.hpp:37] Loading credentials for authentication from
'/tmp/Endpoint_SlaveEndpointTest_NoAuthorizer_1_SJmLmS/http_credentials'
I0707 01:19:01.287204 30410 slave.cpp:395] Using default 'basic' HTTP authenticator
I0707 01:19:01.287573 30410 resources.cpp:572] Parsing resources as JSON failed: cpus:2;gpus:0;mem:1024;disk:1024;ports:[31000-32000]
Trying semicolon-delimited string format instead
I0707 01:19:01.287874 30410 resources.cpp:572] Parsing resources as JSON failed: cpus:2;gpus:0;mem:1024;disk:1024;ports:[31000-32000]
Trying semicolon-delimited string format instead
I0707 01:19:01.288267 30410 slave.cpp:594] Agent resources: cpus(*):2; mem(*):1024; disk(*):1024;
ports(*):[31000-32000]
I0707 01:19:01.288333 30410 slave.cpp:602] Agent attributes: [  ]
I0707 01:19:01.288353 30410 slave.cpp:607] Agent hostname: 70c6b0ee4f3a
I0707 01:19:01.289470 30401 state.cpp:57] Recovering state from '/tmp/Endpoint_SlaveEndpointTest_NoAuthorizer_1_SJmLmS/meta'
I0707 01:19:01.289506 30410 process.cpp:3322] Handling HTTP event for process 'slave(550)'
with path: '/slave(550)/monitor/statistics.json'
I0707 01:19:01.290184 30402 status_update_manager.cpp:200] Recovering status update manager
I0707 01:19:01.290362 30402 containerizer.cpp:522] Recovering containerizer
I0707 01:19:01.290750 30397 http.cpp:767] Authorizing principal 'test-principal' to GET the
'/monitor/statistics.json' endpoint
I0707 01:19:01.292017 30400 provisioner.cpp:253] Provisioner recovery complete
I0707 01:19:01.292899 30410 slave.cpp:4856] Finished recovery
I0707 01:19:01.293474 30410 slave.cpp:5028] Querying resource estimator for oversubscribable
resources
I0707 01:19:01.293757 30406 slave.cpp:5042] Received oversubscribable resources  from the
resource estimator
I0707 01:19:01.294914 30403 slave.cpp:841] Agent terminating
[       OK ] Endpoint/SlaveEndpointTest.NoAuthorizer/1 (23 ms)
[ RUN      ] Endpoint/SlaveEndpointTest.NoAuthorizer/2
I0707 01:19:01.305088 30378 containerizer.cpp:196] Using isolation: posix/cpu,posix/mem,filesystem/posix,network/cni
W0707 01:19:01.305933 30378 backend.cpp:75] Failed to create 'aufs' backend: AufsBackend requires
root privileges, but is running as user mesos
W0707 01:19:01.306115 30378 backend.cpp:75] Failed to create 'bind' backend: BindBackend requires
root privileges
I0707 01:19:01.307839 30378 cluster.cpp:432] Creating default 'local' authorizer
I0707 01:19:01.309824 30407 slave.cpp:205] Agent started on 551)@172.17.0.3:41411
I0707 01:19:01.309855 30407 slave.cpp:206] Flags at startup: --acls="" --appc_simple_discovery_uri_prefix="http://"
--appc_store_dir="/tmp/mesos/store/appc" --authenticate_http="true" --authenticatee="crammd5"
--authentication_backoff_factor="1secs" --authorizer="local" --cgroups_cpu_enable_pids_and_tids_count="false"
--cgroups_enable_cfs="false" --cgroups_hierarchy="/sys/fs/cgroup" --cgroups_limit_swap="false"
--cgroups_root="mesos" --container_disk_watch_interval="15secs" --containerizers="mesos" --credential="/tmp/Endpoint_SlaveEndpointTest_NoAuthorizer_2_2L0WB5/credential"
--default_role="*" --disk_watch_interval="1mins" --docker="docker" --docker_kill_orphans="true"
--docker_registry="https://registry-1.docker.io" --docker_remove_delay="6hrs" --docker_socket="/var/run/docker.sock"
--docker_stop_timeout="0ns" --docker_store_dir="/tmp/mesos/store/docker" --docker_volume_checkpoint_dir="/var/run/mesos/isolators/docker/volume"
--enforce_container_disk_quota="false" --executor_registration_timeout="1mins" --executor_shutdown_grace_period="5secs"
--fetcher_cache_dir="/tmp/Endpoint_SlaveEndpointTest_NoAuthorizer_2_2L0WB5/fetch" --fetcher_cache_size="2GB"
--frameworks_home="" --gc_delay="1weeks" --gc_disk_headroom="0.1" --hadoop_home="" --help="false"
--hostname_lookup="true" --http_authenticators="basic" --http_command_executor="false" --http_credentials="/tmp/Endpoint_SlaveEndpointTest_NoAuthorizer_2_2L0WB5/http_credentials"
--image_provisioner_backend="copy" --initialize_driver_logging="true" --isolation="posix/cpu,posix/mem"
--launcher_dir="/mesos/mesos-1.0.0/_build/src" --logbufsecs="0" --logging_level="INFO" --oversubscribed_resources_interval="15secs"
--perf_duration="10secs" --perf_interval="1mins" --qos_correction_interval_min="0ns" --quiet="false"
--recover="reconnect" --recovery_timeout="15mins" --registration_backoff_factor="10ms" --resources="cpus:2;gpus:0;mem:1024;disk:1024;ports:[31000-32000]"
--revocable_cpu_low_priority="true" --sandbox_directory="/mnt/mesos/sandbox" --strict="true"
--switch_user="true" --systemd_enable_support="true" --systemd_runtime_directory="/run/systemd/system"
--version="false" --work_dir="/tmp/Endpoint_SlaveEndpointTest_NoAuthorizer_2_2L0WB5"
I0707 01:19:01.310377 30407 credentials.hpp:86] Loading credential for authentication from
'/tmp/Endpoint_SlaveEndpointTest_NoAuthorizer_2_2L0WB5/credential'
I0707 01:19:01.310539 30407 slave.cpp:343] Agent using credential for: test-principal
I0707 01:19:01.310575 30407 credentials.hpp:37] Loading credentials for authentication from
'/tmp/Endpoint_SlaveEndpointTest_NoAuthorizer_2_2L0WB5/http_credentials'
I0707 01:19:01.310914 30407 slave.cpp:395] Using default 'basic' HTTP authenticator
I0707 01:19:01.311357 30407 resources.cpp:572] Parsing resources as JSON failed: cpus:2;gpus:0;mem:1024;disk:1024;ports:[31000-32000]
Trying semicolon-delimited string format instead
I0707 01:19:01.311816 30407 resources.cpp:572] Parsing resources as JSON failed: cpus:2;gpus:0;mem:1024;disk:1024;ports:[31000-32000]
Trying semicolon-delimited string format instead
I0707 01:19:01.312268 30407 slave.cpp:594] Agent resources: cpus(*):2; mem(*):1024; disk(*):1024;
ports(*):[31000-32000]
I0707 01:19:01.312342 30407 slave.cpp:602] Agent attributes: [  ]
I0707 01:19:01.312356 30407 slave.cpp:607] Agent hostname: 70c6b0ee4f3a
I0707 01:19:01.313571 30400 state.cpp:57] Recovering state from '/tmp/Endpoint_SlaveEndpointTest_NoAuthorizer_2_2L0WB5/meta'
I0707 01:19:01.313647 30407 process.cpp:3322] Handling HTTP event for process 'slave(551)'
with path: '/slave(551)/containers'
I0707 01:19:01.314092 30405 status_update_manager.cpp:200] Recovering status update manager
I0707 01:19:01.314355 30411 containerizer.cpp:522] Recovering containerizer
I0707 01:19:01.314440 30409 http.cpp:767] Authorizing principal 'test-principal' to GET the
'/containers' endpoint
I0707 01:19:01.315467 30402 provisioner.cpp:253] Provisioner recovery complete
I0707 01:19:01.316087 30410 slave.cpp:4856] Finished recovery
I0707 01:19:01.316653 30410 slave.cpp:5028] Querying resource estimator for oversubscribable
resources
I0707 01:19:01.316911 30412 slave.cpp:5042] Received oversubscribable resources  from the
resource estimator
I0707 01:19:01.317292 30411 slave.cpp:841] Agent terminating
[       OK ] Endpoint/SlaveEndpointTest.NoAuthorizer/2 (21 ms)
[----------] 9 tests from Endpoint/SlaveEndpointTest (195 ms total)

[----------] Global test environment tear-down
[==========] 1229 tests from 140 test cases ran. (402451 ms total)
[  PASSED  ] 1228 tests.
[  FAILED  ] 1 test, listed below:
[  FAILED  ] DiskQuotaTest.SlaveRecovery

 1 FAILED TEST
  YOU HAVE 6 DISABLED TESTS

make[4]: *** [check-local] Error 1
make[4]: Leaving directory `/mesos/mesos-1.0.0/_build/src'
make[3]: *** [check-am] Error 2
make[3]: Leaving directory `/mesos/mesos-1.0.0/_build/src'
make[2]: *** [check] Error 2
make[2]: Leaving directory `/mesos/mesos-1.0.0/_build/src'
make[1]: *** [check-recursive] Error 1
make[1]: Leaving directory `/mesos/mesos-1.0.0/_build'
make: *** [distcheck] Error 1
+ docker rmi mesos-1467852248-2325
Untagged: mesos-1467852248-2325:latest
Deleted: 977b8e5cc737a79a9f4649b16a5eb2e442739a6dec316dcfa9e9424c8e125147
Deleted: d37c82b90cecbd00bc9e6783c6a655ffb0309600cde5a5e8882bd9b48c9dbcd1
Deleted: eb5d398f1954e37f1805a8d309ff513a56471d9a78a77c638af8c070dbf954f5
Deleted: 097e057635e1eed47fad4ca5de54733e02ea3bf779a13fc49cb8c2a9a65f2c88
Deleted: 7233ce5c981169a5cd3f4c0c156a21cdb00c53ab8ec493a9a93e5f711803aa0e
Deleted: b568d5cd971a97badea18af2b5e33ef50daff32fb094f8c28954539ed4e37f10
Deleted: 5051130ffb24fa034b5e6bf4c36dd04b92735dca3decfc2e25462674cb7b931a
Deleted: 52519259d3938eb7085019c443eac0f23e3cd27605c1072e83077320a186b9c6
Deleted: 870c72aff88252fe50553c63cf0f676395955ff079302ac053aa1f0e0806d77d
Deleted: 42ac8018a8159ecd35e2af85575b26f13bad386e6ee27c0f2e8ad2db4056bed7
Deleted: 0ff73012dd6dce9b7320852c4cca9e3e120a959fa03e3bc30f00884690eb905c
Deleted: 731c19c015377ca2b22fc2f20a19a68b8a5cbff7917ac09de1ef7cb9385bd866
Deleted: 9c75c1c06197e61a9b15e8358d2e3b0346004ea7696f22f66a767bad31acd4e0
Deleted: 24aae7fa6abab48c7cdf94373f6509adaa81e88ce9f8562fce724bb82a2e0ad0
Deleted: 3096205becd7d3d4f720e7723622f3fa4fd0b2352fa81dcdf8626ae222f07b8f
Deleted: 7488ce43f6d5f0217c4b82313827fe376a575c42515e27511e66ee5e233f630a
Build step 'Execute shell' marked build as failure

Mime
View raw message