mesos-builds mailing list archives

Site index · List index
Message view « Date » · « Thread »
Top « Date » · « Thread »
From Apache Jenkins Server <jenk...@builds.apache.org>
Subject Build failed in Jenkins: Mesos » autotools,gcc,--verbose,GLOG_v=1 MESOS_VERBOSE=1,ubuntu:14.04,(docker||Hadoop)&&(!ubuntu-us1)&&(!ubuntu-6) #2471
Date Fri, 08 Jul 2016 01:47:50 GMT
See <https://builds.apache.org/job/Mesos/BUILDTOOL=autotools,COMPILER=gcc,CONFIGURATION=--verbose,ENVIRONMENT=GLOG_v=1%20MESOS_VERBOSE=1,OS=ubuntu%3A14.04,label_exp=(docker%7C%7CHadoop)&&(!ubuntu-us1)&&(!ubuntu-6)/2471/changes>

Changes:

[vinodkone] Updated Mesos version to 1.1.0.

------------------------------------------
[...truncated 196450 lines...]
I0708 01:47:47.935961 28214 slave.cpp:594] Agent resources: cpus(*):2; mem(*):1024; disk(*):1024;
ports(*):[31000-32000]
I0708 01:47:47.936022 28214 slave.cpp:602] Agent attributes: [  ]
I0708 01:47:47.936033 28214 slave.cpp:607] Agent hostname: f02903128f39
I0708 01:47:47.937626 28204 state.cpp:57] Recovering state from '/tmp/Endpoint_SlaveEndpointTest_AuthorizedRequest_1_s10EVB/meta'
I0708 01:47:47.937729 28214 process.cpp:3322] Handling HTTP event for process 'slave(550)'
with path: '/slave(550)/monitor/statistics.json'
I0708 01:47:47.938287 28203 status_update_manager.cpp:200] Recovering status update manager
I0708 01:47:47.938707 28202 containerizer.cpp:522] Recovering containerizer
I0708 01:47:47.939122 28208 http.cpp:829] Authorizing principal 'test-principal' to GET the
'/monitor/statistics.json' endpoint
I0708 01:47:47.941846 28205 provisioner.cpp:253] Provisioner recovery complete
I0708 01:47:47.942522 28208 slave.cpp:4856] Finished recovery
I0708 01:47:47.943083 28208 slave.cpp:5028] Querying resource estimator for oversubscribable
resources
I0708 01:47:47.943331 28214 slave.cpp:5042] Received oversubscribable resources  from the
resource estimator
I0708 01:47:47.944571 28205 slave.cpp:841] Agent terminating
[       OK ] Endpoint/SlaveEndpointTest.AuthorizedRequest/1 (26 ms)
[ RUN      ] Endpoint/SlaveEndpointTest.AuthorizedRequest/2
I0708 01:47:47.956245 28182 containerizer.cpp:196] Using isolation: posix/cpu,posix/mem,filesystem/posix,network/cni
W0708 01:47:47.957175 28182 backend.cpp:75] Failed to create 'aufs' backend: AufsBackend requires
root privileges, but is running as user mesos
W0708 01:47:47.957376 28182 backend.cpp:75] Failed to create 'bind' backend: BindBackend requires
root privileges
I0708 01:47:47.961094 28216 slave.cpp:205] Agent started on 551)@172.17.0.2:57743
I0708 01:47:47.961180 28216 slave.cpp:206] Flags at startup: --acls="" --appc_simple_discovery_uri_prefix="http://"
--appc_store_dir="/tmp/mesos/store/appc" --authenticate_http="true" --authenticatee="crammd5"
--authentication_backoff_factor="1secs" --authorizer="local" --cgroups_cpu_enable_pids_and_tids_count="false"
--cgroups_enable_cfs="false" --cgroups_hierarchy="/sys/fs/cgroup" --cgroups_limit_swap="false"
--cgroups_root="mesos" --container_disk_watch_interval="15secs" --containerizers="mesos" --credential="/tmp/Endpoint_SlaveEndpointTest_AuthorizedRequest_2_cMLmX6/credential"
--default_role="*" --disk_watch_interval="1mins" --docker="docker" --docker_kill_orphans="true"
--docker_registry="https://registry-1.docker.io" --docker_remove_delay="6hrs" --docker_socket="/var/run/docker.sock"
--docker_stop_timeout="0ns" --docker_store_dir="/tmp/mesos/store/docker" --docker_volume_checkpoint_dir="/var/run/mesos/isolators/docker/volume"
--enforce_container_disk_quota="false" --executor_registration_timeout="1mins" --executor_shutdown_grace_period="5secs"
--fetcher_cache_dir="/tmp/Endpoint_SlaveEndpointTest_AuthorizedRequest_2_cMLmX6/fetch" --fetcher_cache_size="2GB"
--frameworks_home="" --gc_delay="1weeks" --gc_disk_headroom="0.1" --hadoop_home="" --help="false"
--hostname_lookup="true" --http_authenticators="basic" --http_command_executor="false" --http_credentials="/tmp/Endpoint_SlaveEndpointTest_AuthorizedRequest_2_cMLmX6/http_credentials"
--image_provisioner_backend="copy" --initialize_driver_logging="true" --isolation="posix/cpu,posix/mem"
--launcher_dir="/mesos/mesos-1.1.0/_build/src" --logbufsecs="0" --logging_level="INFO" --oversubscribed_resources_interval="15secs"
--perf_duration="10secs" --perf_interval="1mins" --qos_correction_interval_min="0ns" --quiet="false"
--recover="reconnect" --recovery_timeout="15mins" --registration_backoff_factor="10ms" --resources="cpus:2;gpus:0;mem:1024;disk:1024;ports:[31000-32000]"
--revocable_cpu_low_priority="true" --sandbox_directory="/mnt/mesos/sandbox" --strict="true"
--switch_user="true" --systemd_enable_support="true" --systemd_runtime_directory="/run/systemd/system"
--version="false" --work_dir="/tmp/Endpoint_SlaveEndpointTest_AuthorizedRequest_2_cMLmX6"
I0708 01:47:47.961746 28216 credentials.hpp:86] Loading credential for authentication from
'/tmp/Endpoint_SlaveEndpointTest_AuthorizedRequest_2_cMLmX6/credential'
I0708 01:47:47.962003 28216 slave.cpp:343] Agent using credential for: test-principal
I0708 01:47:47.962054 28216 credentials.hpp:37] Loading credentials for authentication from
'/tmp/Endpoint_SlaveEndpointTest_AuthorizedRequest_2_cMLmX6/http_credentials'
I0708 01:47:47.962378 28216 slave.cpp:395] Using default 'basic' HTTP authenticator
I0708 01:47:47.962822 28216 resources.cpp:572] Parsing resources as JSON failed: cpus:2;gpus:0;mem:1024;disk:1024;ports:[31000-32000]
Trying semicolon-delimited string format instead
I0708 01:47:47.963239 28216 resources.cpp:572] Parsing resources as JSON failed: cpus:2;gpus:0;mem:1024;disk:1024;ports:[31000-32000]
Trying semicolon-delimited string format instead
I0708 01:47:47.963706 28216 slave.cpp:594] Agent resources: cpus(*):2; mem(*):1024; disk(*):1024;
ports(*):[31000-32000]
I0708 01:47:47.963778 28216 slave.cpp:602] Agent attributes: [  ]
I0708 01:47:47.963793 28216 slave.cpp:607] Agent hostname: f02903128f39
I0708 01:47:47.965512 28214 state.cpp:57] Recovering state from '/tmp/Endpoint_SlaveEndpointTest_AuthorizedRequest_2_cMLmX6/meta'
I0708 01:47:47.965565 28216 process.cpp:3322] Handling HTTP event for process 'slave(551)'
with path: '/slave(551)/containers'
I0708 01:47:47.966212 28207 status_update_manager.cpp:200] Recovering status update manager
I0708 01:47:47.966470 28203 containerizer.cpp:522] Recovering containerizer
I0708 01:47:47.966647 28207 http.cpp:829] Authorizing principal 'test-principal' to GET the
'/containers' endpoint
I0708 01:47:47.968508 28207 provisioner.cpp:253] Provisioner recovery complete
I0708 01:47:47.970244 28203 slave.cpp:4856] Finished recovery
I0708 01:47:47.971285 28203 slave.cpp:5028] Querying resource estimator for oversubscribable
resources
I0708 01:47:47.971431 28203 slave.cpp:841] Agent terminating
[       OK ] Endpoint/SlaveEndpointTest.AuthorizedRequest/2 (25 ms)
[ RUN      ] Endpoint/SlaveEndpointTest.UnauthorizedRequest/0
I0708 01:47:47.982525 28182 containerizer.cpp:196] Using isolation: posix/cpu,posix/mem,filesystem/posix,network/cni
W0708 01:47:47.983324 28182 backend.cpp:75] Failed to create 'aufs' backend: AufsBackend requires
root privileges, but is running as user mesos
W0708 01:47:47.983479 28182 backend.cpp:75] Failed to create 'bind' backend: BindBackend requires
root privileges
I0708 01:47:47.986371 28212 slave.cpp:205] Agent started on 552)@172.17.0.2:57743
I0708 01:47:47.986395 28212 slave.cpp:206] Flags at startup: --acls="" --appc_simple_discovery_uri_prefix="http://"
--appc_store_dir="/tmp/mesos/store/appc" --authenticate_http="true" --authenticatee="crammd5"
--authentication_backoff_factor="1secs" --authorizer="local" --cgroups_cpu_enable_pids_and_tids_count="false"
--cgroups_enable_cfs="false" --cgroups_hierarchy="/sys/fs/cgroup" --cgroups_limit_swap="false"
--cgroups_root="mesos" --container_disk_watch_interval="15secs" --containerizers="mesos" --credential="/tmp/Endpoint_SlaveEndpointTest_UnauthorizedRequest_0_yIy9bC/credential"
--default_role="*" --disk_watch_interval="1mins" --docker="docker" --docker_kill_orphans="true"
--docker_registry="https://registry-1.docker.io" --docker_remove_delay="6hrs" --docker_socket="/var/run/docker.sock"
--docker_stop_timeout="0ns" --docker_store_dir="/tmp/mesos/store/docker" --docker_volume_checkpoint_dir="/var/run/mesos/isolators/docker/volume"
--enforce_container_disk_quota="false" --executor_registration_timeout="1mins" --executor_shutdown_grace_period="5secs"
--fetcher_cache_dir="/tmp/Endpoint_SlaveEndpointTest_UnauthorizedRequest_0_yIy9bC/fetch" --fetcher_cache_size="2GB"
--frameworks_home="" --gc_delay="1weeks" --gc_disk_headroom="0.1" --hadoop_home="" --help="false"
--hostname_lookup="true" --http_authenticators="basic" --http_command_executor="false" --http_credentials="/tmp/Endpoint_SlaveEndpointTest_UnauthorizedRequest_0_yIy9bC/http_credentials"
--image_provisioner_backend="copy" --initialize_driver_logging="true" --isolation="posix/cpu,posix/mem"
--launcher_dir="/mesos/mesos-1.1.0/_build/src" --logbufsecs="0" --logging_level="INFO" --oversubscribed_resources_interval="15secs"
--perf_duration="10secs" --perf_interval="1mins" --qos_correction_interval_min="0ns" --quiet="false"
--recover="reconnect" --recovery_timeout="15mins" --registration_backoff_factor="10ms" --resources="cpus:2;gpus:0;mem:1024;disk:1024;ports:[31000-32000]"
--revocable_cpu_low_priority="true" --sandbox_directory="/mnt/mesos/sandbox" --strict="true"
--switch_user="true" --systemd_enable_support="true" --systemd_runtime_directory="/run/systemd/system"
--version="false" --work_dir="/tmp/Endpoint_SlaveEndpointTest_UnauthorizedRequest_0_yIy9bC"
I0708 01:47:47.987056 28212 credentials.hpp:86] Loading credential for authentication from
'/tmp/Endpoint_SlaveEndpointTest_UnauthorizedRequest_0_yIy9bC/credential'
I0708 01:47:47.987195 28212 slave.cpp:343] Agent using credential for: test-principal
I0708 01:47:47.987228 28212 credentials.hpp:37] Loading credentials for authentication from
'/tmp/Endpoint_SlaveEndpointTest_UnauthorizedRequest_0_yIy9bC/http_credentials'
I0708 01:47:47.987534 28212 slave.cpp:395] Using default 'basic' HTTP authenticator
I0708 01:47:47.987826 28212 resources.cpp:572] Parsing resources as JSON failed: cpus:2;gpus:0;mem:1024;disk:1024;ports:[31000-32000]
Trying semicolon-delimited string format instead
I0708 01:47:47.988181 28212 resources.cpp:572] Parsing resources as JSON failed: cpus:2;gpus:0;mem:1024;disk:1024;ports:[31000-32000]
Trying semicolon-delimited string format instead
I0708 01:47:47.988623 28212 slave.cpp:594] Agent resources: cpus(*):2; mem(*):1024; disk(*):1024;
ports(*):[31000-32000]
I0708 01:47:47.988683 28212 slave.cpp:602] Agent attributes: [  ]
I0708 01:47:47.988701 28212 slave.cpp:607] Agent hostname: f02903128f39
I0708 01:47:47.989964 28208 state.cpp:57] Recovering state from '/tmp/Endpoint_SlaveEndpointTest_UnauthorizedRequest_0_yIy9bC/meta'
I0708 01:47:47.990043 28212 process.cpp:3322] Handling HTTP event for process 'slave(552)'
with path: '/slave(552)/monitor/statistics'
I0708 01:47:47.990555 28210 status_update_manager.cpp:200] Recovering status update manager
I0708 01:47:47.990713 28215 containerizer.cpp:522] Recovering containerizer
I0708 01:47:47.991040 28201 http.cpp:829] Authorizing principal 'test-principal' to GET the
'/monitor/statistics' endpoint
I0708 01:47:47.991881 28207 provisioner.cpp:253] Provisioner recovery complete
I0708 01:47:47.992122 28201 slave.cpp:4856] Finished recovery
I0708 01:47:47.992700 28201 slave.cpp:5028] Querying resource estimator for oversubscribable
resources
I0708 01:47:47.993100 28211 slave.cpp:5042] Received oversubscribable resources  from the
resource estimator
I0708 01:47:47.993183 28211 slave.cpp:841] Agent terminating
[       OK ] Endpoint/SlaveEndpointTest.UnauthorizedRequest/0 (21 ms)
[ RUN      ] Endpoint/SlaveEndpointTest.UnauthorizedRequest/1
I0708 01:47:48.002347 28182 containerizer.cpp:196] Using isolation: posix/cpu,posix/mem,filesystem/posix,network/cni
W0708 01:47:48.003106 28182 backend.cpp:75] Failed to create 'aufs' backend: AufsBackend requires
root privileges, but is running as user mesos
W0708 01:47:48.003255 28182 backend.cpp:75] Failed to create 'bind' backend: BindBackend requires
root privileges
I0708 01:47:48.006431 28204 slave.cpp:205] Agent started on 553)@172.17.0.2:57743
I0708 01:47:48.006469 28204 slave.cpp:206] Flags at startup: --acls="" --appc_simple_discovery_uri_prefix="http://"
--appc_store_dir="/tmp/mesos/store/appc" --authenticate_http="true" --authenticatee="crammd5"
--authentication_backoff_factor="1secs" --authorizer="local" --cgroups_cpu_enable_pids_and_tids_count="false"
--cgroups_enable_cfs="false" --cgroups_hierarchy="/sys/fs/cgroup" --cgroups_limit_swap="false"
--cgroups_root="mesos" --container_disk_watch_interval="15secs" --containerizers="mesos" --credential="/tmp/Endpoint_SlaveEndpointTest_UnauthorizedRequest_1_6jAjB7/credential"
--default_role="*" --disk_watch_interval="1mins" --docker="docker" --docker_kill_orphans="true"
--docker_registry="https://registry-1.docker.io" --docker_remove_delay="6hrs" --docker_socket="/var/run/docker.sock"
--docker_stop_timeout="0ns" --docker_store_dir="/tmp/mesos/store/docker" --docker_volume_checkpoint_dir="/var/run/mesos/isolators/docker/volume"
--enforce_container_disk_quota="false" --executor_registration_timeout="1mins" --executor_shutdown_grace_period="5secs"
--fetcher_cache_dir="/tmp/Endpoint_SlaveEndpointTest_UnauthorizedRequest_1_6jAjB7/fetch" --fetcher_cache_size="2GB"
--frameworks_home="" --gc_delay="1weeks" --gc_disk_headroom="0.1" --hadoop_home="" --help="true"
--hostname_lookup="true" --http_authenticators="basic" --http_command_executor="false" --http_credentials="/tmp/Endpoint_SlaveEndpointTest_UnauthorizedRequest_1_6jAjB7/http_credentials"
--image_provisioner_backend="copy" --initialize_driver_logging="true" --isolation="posix/cpu,posix/mem"
--launcher_dir="/mesos/mesos-1.1.0/_build/src" --logbufsecs="0" --logging_level="INFO" --oversubscribed_resources_interval="15secs"
--perf_duration="10secs" --perf_interval="1mins" --qos_correction_interval_min="0ns" --quiet="false"
--recover="reconnect" --recovery_timeout="15mins" --registration_backoff_factor="10ms" --resources="cpus:2;gpus:0;mem:1024;disk:1024;ports:[31000-32000]"
--revocable_cpu_low_priority="true" --sandbox_directory="/mnt/mesos/sandbox" --strict="true"
--switch_user="true" --systemd_enable_support="true" --systemd_runtime_directory="/run/systemd/system"
--version="false" --work_dir="/tmp/Endpoint_SlaveEndpointTest_UnauthorizedRequest_1_6jAjB7"
I0708 01:47:48.007380 28204 credentials.hpp:86] Loading credential for authentication from
'/tmp/Endpoint_SlaveEndpointTest_UnauthorizedRequest_1_6jAjB7/credential'
I0708 01:47:48.007625 28204 slave.cpp:343] Agent using credential for: test-principal
I0708 01:47:48.007673 28204 credentials.hpp:37] Loading credentials for authentication from
'/tmp/Endpoint_SlaveEndpointTest_UnauthorizedRequest_1_6jAjB7/http_credentials'
I0708 01:47:48.008113 28204 slave.cpp:395] Using default 'basic' HTTP authenticator
I0708 01:47:48.008625 28204 resources.cpp:572] Parsing resources as JSON failed: cpus:2;gpus:0;mem:1024;disk:1024;ports:[31000-32000]
Trying semicolon-delimited string format instead
I0708 01:47:48.009034 28204 resources.cpp:572] Parsing resources as JSON failed: cpus:2;gpus:0;mem:1024;disk:1024;ports:[31000-32000]
Trying semicolon-delimited string format instead
I0708 01:47:48.009703 28204 slave.cpp:594] Agent resources: cpus(*):2; mem(*):1024; disk(*):1024;
ports(*):[31000-32000]
I0708 01:47:48.009819 28204 slave.cpp:602] Agent attributes: [  ]
I0708 01:47:48.009841 28204 slave.cpp:607] Agent hostname: f02903128f39
I0708 01:47:48.012084 28216 state.cpp:57] Recovering state from '/tmp/Endpoint_SlaveEndpointTest_UnauthorizedRequest_1_6jAjB7/meta'
I0708 01:47:48.012188 28204 process.cpp:3322] Handling HTTP event for process 'slave(553)'
with path: '/slave(553)/monitor/statistics.json'
I0708 01:47:48.012879 28207 status_update_manager.cpp:200] Recovering status update manager
I0708 01:47:48.013188 28214 containerizer.cpp:522] Recovering containerizer
I0708 01:47:48.013437 28213 http.cpp:829] Authorizing principal 'test-principal' to GET the
'/monitor/statistics.json' endpoint
I0708 01:47:48.014801 28210 provisioner.cpp:253] Provisioner recovery complete
I0708 01:47:48.015106 28207 slave.cpp:4856] Finished recovery
I0708 01:47:48.015784 28207 slave.cpp:5028] Querying resource estimator for oversubscribable
resources
I0708 01:47:48.016654 28214 slave.cpp:841] Agent terminating
[       OK ] Endpoint/SlaveEndpointTest.UnauthorizedRequest/1 (23 ms)
[ RUN      ] Endpoint/SlaveEndpointTest.UnauthorizedRequest/2
I0708 01:47:48.025954 28182 containerizer.cpp:196] Using isolation: posix/cpu,posix/mem,filesystem/posix,network/cni
W0708 01:47:48.026762 28182 backend.cpp:75] Failed to create 'aufs' backend: AufsBackend requires
root privileges, but is running as user mesos
W0708 01:47:48.027057 28182 backend.cpp:75] Failed to create 'bind' backend: BindBackend requires
root privileges
I0708 01:47:48.031533 28211 slave.cpp:205] Agent started on 554)@172.17.0.2:57743
I0708 01:47:48.031564 28211 slave.cpp:206] Flags at startup: --acls="" --appc_simple_discovery_uri_prefix="http://"
--appc_store_dir="/tmp/mesos/store/appc" --authenticate_http="true" --authenticatee="crammd5"
--authentication_backoff_factor="1secs" --authorizer="local" --cgroups_cpu_enable_pids_and_tids_count="false"
--cgroups_enable_cfs="false" --cgroups_hierarchy="/sys/fs/cgroup" --cgroups_limit_swap="false"
--cgroups_root="mesos" --container_disk_watch_interval="15secs" --containerizers="mesos" --credential="/tmp/Endpoint_SlaveEndpointTest_UnauthorizedRequest_2_4RRLbD/credential"
--default_role="*" --disk_watch_interval="1mins" --docker="docker" --docker_kill_orphans="true"
--docker_registry="https://registry-1.docker.io" --docker_remove_delay="6hrs" --docker_socket="/var/run/docker.sock"
--docker_stop_timeout="0ns" --docker_store_dir="/tmp/mesos/store/docker" --docker_volume_checkpoint_dir="/var/run/mesos/isolators/docker/volume"
--enforce_container_disk_quota="false" --executor_registration_timeout="1mins" --executor_shutdown_grace_period="5secs"
--fetcher_cache_dir="/tmp/Endpoint_SlaveEndpointTest_UnauthorizedRequest_2_4RRLbD/fetch" --fetcher_cache_size="2GB"
--frameworks_home="" --gc_delay="1weeks" --gc_disk_headroom="0.1" --hadoop_home="" --help="false"
--hostname_lookup="true" --http_authenticators="basic" --http_command_executor="false" --http_credentials="/tmp/Endpoint_SlaveEndpointTest_UnauthorizedRequest_2_4RRLbD/http_credentials"
--image_provisioner_backend="copy" --initialize_driver_logging="true" --isolation="posix/cpu,posix/mem"
--launcher_dir="/mesos/mesos-1.1.0/_build/src" --logbufsecs="0" --logging_level="INFO" --oversubscribed_resources_interval="15secs"
--perf_duration="10secs" --perf_interval="1mins" --qos_correction_interval_min="0ns" --quiet="false"
--recover="reconnect" --recovery_timeout="15mins" --registration_backoff_factor="10ms" --resources="cpus:2;gpus:0;mem:1024;disk:1024;ports:[31000-32000]"
--revocable_cpu_low_priority="true" --sandbox_directory="/mnt/mesos/sandbox" --strict="true"
--switch_user="true" --systemd_enable_support="true" --systemd_runtime_directory="/run/systemd/system"
--version="false" --work_dir="/tmp/Endpoint_SlaveEndpointTest_UnauthorizedRequest_2_4RRLbD"
I0708 01:47:48.032217 28211 credentials.hpp:86] Loading credential for authentication from
'/tmp/Endpoint_SlaveEndpointTest_UnauthorizedRequest_2_4RRLbD/credential'
I0708 01:47:48.032454 28211 slave.cpp:343] Agent using credential for: test-principal
I0708 01:47:48.032505 28211 credentials.hpp:37] Loading credentials for authentication from
'/tmp/Endpoint_SlaveEndpointTest_UnauthorizedRequest_2_4RRLbD/http_credentials'
I0708 01:47:48.032841 28211 slave.cpp:395] Using default 'basic' HTTP authenticator
I0708 01:47:48.033362 28211 resources.cpp:572] Parsing resources as JSON failed: cpus:2;gpus:0;mem:1024;disk:1024;ports:[31000-32000]
Trying semicolon-delimited string format instead
I0708 01:47:48.033787 28211 resources.cpp:572] Parsing resources as JSON failed: cpus:2;gpus:0;mem:1024;disk:1024;ports:[31000-32000]
Trying semicolon-delimited string format instead
I0708 01:47:48.034373 28211 slave.cpp:594] Agent resources: cpus(*):2; mem(*):1024; disk(*):1024;
ports(*):[31000-32000]
I0708 01:47:48.034453 28211 slave.cpp:602] Agent attributes: [  ]
I0708 01:47:48.034478 28211 slave.cpp:607] Agent hostname: f02903128f39
I0708 01:47:48.036609 28204 state.cpp:57] Recovering state from '/tmp/Endpoint_SlaveEndpointTest_UnauthorizedRequest_2_4RRLbD/meta'
I0708 01:47:48.036691 28211 process.cpp:3322] Handling HTTP event for process 'slave(554)'
with path: '/slave(554)/containers'
I0708 01:47:48.037346 28205 status_update_manager.cpp:200] Recovering status update manager
I0708 01:47:48.037592 28204 containerizer.cpp:522] Recovering containerizer
I0708 01:47:48.037818 28212 http.cpp:829] Authorizing principal 'test-principal' to GET the
'/containers' endpoint
I0708 01:47:48.039841 28211 provisioner.cpp:253] Provisioner recovery complete
I0708 01:47:48.040135 28213 slave.cpp:4856] Finished recovery
I0708 01:47:48.040732 28213 slave.cpp:5028] Querying resource estimator for oversubscribable
resources
I0708 01:47:48.040905 28213 slave.cpp:841] Agent terminating
[       OK ] Endpoint/SlaveEndpointTest.UnauthorizedRequest/2 (25 ms)
[ RUN      ] Endpoint/SlaveEndpointTest.NoAuthorizer/0
I0708 01:47:48.052127 28182 containerizer.cpp:196] Using isolation: posix/cpu,posix/mem,filesystem/posix,network/cni
W0708 01:47:48.053088 28182 backend.cpp:75] Failed to create 'aufs' backend: AufsBackend requires
root privileges, but is running as user mesos
W0708 01:47:48.053272 28182 backend.cpp:75] Failed to create 'bind' backend: BindBackend requires
root privileges
I0708 01:47:48.054797 28182 cluster.cpp:432] Creating default 'local' authorizer
I0708 01:47:48.056604 28211 slave.cpp:205] Agent started on 555)@172.17.0.2:57743
I0708 01:47:48.056628 28211 slave.cpp:206] Flags at startup: --acls="" --appc_simple_discovery_uri_prefix="http://"
--appc_store_dir="/tmp/mesos/store/appc" --authenticate_http="true" --authenticatee="crammd5"
--authentication_backoff_factor="1secs" --authorizer="local" --cgroups_cpu_enable_pids_and_tids_count="false"
--cgroups_enable_cfs="false" --cgroups_hierarchy="/sys/fs/cgroup" --cgroups_limit_swap="false"
--cgroups_root="mesos" --container_disk_watch_interval="15secs" --containerizers="mesos" --credential="/tmp/Endpoint_SlaveEndpointTest_NoAuthorizer_0_YDKwY8/credential"
--default_role="*" --disk_watch_interval="1mins" --docker="docker" --docker_kill_orphans="true"
--docker_registry="https://registry-1.docker.io" --docker_remove_delay="6hrs" --docker_socket="/var/run/docker.sock"
--docker_stop_timeout="0ns" --docker_store_dir="/tmp/mesos/store/docker" --docker_volume_checkpoint_dir="/var/run/mesos/isolators/docker/volume"
--enforce_container_disk_quota="false" --executor_registration_timeout="1mins" --executor_shutdown_grace_period="5secs"
--fetcher_cache_dir="/tmp/Endpoint_SlaveEndpointTest_NoAuthorizer_0_YDKwY8/fetch" --fetcher_cache_size="2GB"
--frameworks_home="" --gc_delay="1weeks" --gc_disk_headroom="0.1" --hadoop_home="" --help="false"
--hostname_lookup="true" --http_authenticators="basic" --http_command_executor="false" --http_credentials="/tmp/Endpoint_SlaveEndpointTest_NoAuthorizer_0_YDKwY8/http_credentials"
--image_provisioner_backend="copy" --initialize_driver_logging="true" --isolation="posix/cpu,posix/mem"
--launcher_dir="/mesos/mesos-1.1.0/_build/src" --logbufsecs="0" --logging_level="INFO" --oversubscribed_resources_interval="15secs"
--perf_duration="10secs" --perf_interval="1mins" --qos_correction_interval_min="0ns" --quiet="false"
--recover="reconnect" --recovery_timeout="15mins" --registration_backoff_factor="10ms" --resources="cpus:2;gpus:0;mem:1024;disk:1024;ports:[31000-32000]"
--revocable_cpu_low_priority="true" --sandbox_directory="/mnt/mesos/sandbox" --strict="true"
--switch_user="true" --systemd_enable_support="true" --systemd_runtime_directory="/run/systemd/system"
--version="false" --work_dir="/tmp/Endpoint_SlaveEndpointTest_NoAuthorizer_0_YDKwY8"
I0708 01:47:48.057123 28211 credentials.hpp:86] Loading credential for authentication from
'/tmp/Endpoint_SlaveEndpointTest_NoAuthorizer_0_YDKwY8/credential'
I0708 01:47:48.057272 28211 slave.cpp:343] Agent using credential for: test-principal
I0708 01:47:48.057310 28211 credentials.hpp:37] Loading credentials for authentication from
'/tmp/Endpoint_SlaveEndpointTest_NoAuthorizer_0_YDKwY8/http_credentials'
I0708 01:47:48.057579 28211 slave.cpp:395] Using default 'basic' HTTP authenticator
I0708 01:47:48.058014 28211 resources.cpp:572] Parsing resources as JSON failed: cpus:2;gpus:0;mem:1024;disk:1024;ports:[31000-32000]
Trying semicolon-delimited string format instead
I0708 01:47:48.058380 28211 resources.cpp:572] Parsing resources as JSON failed: cpus:2;gpus:0;mem:1024;disk:1024;ports:[31000-32000]
Trying semicolon-delimited string format instead
I0708 01:47:48.058856 28211 slave.cpp:594] Agent resources: cpus(*):2; mem(*):1024; disk(*):1024;
ports(*):[31000-32000]
I0708 01:47:48.058962 28211 slave.cpp:602] Agent attributes: [  ]
I0708 01:47:48.058982 28211 slave.cpp:607] Agent hostname: f02903128f39
I0708 01:47:48.060683 28208 state.cpp:57] Recovering state from '/tmp/Endpoint_SlaveEndpointTest_NoAuthorizer_0_YDKwY8/meta'
I0708 01:47:48.060781 28211 process.cpp:3322] Handling HTTP event for process 'slave(555)'
with path: '/slave(555)/monitor/statistics'
I0708 01:47:48.061333 28206 status_update_manager.cpp:200] Recovering status update manager
I0708 01:47:48.061574 28205 containerizer.cpp:522] Recovering containerizer
I0708 01:47:48.061746 28212 http.cpp:829] Authorizing principal 'test-principal' to GET the
'/monitor/statistics' endpoint
I0708 01:47:48.063069 28206 provisioner.cpp:253] Provisioner recovery complete
I0708 01:47:48.063473 28215 slave.cpp:4856] Finished recovery
I0708 01:47:48.064190 28215 slave.cpp:5028] Querying resource estimator for oversubscribable
resources
I0708 01:47:48.064503 28208 slave.cpp:5042] Received oversubscribable resources  from the
resource estimator
I0708 01:47:48.065436 28201 slave.cpp:841] Agent terminating
[       OK ] Endpoint/SlaveEndpointTest.NoAuthorizer/0 (23 ms)
[ RUN      ] Endpoint/SlaveEndpointTest.NoAuthorizer/1
I0708 01:47:48.077414 28182 containerizer.cpp:196] Using isolation: posix/cpu,posix/mem,filesystem/posix,network/cni
W0708 01:47:48.078487 28182 backend.cpp:75] Failed to create 'aufs' backend: AufsBackend requires
root privileges, but is running as user mesos
W0708 01:47:48.078644 28182 backend.cpp:75] Failed to create 'bind' backend: BindBackend requires
root privileges
I0708 01:47:48.080526 28182 cluster.cpp:432] Creating default 'local' authorizer
I0708 01:47:48.082463 28214 slave.cpp:205] Agent started on 556)@172.17.0.2:57743
I0708 01:47:48.082494 28214 slave.cpp:206] Flags at startup: --acls="" --appc_simple_discovery_uri_prefix="http://"
--appc_store_dir="/tmp/mesos/store/appc" --authenticate_http="true" --authenticatee="crammd5"
--authentication_backoff_factor="1secs" --authorizer="local" --cgroups_cpu_enable_pids_and_tids_count="false"
--cgroups_enable_cfs="false" --cgroups_hierarchy="/sys/fs/cgroup" --cgroups_limit_swap="false"
--cgroups_root="mesos" --container_disk_watch_interval="15secs" --containerizers="mesos" --credential="/tmp/Endpoint_SlaveEndpointTest_NoAuthorizer_1_kNkUWE/credential"
--default_role="*" --disk_watch_interval="1mins" --docker="docker" --docker_kill_orphans="true"
--docker_registry="https://registry-1.docker.io" --docker_remove_delay="6hrs" --docker_socket="/var/run/docker.sock"
--docker_stop_timeout="0ns" --docker_store_dir="/tmp/mesos/store/docker" --docker_volume_checkpoint_dir="/var/run/mesos/isolators/docker/volume"
--enforce_container_disk_quota="false" --executor_registration_timeout="1mins" --executor_shutdown_grace_period="5secs"
--fetcher_cache_dir="/tmp/Endpoint_SlaveEndpointTest_NoAuthorizer_1_kNkUWE/fetch" --fetcher_cache_size="2GB"
--frameworks_home="" --gc_delay="1weeks" --gc_disk_headroom="0.1" --hadoop_home="" --help="false"
--hostname_lookup="true" --http_authenticators="basic" --http_command_executor="false" --http_credentials="/tmp/Endpoint_SlaveEndpointTest_NoAuthorizer_1_kNkUWE/http_credentials"
--image_provisioner_backend="copy" --initialize_driver_logging="true" --isolation="posix/cpu,posix/mem"
--launcher_dir="/mesos/mesos-1.1.0/_build/src" --logbufsecs="0" --logging_level="INFO" --oversubscribed_resources_interval="15secs"
--perf_duration="10secs" --perf_interval="1mins" --qos_correction_interval_min="0ns" --quiet="false"
--recover="reconnect" --recovery_timeout="15mins" --registration_backoff_factor="10ms" --resources="cpus:2;gpus:0;mem:1024;disk:1024;ports:[31000-32000]"
--revocable_cpu_low_priority="true" --sandbox_directory="/mnt/mesos/sandbox" --strict="true"
--switch_user="true" --systemd_enable_support="true" --systemd_runtime_directory="/run/systemd/system"
--version="false" --work_dir="/tmp/Endpoint_SlaveEndpointTest_NoAuthorizer_1_kNkUWE"
I0708 01:47:48.083132 28214 credentials.hpp:86] Loading credential for authentication from
'/tmp/Endpoint_SlaveEndpointTest_NoAuthorizer_1_kNkUWE/credential'
I0708 01:47:48.083353 28214 slave.cpp:343] Agent using credential for: test-principal
I0708 01:47:48.083390 28214 credentials.hpp:37] Loading credentials for authentication from
'/tmp/Endpoint_SlaveEndpointTest_NoAuthorizer_1_kNkUWE/http_credentials'
I0708 01:47:48.083695 28214 slave.cpp:395] Using default 'basic' HTTP authenticator
I0708 01:47:48.084082 28214 resources.cpp:572] Parsing resources as JSON failed: cpus:2;gpus:0;mem:1024;disk:1024;ports:[31000-32000]
Trying semicolon-delimited string format instead
I0708 01:47:48.084484 28214 resources.cpp:572] Parsing resources as JSON failed: cpus:2;gpus:0;mem:1024;disk:1024;ports:[31000-32000]
Trying semicolon-delimited string format instead
I0708 01:47:48.085044 28214 slave.cpp:594] Agent resources: cpus(*):2; mem(*):1024; disk(*):1024;
ports(*):[31000-32000]
I0708 01:47:48.085132 28214 slave.cpp:602] Agent attributes: [  ]
I0708 01:47:48.085146 28214 slave.cpp:607] Agent hostname: f02903128f39
I0708 01:47:48.086761 28213 state.cpp:57] Recovering state from '/tmp/Endpoint_SlaveEndpointTest_NoAuthorizer_1_kNkUWE/meta'
I0708 01:47:48.086838 28214 process.cpp:3322] Handling HTTP event for process 'slave(556)'
with path: '/slave(556)/monitor/statistics.json'
I0708 01:47:48.087518 28215 status_update_manager.cpp:200] Recovering status update manager
I0708 01:47:48.087878 28207 containerizer.cpp:522] Recovering containerizer
I0708 01:47:48.088222 28213 http.cpp:829] Authorizing principal 'test-principal' to GET the
'/monitor/statistics.json' endpoint
I0708 01:47:48.089556 28211 provisioner.cpp:253] Provisioner recovery complete
I0708 01:47:48.089962 28206 slave.cpp:4856] Finished recovery
I0708 01:47:48.090551 28206 slave.cpp:5028] Querying resource estimator for oversubscribable
resources
I0708 01:47:48.090885 28204 slave.cpp:5042] Received oversubscribable resources  from the
resource estimator
I0708 01:47:48.092587 28202 slave.cpp:841] Agent terminating
[       OK ] Endpoint/SlaveEndpointTest.NoAuthorizer/1 (26 ms)
[ RUN      ] Endpoint/SlaveEndpointTest.NoAuthorizer/2
I0708 01:47:48.103055 28182 containerizer.cpp:196] Using isolation: posix/cpu,posix/mem,filesystem/posix,network/cni
W0708 01:47:48.103796 28182 backend.cpp:75] Failed to create 'aufs' backend: AufsBackend requires
root privileges, but is running as user mesos
W0708 01:47:48.103966 28182 backend.cpp:75] Failed to create 'bind' backend: BindBackend requires
root privileges
I0708 01:47:48.105366 28182 cluster.cpp:432] Creating default 'local' authorizer
I0708 01:47:48.107318 28202 slave.cpp:205] Agent started on 557)@172.17.0.2:57743
I0708 01:47:48.107358 28202 slave.cpp:206] Flags at startup: --acls="" --appc_simple_discovery_uri_prefix="http://"
--appc_store_dir="/tmp/mesos/store/appc" --authenticate_http="true" --authenticatee="crammd5"
--authentication_backoff_factor="1secs" --authorizer="local" --cgroups_cpu_enable_pids_and_tids_count="false"
--cgroups_enable_cfs="false" --cgroups_hierarchy="/sys/fs/cgroup" --cgroups_limit_swap="false"
--cgroups_root="mesos" --container_disk_watch_interval="15secs" --containerizers="mesos" --credential="/tmp/Endpoint_SlaveEndpointTest_NoAuthorizer_2_AdEg8a/credential"
--default_role="*" --disk_watch_interval="1mins" --docker="docker" --docker_kill_orphans="true"
--docker_registry="https://registry-1.docker.io" --docker_remove_delay="6hrs" --docker_socket="/var/run/docker.sock"
--docker_stop_timeout="0ns" --docker_store_dir="/tmp/mesos/store/docker" --docker_volume_checkpoint_dir="/var/run/mesos/isolators/docker/volume"
--enforce_container_disk_quota="false" --executor_registration_timeout="1mins" --executor_shutdown_grace_period="5secs"
--fetcher_cache_dir="/tmp/Endpoint_SlaveEndpointTest_NoAuthorizer_2_AdEg8a/fetch" --fetcher_cache_size="2GB"
--frameworks_home="" --gc_delay="1weeks" --gc_disk_headroom="0.1" --hadoop_home="" --help="false"
--hostname_lookup="true" --http_authenticators="basic" --http_command_executor="false" --http_credentials="/tmp/Endpoint_SlaveEndpointTest_NoAuthorizer_2_AdEg8a/http_credentials"
--image_provisioner_backend="copy" --initialize_driver_logging="true" --isolation="posix/cpu,posix/mem"
--launcher_dir="/mesos/mesos-1.1.0/_build/src" --logbufsecs="0" --logging_level="INFO" --oversubscribed_resources_interval="15secs"
--perf_duration="10secs" --perf_interval="1mins" --qos_correction_interval_min="0ns" --quiet="false"
--recover="reconnect" --recovery_timeout="15mins" --registration_backoff_factor="10ms" --resources="cpus:2;gpus:0;mem:1024;disk:1024;ports:[31000-32000]"
--revocable_cpu_low_priority="true" --sandbox_directory="/mnt/mesos/sandbox" --strict="true"
--switch_user="true" --systemd_enable_support="true" --systemd_runtime_directory="/run/systemd/system"
--version="false" --work_dir="/tmp/Endpoint_SlaveEndpointTest_NoAuthorizer_2_AdEg8a"
I0708 01:47:48.107981 28202 credentials.hpp:86] Loading credential for authentication from
'/tmp/Endpoint_SlaveEndpointTest_NoAuthorizer_2_AdEg8a/credential'
I0708 01:47:48.108214 28202 slave.cpp:343] Agent using credential for: test-principal
I0708 01:47:48.108268 28202 credentials.hpp:37] Loading credentials for authentication from
'/tmp/Endpoint_SlaveEndpointTest_NoAuthorizer_2_AdEg8a/http_credentials'
I0708 01:47:48.108512 28202 slave.cpp:395] Using default 'basic' HTTP authenticator
I0708 01:47:48.108898 28202 resources.cpp:572] Parsing resources as JSON failed: cpus:2;gpus:0;mem:1024;disk:1024;ports:[31000-32000]
Trying semicolon-delimited string format instead
I0708 01:47:48.109308 28202 resources.cpp:572] Parsing resources as JSON failed: cpus:2;gpus:0;mem:1024;disk:1024;ports:[31000-32000]
Trying semicolon-delimited string format instead
I0708 01:47:48.109705 28202 slave.cpp:594] Agent resources: cpus(*):2; mem(*):1024; disk(*):1024;
ports(*):[31000-32000]
I0708 01:47:48.109767 28202 slave.cpp:602] Agent attributes: [  ]
I0708 01:47:48.109779 28202 slave.cpp:607] Agent hostname: f02903128f39
I0708 01:47:48.111439 28206 state.cpp:57] Recovering state from '/tmp/Endpoint_SlaveEndpointTest_NoAuthorizer_2_AdEg8a/meta'
I0708 01:47:48.111539 28202 process.cpp:3322] Handling HTTP event for process 'slave(557)'
with path: '/slave(557)/containers'
I0708 01:47:48.112068 28214 status_update_manager.cpp:200] Recovering status update manager
I0708 01:47:48.112251 28208 containerizer.cpp:522] Recovering containerizer
I0708 01:47:48.112588 28204 http.cpp:829] Authorizing principal 'test-principal' to GET the
'/containers' endpoint
I0708 01:47:48.113613 28207 provisioner.cpp:253] Provisioner recovery complete
I0708 01:47:48.113893 28213 slave.cpp:4856] Finished recovery
I0708 01:47:48.114651 28213 slave.cpp:5028] Querying resource estimator for oversubscribable
resources
I0708 01:47:48.114938 28208 slave.cpp:5042] Received oversubscribable resources  from the
resource estimator
I0708 01:47:48.115690 28214 slave.cpp:841] Agent terminating
[       OK ] Endpoint/SlaveEndpointTest.NoAuthorizer/2 (21 ms)
[----------] 9 tests from Endpoint/SlaveEndpointTest (217 ms total)

[----------] Global test environment tear-down
[==========] 1236 tests from 139 test cases ran. (400256 ms total)
[  PASSED  ] 1234 tests.
[  FAILED  ] 2 tests, listed below:
[  FAILED  ] ContentType/MasterAPITest.GetAgents/0, where GetParam() = application/x-protobuf
[  FAILED  ] ContentType/MasterAPITest.GetAgents/1, where GetParam() = application/json

 2 FAILED TESTS
  YOU HAVE 6 DISABLED TESTS

make[4]: *** [check-local] Error 1
make[4]: Leaving directory `/mesos/mesos-1.1.0/_build/src'
make[3]: *** [check-am] Error 2
make[3]: Leaving directory `/mesos/mesos-1.1.0/_build/src'
make[2]: *** [check] Error 2
make[2]: Leaving directory `/mesos/mesos-1.1.0/_build/src'
make[1]: *** [check-recursive] Error 1
make[1]: Leaving directory `/mesos/mesos-1.1.0/_build'
make: *** [distcheck] Error 1
+ docker rmi mesos-1467940147-31579
Untagged: mesos-1467940147-31579:latest
Deleted: b885086a3882728218207bb935b9f159fc277ee319f5e346876f3c274263ba79
Deleted: 58c5e928a566a1c737b8bac39deb4b0a49e1faed8cdd371e1880772f4505fcde
Deleted: 0a30b1558c6038a82dd24a3fa8207ffca178973264f8f088c2291bc3634db9ab
Deleted: 76d0df8f85efcc5507e75f201a3fd2c87fa01333ed0e4441a99900f4b8ab52ed
Deleted: c03687820c1badaa11a45c60d0bf1675965ecc0f6336932874c2951b94b50ebd
Deleted: e33759281e7ad39f47712346433de60ba35bfadbb7de2ff24181265163e3c01b
Deleted: 1099cf45ceeab1163d0a790195cafcd553a16659271e9f9d3eebdc7bd28b9fdc
Deleted: 547102259b5c099a049c5a4243f3bb94860f3245acea0dabd030f6d073c5a4f6
Deleted: b93536179910d2ad91d05944a904f8b3bc7216b14377b192c33eb772446c5d19
Deleted: 750f4482893c989b73aa3acec234b1e9d4fb000314a7525f5a9d3220934d0090
Deleted: 495753cd7aa676ea36c463e3d8e826e55a9c6513c881ab0fd8c029bcc3bf4ee4
Deleted: 9b20d5723c659ff299c1d4df76c191a41e64c97da4b472317ceee8a64d0ea4a1
Deleted: 0c3ae1b40d781b1873a5003cd33fc7776549543b37735e71c7234ddad06f9e98
Deleted: 4e194fdfd89abfb37b22cbccd1325a707ca9c661aa74753a142a1cde7c9dac76
Deleted: e84f85cdcabda470cfadab9aff3d21c9cf88a63526c9194d88c0adcc649f76be
Build step 'Execute shell' marked build as failure

Mime
View raw message