mesos-builds mailing list archives

Site index · List index
Message view « Date » · « Thread »
Top « Date » · « Thread »
From Apache Jenkins Server <jenk...@builds.apache.org>
Subject Build failed in Jenkins: mesos-reviewbot #14221
Date Fri, 08 Jul 2016 14:06:39 GMT
See <https://builds.apache.org/job/mesos-reviewbot/14221/changes>

Changes:

[alexr] Fixed lambda formatting in "slave/http.cpp".

[alexr] Added self to contributors list.

------------------------------------------
[...truncated 199773 lines...]
I0708 14:06:40.042774 28130 slave.cpp:602] Agent attributes: [  ]
I0708 14:06:40.042784 28130 slave.cpp:607] Agent hostname: e9defb297f9d
I0708 14:06:40.043920 28124 state.cpp:57] Recovering state from '/tmp/Endpoint_SlaveEndpointTest_AuthorizedRequest_1_wJsXlM/meta'
I0708 14:06:40.044018 28130 process.cpp:3322] Handling HTTP event for process 'slave(550)'
with path: '/slave(550)/monitor/statistics.json'
I0708 14:06:40.044584 28128 status_update_manager.cpp:200] Recovering status update manager
I0708 14:06:40.044728 28128 containerizer.cpp:522] Recovering containerizer
I0708 14:06:40.045246 28132 http.cpp:829] Authorizing principal 'test-principal' to GET the
'/monitor/statistics.json' endpoint
I0708 14:06:40.045761 28128 provisioner.cpp:253] Provisioner recovery complete
I0708 14:06:40.046443 28132 slave.cpp:4856] Finished recovery
I0708 14:06:40.046908 28132 slave.cpp:5028] Querying resource estimator for oversubscribable
resources
I0708 14:06:40.047194 28127 slave.cpp:5042] Received oversubscribable resources  from the
resource estimator
I0708 14:06:40.048277 28126 slave.cpp:841] Agent terminating
[       OK ] Endpoint/SlaveEndpointTest.AuthorizedRequest/1 (20 ms)
[ RUN      ] Endpoint/SlaveEndpointTest.AuthorizedRequest/2
I0708 14:06:40.066215 28100 containerizer.cpp:196] Using isolation: posix/cpu,posix/mem,filesystem/posix,network/cni
W0708 14:06:40.067514 28100 backend.cpp:75] Failed to create 'aufs' backend: AufsBackend requires
root privileges, but is running as user mesos
W0708 14:06:40.067843 28100 backend.cpp:75] Failed to create 'bind' backend: BindBackend requires
root privileges
I0708 14:06:40.072988 28133 slave.cpp:205] Agent started on 551)@172.17.0.2:58824
I0708 14:06:40.073029 28133 slave.cpp:206] Flags at startup: --acls="" --appc_simple_discovery_uri_prefix="http://"
--appc_store_dir="/tmp/mesos/store/appc" --authenticate_http="true" --authenticatee="crammd5"
--authentication_backoff_factor="1secs" --authorizer="local" --cgroups_cpu_enable_pids_and_tids_count="false"
--cgroups_enable_cfs="false" --cgroups_hierarchy="/sys/fs/cgroup" --cgroups_limit_swap="false"
--cgroups_root="mesos" --container_disk_watch_interval="15secs" --containerizers="mesos" --credential="/tmp/Endpoint_SlaveEndpointTest_AuthorizedRequest_2_I96Q1M/credential"
--default_role="*" --disk_watch_interval="1mins" --docker="docker" --docker_kill_orphans="true"
--docker_registry="https://registry-1.docker.io" --docker_remove_delay="6hrs" --docker_socket="/var/run/docker.sock"
--docker_stop_timeout="0ns" --docker_store_dir="/tmp/mesos/store/docker" --docker_volume_checkpoint_dir="/var/run/mesos/isolators/docker/volume"
--enforce_container_disk_quota="false" --executor_registration_timeout="1mins" --executor_shutdown_grace_period="5secs"
--fetcher_cache_dir="/tmp/Endpoint_SlaveEndpointTest_AuthorizedRequest_2_I96Q1M/fetch" --fetcher_cache_size="2GB"
--frameworks_home="" --gc_delay="1weeks" --gc_disk_headroom="0.1" --hadoop_home="" --help="true"
--hostname_lookup="true" --http_authenticators="basic" --http_command_executor="false" --http_credentials="/tmp/Endpoint_SlaveEndpointTest_AuthorizedRequest_2_I96Q1M/http_credentials"
--image_provisioner_backend="copy" --initialize_driver_logging="true" --isolation="posix/cpu,posix/mem"
--launcher_dir="/mesos/mesos-1.1.0/_build/src" --logbufsecs="0" --logging_level="INFO" --oversubscribed_resources_interval="15secs"
--perf_duration="10secs" --perf_interval="1mins" --qos_correction_interval_min="0ns" --quiet="false"
--recover="reconnect" --recovery_timeout="15mins" --registration_backoff_factor="10ms" --resources="cpus:2;gpus:0;mem:1024;disk:1024;ports:[31000-32000]"
--revocable_cpu_low_priority="true" --sandbox_directory="/mnt/mesos/sandbox" --strict="true"
--switch_user="true" --systemd_enable_support="true" --systemd_runtime_directory="/run/systemd/system"
--version="false" --work_dir="/tmp/Endpoint_SlaveEndpointTest_AuthorizedRequest_2_I96Q1M"
I0708 14:06:40.073701 28133 credentials.hpp:86] Loading credential for authentication from
'/tmp/Endpoint_SlaveEndpointTest_AuthorizedRequest_2_I96Q1M/credential'
I0708 14:06:40.074036 28133 slave.cpp:343] Agent using credential for: test-principal
I0708 14:06:40.074071 28133 credentials.hpp:37] Loading credentials for authentication from
'/tmp/Endpoint_SlaveEndpointTest_AuthorizedRequest_2_I96Q1M/http_credentials'
I0708 14:06:40.074414 28133 slave.cpp:395] Using default 'basic' HTTP authenticator
I0708 14:06:40.075050 28133 resources.cpp:572] Parsing resources as JSON failed: cpus:2;gpus:0;mem:1024;disk:1024;ports:[31000-32000]
Trying semicolon-delimited string format instead
I0708 14:06:40.075474 28133 resources.cpp:572] Parsing resources as JSON failed: cpus:2;gpus:0;mem:1024;disk:1024;ports:[31000-32000]
Trying semicolon-delimited string format instead
I0708 14:06:40.076181 28133 slave.cpp:594] Agent resources: cpus(*):2; mem(*):1024; disk(*):1024;
ports(*):[31000-32000]
I0708 14:06:40.076261 28133 slave.cpp:602] Agent attributes: [  ]
I0708 14:06:40.076274 28133 slave.cpp:607] Agent hostname: e9defb297f9d
I0708 14:06:40.078306 28128 state.cpp:57] Recovering state from '/tmp/Endpoint_SlaveEndpointTest_AuthorizedRequest_2_I96Q1M/meta'
I0708 14:06:40.079071 28133 process.cpp:3322] Handling HTTP event for process 'slave(551)'
with path: '/slave(551)/containers'
I0708 14:06:40.079653 28130 status_update_manager.cpp:200] Recovering status update manager
I0708 14:06:40.080086 28130 containerizer.cpp:522] Recovering containerizer
I0708 14:06:40.080238 28133 http.cpp:829] Authorizing principal 'test-principal' to GET the
'/containers' endpoint
I0708 14:06:40.082437 28133 provisioner.cpp:253] Provisioner recovery complete
I0708 14:06:40.082833 28129 slave.cpp:4856] Finished recovery
I0708 14:06:40.083526 28129 slave.cpp:5028] Querying resource estimator for oversubscribable
resources
I0708 14:06:40.083716 28129 slave.cpp:5042] Received oversubscribable resources  from the
resource estimator
I0708 14:06:40.085685 28131 slave.cpp:841] Agent terminating
[       OK ] Endpoint/SlaveEndpointTest.AuthorizedRequest/2 (28 ms)
[ RUN      ] Endpoint/SlaveEndpointTest.UnauthorizedRequest/0
I0708 14:06:40.093755 28100 containerizer.cpp:196] Using isolation: posix/cpu,posix/mem,filesystem/posix,network/cni
W0708 14:06:40.094441 28100 backend.cpp:75] Failed to create 'aufs' backend: AufsBackend requires
root privileges, but is running as user mesos
W0708 14:06:40.094589 28100 backend.cpp:75] Failed to create 'bind' backend: BindBackend requires
root privileges
I0708 14:06:40.097298 28129 slave.cpp:205] Agent started on 552)@172.17.0.2:58824
I0708 14:06:40.097321 28129 slave.cpp:206] Flags at startup: --acls="" --appc_simple_discovery_uri_prefix="http://"
--appc_store_dir="/tmp/mesos/store/appc" --authenticate_http="true" --authenticatee="crammd5"
--authentication_backoff_factor="1secs" --authorizer="local" --cgroups_cpu_enable_pids_and_tids_count="false"
--cgroups_enable_cfs="false" --cgroups_hierarchy="/sys/fs/cgroup" --cgroups_limit_swap="false"
--cgroups_root="mesos" --container_disk_watch_interval="15secs" --containerizers="mesos" --credential="/tmp/Endpoint_SlaveEndpointTest_UnauthorizedRequest_0_O4Q1WN/credential"
--default_role="*" --disk_watch_interval="1mins" --docker="docker" --docker_kill_orphans="true"
--docker_registry="https://registry-1.docker.io" --docker_remove_delay="6hrs" --docker_socket="/var/run/docker.sock"
--docker_stop_timeout="0ns" --docker_store_dir="/tmp/mesos/store/docker" --docker_volume_checkpoint_dir="/var/run/mesos/isolators/docker/volume"
--enforce_container_disk_quota="false" --executor_registration_timeout="1mins" --executor_shutdown_grace_period="5secs"
--fetcher_cache_dir="/tmp/Endpoint_SlaveEndpointTest_UnauthorizedRequest_0_O4Q1WN/fetch" --fetcher_cache_size="2GB"
--frameworks_home="" --gc_delay="1weeks" --gc_disk_headroom="0.1" --hadoop_home="" --help="false"
--hostname_lookup="true" --http_authenticators="basic" --http_command_executor="false" --http_credentials="/tmp/Endpoint_SlaveEndpointTest_UnauthorizedRequest_0_O4Q1WN/http_credentials"
--image_provisioner_backend="copy" --initialize_driver_logging="true" --isolation="posix/cpu,posix/mem"
--launcher_dir="/mesos/mesos-1.1.0/_build/src" --logbufsecs="0" --logging_level="INFO" --oversubscribed_resources_interval="15secs"
--perf_duration="10secs" --perf_interval="1mins" --qos_correction_interval_min="0ns" --quiet="false"
--recover="reconnect" --recovery_timeout="15mins" --registration_backoff_factor="10ms" --resources="cpus:2;gpus:0;mem:1024;disk:1024;ports:[31000-32000]"
--revocable_cpu_low_priority="true" --sandbox_directory="/mnt/mesos/sandbox" --strict="true"
--switch_user="true" --systemd_enable_support="true" --systemd_runtime_directory="/run/systemd/system"
--version="false" --work_dir="/tmp/Endpoint_SlaveEndpointTest_UnauthorizedRequest_0_O4Q1WN"
I0708 14:06:40.097831 28129 credentials.hpp:86] Loading credential for authentication from
'/tmp/Endpoint_SlaveEndpointTest_UnauthorizedRequest_0_O4Q1WN/credential'
I0708 14:06:40.098140 28129 slave.cpp:343] Agent using credential for: test-principal
I0708 14:06:40.098173 28129 credentials.hpp:37] Loading credentials for authentication from
'/tmp/Endpoint_SlaveEndpointTest_UnauthorizedRequest_0_O4Q1WN/http_credentials'
I0708 14:06:40.098436 28129 slave.cpp:395] Using default 'basic' HTTP authenticator
I0708 14:06:40.098794 28129 resources.cpp:572] Parsing resources as JSON failed: cpus:2;gpus:0;mem:1024;disk:1024;ports:[31000-32000]
Trying semicolon-delimited string format instead
I0708 14:06:40.099154 28129 resources.cpp:572] Parsing resources as JSON failed: cpus:2;gpus:0;mem:1024;disk:1024;ports:[31000-32000]
Trying semicolon-delimited string format instead
I0708 14:06:40.099490 28129 slave.cpp:594] Agent resources: cpus(*):2; mem(*):1024; disk(*):1024;
ports(*):[31000-32000]
I0708 14:06:40.099545 28129 slave.cpp:602] Agent attributes: [  ]
I0708 14:06:40.099555 28129 slave.cpp:607] Agent hostname: e9defb297f9d
I0708 14:06:40.100853 28121 state.cpp:57] Recovering state from '/tmp/Endpoint_SlaveEndpointTest_UnauthorizedRequest_0_O4Q1WN/meta'
I0708 14:06:40.100872 28129 process.cpp:3322] Handling HTTP event for process 'slave(552)'
with path: '/slave(552)/monitor/statistics'
I0708 14:06:40.101501 28130 status_update_manager.cpp:200] Recovering status update manager
I0708 14:06:40.101799 28121 containerizer.cpp:522] Recovering containerizer
I0708 14:06:40.101969 28125 http.cpp:829] Authorizing principal 'test-principal' to GET the
'/monitor/statistics' endpoint
I0708 14:06:40.103458 28124 provisioner.cpp:253] Provisioner recovery complete
I0708 14:06:40.103839 28119 slave.cpp:4856] Finished recovery
I0708 14:06:40.104348 28119 slave.cpp:5028] Querying resource estimator for oversubscribable
resources
I0708 14:06:40.104460 28119 slave.cpp:841] Agent terminating
[       OK ] Endpoint/SlaveEndpointTest.UnauthorizedRequest/0 (18 ms)
[ RUN      ] Endpoint/SlaveEndpointTest.UnauthorizedRequest/1
I0708 14:06:40.116008 28100 containerizer.cpp:196] Using isolation: posix/cpu,posix/mem,filesystem/posix,network/cni
W0708 14:06:40.117061 28100 backend.cpp:75] Failed to create 'aufs' backend: AufsBackend requires
root privileges, but is running as user mesos
W0708 14:06:40.117229 28100 backend.cpp:75] Failed to create 'bind' backend: BindBackend requires
root privileges
I0708 14:06:40.120282 28120 slave.cpp:205] Agent started on 553)@172.17.0.2:58824
I0708 14:06:40.120335 28120 slave.cpp:206] Flags at startup: --acls="" --appc_simple_discovery_uri_prefix="http://"
--appc_store_dir="/tmp/mesos/store/appc" --authenticate_http="true" --authenticatee="crammd5"
--authentication_backoff_factor="1secs" --authorizer="local" --cgroups_cpu_enable_pids_and_tids_count="false"
--cgroups_enable_cfs="false" --cgroups_hierarchy="/sys/fs/cgroup" --cgroups_limit_swap="false"
--cgroups_root="mesos" --container_disk_watch_interval="15secs" --containerizers="mesos" --credential="/tmp/Endpoint_SlaveEndpointTest_UnauthorizedRequest_1_vQtx2O/credential"
--default_role="*" --disk_watch_interval="1mins" --docker="docker" --docker_kill_orphans="true"
--docker_registry="https://registry-1.docker.io" --docker_remove_delay="6hrs" --docker_socket="/var/run/docker.sock"
--docker_stop_timeout="0ns" --docker_store_dir="/tmp/mesos/store/docker" --docker_volume_checkpoint_dir="/var/run/mesos/isolators/docker/volume"
--enforce_container_disk_quota="false" --executor_registration_timeout="1mins" --executor_shutdown_grace_period="5secs"
--fetcher_cache_dir="/tmp/Endpoint_SlaveEndpointTest_UnauthorizedRequest_1_vQtx2O/fetch" --fetcher_cache_size="2GB"
--frameworks_home="" --gc_delay="1weeks" --gc_disk_headroom="0.1" --hadoop_home="" --help="false"
--hostname_lookup="true" --http_authenticators="basic" --http_command_executor="false" --http_credentials="/tmp/Endpoint_SlaveEndpointTest_UnauthorizedRequest_1_vQtx2O/http_credentials"
--image_provisioner_backend="copy" --initialize_driver_logging="true" --isolation="posix/cpu,posix/mem"
--launcher_dir="/mesos/mesos-1.1.0/_build/src" --logbufsecs="0" --logging_level="INFO" --oversubscribed_resources_interval="15secs"
--perf_duration="10secs" --perf_interval="1mins" --qos_correction_interval_min="0ns" --quiet="false"
--recover="reconnect" --recovery_timeout="15mins" --registration_backoff_factor="10ms" --resources="cpus:2;gpus:0;mem:1024;disk:1024;ports:[31000-32000]"
--revocable_cpu_low_priority="true" --sandbox_directory="/mnt/mesos/sandbox" --strict="true"
--switch_user="true" --systemd_enable_support="true" --systemd_runtime_directory="/run/systemd/system"
--version="false" --work_dir="/tmp/Endpoint_SlaveEndpointTest_UnauthorizedRequest_1_vQtx2O"
I0708 14:06:40.121909 28120 credentials.hpp:86] Loading credential for authentication from
'/tmp/Endpoint_SlaveEndpointTest_UnauthorizedRequest_1_vQtx2O/credential'
I0708 14:06:40.122151 28120 slave.cpp:343] Agent using credential for: test-principal
I0708 14:06:40.122185 28120 credentials.hpp:37] Loading credentials for authentication from
'/tmp/Endpoint_SlaveEndpointTest_UnauthorizedRequest_1_vQtx2O/http_credentials'
I0708 14:06:40.122453 28120 slave.cpp:395] Using default 'basic' HTTP authenticator
I0708 14:06:40.122755 28120 resources.cpp:572] Parsing resources as JSON failed: cpus:2;gpus:0;mem:1024;disk:1024;ports:[31000-32000]
Trying semicolon-delimited string format instead
I0708 14:06:40.123066 28120 resources.cpp:572] Parsing resources as JSON failed: cpus:2;gpus:0;mem:1024;disk:1024;ports:[31000-32000]
Trying semicolon-delimited string format instead
I0708 14:06:40.123410 28120 slave.cpp:594] Agent resources: cpus(*):2; mem(*):1024; disk(*):1024;
ports(*):[31000-32000]
I0708 14:06:40.123467 28120 slave.cpp:602] Agent attributes: [  ]
I0708 14:06:40.123477 28120 slave.cpp:607] Agent hostname: e9defb297f9d
I0708 14:06:40.124821 28126 state.cpp:57] Recovering state from '/tmp/Endpoint_SlaveEndpointTest_UnauthorizedRequest_1_vQtx2O/meta'
I0708 14:06:40.124894 28120 process.cpp:3322] Handling HTTP event for process 'slave(553)'
with path: '/slave(553)/monitor/statistics.json'
I0708 14:06:40.125392 28127 status_update_manager.cpp:200] Recovering status update manager
I0708 14:06:40.125555 28123 containerizer.cpp:522] Recovering containerizer
I0708 14:06:40.126247 28126 http.cpp:829] Authorizing principal 'test-principal' to GET the
'/monitor/statistics.json' endpoint
I0708 14:06:40.126912 28126 provisioner.cpp:253] Provisioner recovery complete
I0708 14:06:40.127521 28130 slave.cpp:4856] Finished recovery
I0708 14:06:40.128368 28130 slave.cpp:5028] Querying resource estimator for oversubscribable
resources
I0708 14:06:40.128685 28130 slave.cpp:841] Agent terminating
[       OK ] Endpoint/SlaveEndpointTest.UnauthorizedRequest/1 (22 ms)
[ RUN      ] Endpoint/SlaveEndpointTest.UnauthorizedRequest/2
I0708 14:06:40.141322 28100 containerizer.cpp:196] Using isolation: posix/cpu,posix/mem,filesystem/posix,network/cni
W0708 14:06:40.142082 28100 backend.cpp:75] Failed to create 'aufs' backend: AufsBackend requires
root privileges, but is running as user mesos
W0708 14:06:40.142247 28100 backend.cpp:75] Failed to create 'bind' backend: BindBackend requires
root privileges
I0708 14:06:40.145822 28132 slave.cpp:205] Agent started on 554)@172.17.0.2:58824
I0708 14:06:40.145941 28132 slave.cpp:206] Flags at startup: --acls="" --appc_simple_discovery_uri_prefix="http://"
--appc_store_dir="/tmp/mesos/store/appc" --authenticate_http="true" --authenticatee="crammd5"
--authentication_backoff_factor="1secs" --authorizer="local" --cgroups_cpu_enable_pids_and_tids_count="false"
--cgroups_enable_cfs="false" --cgroups_hierarchy="/sys/fs/cgroup" --cgroups_limit_swap="false"
--cgroups_root="mesos" --container_disk_watch_interval="15secs" --containerizers="mesos" --credential="/tmp/Endpoint_SlaveEndpointTest_UnauthorizedRequest_2_f2ImkQ/credential"
--default_role="*" --disk_watch_interval="1mins" --docker="docker" --docker_kill_orphans="true"
--docker_registry="https://registry-1.docker.io" --docker_remove_delay="6hrs" --docker_socket="/var/run/docker.sock"
--docker_stop_timeout="0ns" --docker_store_dir="/tmp/mesos/store/docker" --docker_volume_checkpoint_dir="/var/run/mesos/isolators/docker/volume"
--enforce_container_disk_quota="false" --executor_registration_timeout="1mins" --executor_shutdown_grace_period="5secs"
--fetcher_cache_dir="/tmp/Endpoint_SlaveEndpointTest_UnauthorizedRequest_2_f2ImkQ/fetch" --fetcher_cache_size="2GB"
--frameworks_home="" --gc_delay="1weeks" --gc_disk_headroom="0.1" --hadoop_home="" --help="false"
--hostname_lookup="true" --http_authenticators="basic" --http_command_executor="false" --http_credentials="/tmp/Endpoint_SlaveEndpointTest_UnauthorizedRequest_2_f2ImkQ/http_credentials"
--image_provisioner_backend="copy" --initialize_driver_logging="true" --isolation="posix/cpu,posix/mem"
--launcher_dir="/mesos/mesos-1.1.0/_build/src" --logbufsecs="0" --logging_level="INFO" --oversubscribed_resources_interval="15secs"
--perf_duration="10secs" --perf_interval="1mins" --qos_correction_interval_min="0ns" --quiet="false"
--recover="reconnect" --recovery_timeout="15mins" --registration_backoff_factor="10ms" --resources="cpus:2;gpus:0;mem:1024;disk:1024;ports:[31000-32000]"
--revocable_cpu_low_priority="true" --sandbox_directory="/mnt/mesos/sandbox" --strict="true"
--switch_user="true" --systemd_enable_support="true" --systemd_runtime_directory="/run/systemd/system"
--version="false" --work_dir="/tmp/Endpoint_SlaveEndpointTest_UnauthorizedRequest_2_f2ImkQ"
I0708 14:06:40.146380 28132 credentials.hpp:86] Loading credential for authentication from
'/tmp/Endpoint_SlaveEndpointTest_UnauthorizedRequest_2_f2ImkQ/credential'
I0708 14:06:40.146586 28132 slave.cpp:343] Agent using credential for: test-principal
I0708 14:06:40.146733 28132 credentials.hpp:37] Loading credentials for authentication from
'/tmp/Endpoint_SlaveEndpointTest_UnauthorizedRequest_2_f2ImkQ/http_credentials'
I0708 14:06:40.147127 28132 slave.cpp:395] Using default 'basic' HTTP authenticator
I0708 14:06:40.147455 28132 resources.cpp:572] Parsing resources as JSON failed: cpus:2;gpus:0;mem:1024;disk:1024;ports:[31000-32000]
Trying semicolon-delimited string format instead
I0708 14:06:40.147861 28132 resources.cpp:572] Parsing resources as JSON failed: cpus:2;gpus:0;mem:1024;disk:1024;ports:[31000-32000]
Trying semicolon-delimited string format instead
I0708 14:06:40.148310 28132 slave.cpp:594] Agent resources: cpus(*):2; mem(*):1024; disk(*):1024;
ports(*):[31000-32000]
I0708 14:06:40.148370 28132 slave.cpp:602] Agent attributes: [  ]
I0708 14:06:40.148387 28132 slave.cpp:607] Agent hostname: e9defb297f9d
I0708 14:06:40.150521 28123 state.cpp:57] Recovering state from '/tmp/Endpoint_SlaveEndpointTest_UnauthorizedRequest_2_f2ImkQ/meta'
I0708 14:06:40.150563 28132 process.cpp:3322] Handling HTTP event for process 'slave(554)'
with path: '/slave(554)/containers'
I0708 14:06:40.151173 28134 status_update_manager.cpp:200] Recovering status update manager
I0708 14:06:40.151314 28127 containerizer.cpp:522] Recovering containerizer
I0708 14:06:40.152225 28132 http.cpp:829] Authorizing principal 'test-principal' to GET the
'/containers' endpoint
I0708 14:06:40.152568 28122 provisioner.cpp:253] Provisioner recovery complete
I0708 14:06:40.153172 28132 slave.cpp:4856] Finished recovery
I0708 14:06:40.153739 28132 slave.cpp:5028] Querying resource estimator for oversubscribable
resources
I0708 14:06:40.153916 28121 slave.cpp:5042] Received oversubscribable resources  from the
resource estimator
I0708 14:06:40.155066 28126 slave.cpp:841] Agent terminating
[       OK ] Endpoint/SlaveEndpointTest.UnauthorizedRequest/2 (21 ms)
[ RUN      ] Endpoint/SlaveEndpointTest.NoAuthorizer/0
I0708 14:06:40.162762 28100 containerizer.cpp:196] Using isolation: posix/cpu,posix/mem,filesystem/posix,network/cni
W0708 14:06:40.163522 28100 backend.cpp:75] Failed to create 'aufs' backend: AufsBackend requires
root privileges, but is running as user mesos
W0708 14:06:40.163698 28100 backend.cpp:75] Failed to create 'bind' backend: BindBackend requires
root privileges
I0708 14:06:40.165315 28100 cluster.cpp:432] Creating default 'local' authorizer
I0708 14:06:40.167649 28121 slave.cpp:205] Agent started on 555)@172.17.0.2:58824
I0708 14:06:40.167675 28121 slave.cpp:206] Flags at startup: --acls="" --appc_simple_discovery_uri_prefix="http://"
--appc_store_dir="/tmp/mesos/store/appc" --authenticate_http="true" --authenticatee="crammd5"
--authentication_backoff_factor="1secs" --authorizer="local" --cgroups_cpu_enable_pids_and_tids_count="false"
--cgroups_enable_cfs="false" --cgroups_hierarchy="/sys/fs/cgroup" --cgroups_limit_swap="false"
--cgroups_root="mesos" --container_disk_watch_interval="15secs" --containerizers="mesos" --credential="/tmp/Endpoint_SlaveEndpointTest_NoAuthorizer_0_FZ3hNR/credential"
--default_role="*" --disk_watch_interval="1mins" --docker="docker" --docker_kill_orphans="true"
--docker_registry="https://registry-1.docker.io" --docker_remove_delay="6hrs" --docker_socket="/var/run/docker.sock"
--docker_stop_timeout="0ns" --docker_store_dir="/tmp/mesos/store/docker" --docker_volume_checkpoint_dir="/var/run/mesos/isolators/docker/volume"
--enforce_container_disk_quota="false" --executor_registration_timeout="1mins" --executor_shutdown_grace_period="5secs"
--fetcher_cache_dir="/tmp/Endpoint_SlaveEndpointTest_NoAuthorizer_0_FZ3hNR/fetch" --fetcher_cache_size="2GB"
--frameworks_home="" --gc_delay="1weeks" --gc_disk_headroom="0.1" --hadoop_home="" --help="false"
--hostname_lookup="true" --http_authenticators="basic" --http_command_executor="false" --http_credentials="/tmp/Endpoint_SlaveEndpointTest_NoAuthorizer_0_FZ3hNR/http_credentials"
--image_provisioner_backend="copy" --initialize_driver_logging="true" --isolation="posix/cpu,posix/mem"
--launcher_dir="/mesos/mesos-1.1.0/_build/src" --logbufsecs="0" --logging_level="INFO" --oversubscribed_resources_interval="15secs"
--perf_duration="10secs" --perf_interval="1mins" --qos_correction_interval_min="0ns" --quiet="false"
--recover="reconnect" --recovery_timeout="15mins" --registration_backoff_factor="10ms" --resources="cpus:2;gpus:0;mem:1024;disk:1024;ports:[31000-32000]"
--revocable_cpu_low_priority="true" --sandbox_directory="/mnt/mesos/sandbox" --strict="true"
--switch_user="true" --systemd_enable_support="true" --systemd_runtime_directory="/run/systemd/system"
--version="false" --work_dir="/tmp/Endpoint_SlaveEndpointTest_NoAuthorizer_0_FZ3hNR"
I0708 14:06:40.168283 28121 credentials.hpp:86] Loading credential for authentication from
'/tmp/Endpoint_SlaveEndpointTest_NoAuthorizer_0_FZ3hNR/credential'
I0708 14:06:40.168480 28121 slave.cpp:343] Agent using credential for: test-principal
I0708 14:06:40.168514 28121 credentials.hpp:37] Loading credentials for authentication from
'/tmp/Endpoint_SlaveEndpointTest_NoAuthorizer_0_FZ3hNR/http_credentials'
I0708 14:06:40.168783 28121 slave.cpp:395] Using default 'basic' HTTP authenticator
I0708 14:06:40.169095 28121 resources.cpp:572] Parsing resources as JSON failed: cpus:2;gpus:0;mem:1024;disk:1024;ports:[31000-32000]
Trying semicolon-delimited string format instead
I0708 14:06:40.169525 28121 resources.cpp:572] Parsing resources as JSON failed: cpus:2;gpus:0;mem:1024;disk:1024;ports:[31000-32000]
Trying semicolon-delimited string format instead
I0708 14:06:40.169904 28121 slave.cpp:594] Agent resources: cpus(*):2; mem(*):1024; disk(*):1024;
ports(*):[31000-32000]
I0708 14:06:40.169978 28121 slave.cpp:602] Agent attributes: [  ]
I0708 14:06:40.169996 28121 slave.cpp:607] Agent hostname: e9defb297f9d
I0708 14:06:40.171463 28122 state.cpp:57] Recovering state from '/tmp/Endpoint_SlaveEndpointTest_NoAuthorizer_0_FZ3hNR/meta'
I0708 14:06:40.171588 28119 process.cpp:3322] Handling HTTP event for process 'slave(555)'
with path: '/slave(555)/monitor/statistics'
I0708 14:06:40.172284 28125 status_update_manager.cpp:200] Recovering status update manager
I0708 14:06:40.172585 28123 containerizer.cpp:522] Recovering containerizer
I0708 14:06:40.173008 28134 http.cpp:829] Authorizing principal 'test-principal' to GET the
'/monitor/statistics' endpoint
I0708 14:06:40.174448 28121 provisioner.cpp:253] Provisioner recovery complete
I0708 14:06:40.174891 28131 slave.cpp:4856] Finished recovery
I0708 14:06:40.176504 28131 slave.cpp:5028] Querying resource estimator for oversubscribable
resources
I0708 14:06:40.176975 28122 slave.cpp:5042] Received oversubscribable resources  from the
resource estimator
I0708 14:06:40.177094 28119 slave.cpp:841] Agent terminating
[       OK ] Endpoint/SlaveEndpointTest.NoAuthorizer/0 (22 ms)
[ RUN      ] Endpoint/SlaveEndpointTest.NoAuthorizer/1
I0708 14:06:40.189622 28100 containerizer.cpp:196] Using isolation: posix/cpu,posix/mem,filesystem/posix,network/cni
W0708 14:06:40.190306 28100 backend.cpp:75] Failed to create 'aufs' backend: AufsBackend requires
root privileges, but is running as user mesos
W0708 14:06:40.190469 28100 backend.cpp:75] Failed to create 'bind' backend: BindBackend requires
root privileges
I0708 14:06:40.191825 28100 cluster.cpp:432] Creating default 'local' authorizer
I0708 14:06:40.193330 28124 slave.cpp:205] Agent started on 556)@172.17.0.2:58824
I0708 14:06:40.193351 28124 slave.cpp:206] Flags at startup: --acls="" --appc_simple_discovery_uri_prefix="http://"
--appc_store_dir="/tmp/mesos/store/appc" --authenticate_http="true" --authenticatee="crammd5"
--authentication_backoff_factor="1secs" --authorizer="local" --cgroups_cpu_enable_pids_and_tids_count="false"
--cgroups_enable_cfs="false" --cgroups_hierarchy="/sys/fs/cgroup" --cgroups_limit_swap="false"
--cgroups_root="mesos" --container_disk_watch_interval="15secs" --containerizers="mesos" --credential="/tmp/Endpoint_SlaveEndpointTest_NoAuthorizer_1_NfpvsT/credential"
--default_role="*" --disk_watch_interval="1mins" --docker="docker" --docker_kill_orphans="true"
--docker_registry="https://registry-1.docker.io" --docker_remove_delay="6hrs" --docker_socket="/var/run/docker.sock"
--docker_stop_timeout="0ns" --docker_store_dir="/tmp/mesos/store/docker" --docker_volume_checkpoint_dir="/var/run/mesos/isolators/docker/volume"
--enforce_container_disk_quota="false" --executor_registration_timeout="1mins" --executor_shutdown_grace_period="5secs"
--fetcher_cache_dir="/tmp/Endpoint_SlaveEndpointTest_NoAuthorizer_1_NfpvsT/fetch" --fetcher_cache_size="2GB"
--frameworks_home="" --gc_delay="1weeks" --gc_disk_headroom="0.1" --hadoop_home="" --help="false"
--hostname_lookup="true" --http_authenticators="basic" --http_command_executor="false" --http_credentials="/tmp/Endpoint_SlaveEndpointTest_NoAuthorizer_1_NfpvsT/http_credentials"
--image_provisioner_backend="copy" --initialize_driver_logging="true" --isolation="posix/cpu,posix/mem"
--launcher_dir="/mesos/mesos-1.1.0/_build/src" --logbufsecs="0" --logging_level="INFO" --oversubscribed_resources_interval="15secs"
--perf_duration="10secs" --perf_interval="1mins" --qos_correction_interval_min="0ns" --quiet="false"
--recover="reconnect" --recovery_timeout="15mins" --registration_backoff_factor="10ms" --resources="cpus:2;gpus:0;mem:1024;disk:1024;ports:[31000-32000]"
--revocable_cpu_low_priority="true" --sandbox_directory="/mnt/mesos/sandbox" --strict="true"
--switch_user="true" --systemd_enable_support="true" --systemd_runtime_directory="/run/systemd/system"
--version="false" --work_dir="/tmp/Endpoint_SlaveEndpointTest_NoAuthorizer_1_NfpvsT"
I0708 14:06:40.193754 28124 credentials.hpp:86] Loading credential for authentication from
'/tmp/Endpoint_SlaveEndpointTest_NoAuthorizer_1_NfpvsT/credential'
I0708 14:06:40.193914 28124 slave.cpp:343] Agent using credential for: test-principal
I0708 14:06:40.193959 28124 credentials.hpp:37] Loading credentials for authentication from
'/tmp/Endpoint_SlaveEndpointTest_NoAuthorizer_1_NfpvsT/http_credentials'
I0708 14:06:40.194190 28124 slave.cpp:395] Using default 'basic' HTTP authenticator
I0708 14:06:40.194473 28124 resources.cpp:572] Parsing resources as JSON failed: cpus:2;gpus:0;mem:1024;disk:1024;ports:[31000-32000]
Trying semicolon-delimited string format instead
I0708 14:06:40.194876 28124 resources.cpp:572] Parsing resources as JSON failed: cpus:2;gpus:0;mem:1024;disk:1024;ports:[31000-32000]
Trying semicolon-delimited string format instead
I0708 14:06:40.195351 28124 slave.cpp:594] Agent resources: cpus(*):2; mem(*):1024; disk(*):1024;
ports(*):[31000-32000]
I0708 14:06:40.195412 28124 slave.cpp:602] Agent attributes: [  ]
I0708 14:06:40.195430 28124 slave.cpp:607] Agent hostname: e9defb297f9d
I0708 14:06:40.197013 28119 state.cpp:57] Recovering state from '/tmp/Endpoint_SlaveEndpointTest_NoAuthorizer_1_NfpvsT/meta'
I0708 14:06:40.197110 28124 process.cpp:3322] Handling HTTP event for process 'slave(556)'
with path: '/slave(556)/monitor/statistics.json'
I0708 14:06:40.197582 28126 status_update_manager.cpp:200] Recovering status update manager
I0708 14:06:40.197721 28126 containerizer.cpp:522] Recovering containerizer
I0708 14:06:40.198016 28130 http.cpp:829] Authorizing principal 'test-principal' to GET the
'/monitor/statistics.json' endpoint
I0708 14:06:40.198878 28129 provisioner.cpp:253] Provisioner recovery complete
I0708 14:06:40.199555 28134 slave.cpp:4856] Finished recovery
I0708 14:06:40.200011 28134 slave.cpp:5028] Querying resource estimator for oversubscribable
resources
I0708 14:06:40.200207 28128 slave.cpp:5042] Received oversubscribable resources  from the
resource estimator
I0708 14:06:40.201539 28120 slave.cpp:841] Agent terminating
[       OK ] Endpoint/SlaveEndpointTest.NoAuthorizer/1 (21 ms)
[ RUN      ] Endpoint/SlaveEndpointTest.NoAuthorizer/2
I0708 14:06:40.211068 28100 containerizer.cpp:196] Using isolation: posix/cpu,posix/mem,filesystem/posix,network/cni
W0708 14:06:40.211838 28100 backend.cpp:75] Failed to create 'aufs' backend: AufsBackend requires
root privileges, but is running as user mesos
W0708 14:06:40.212010 28100 backend.cpp:75] Failed to create 'bind' backend: BindBackend requires
root privileges
I0708 14:06:40.213601 28100 cluster.cpp:432] Creating default 'local' authorizer
I0708 14:06:40.215590 28134 slave.cpp:205] Agent started on 557)@172.17.0.2:58824
I0708 14:06:40.215618 28134 slave.cpp:206] Flags at startup: --acls="" --appc_simple_discovery_uri_prefix="http://"
--appc_store_dir="/tmp/mesos/store/appc" --authenticate_http="true" --authenticatee="crammd5"
--authentication_backoff_factor="1secs" --authorizer="local" --cgroups_cpu_enable_pids_and_tids_count="false"
--cgroups_enable_cfs="false" --cgroups_hierarchy="/sys/fs/cgroup" --cgroups_limit_swap="false"
--cgroups_root="mesos" --container_disk_watch_interval="15secs" --containerizers="mesos" --credential="/tmp/Endpoint_SlaveEndpointTest_NoAuthorizer_2_xXepiV/credential"
--default_role="*" --disk_watch_interval="1mins" --docker="docker" --docker_kill_orphans="true"
--docker_registry="https://registry-1.docker.io" --docker_remove_delay="6hrs" --docker_socket="/var/run/docker.sock"
--docker_stop_timeout="0ns" --docker_store_dir="/tmp/mesos/store/docker" --docker_volume_checkpoint_dir="/var/run/mesos/isolators/docker/volume"
--enforce_container_disk_quota="false" --executor_registration_timeout="1mins" --executor_shutdown_grace_period="5secs"
--fetcher_cache_dir="/tmp/Endpoint_SlaveEndpointTest_NoAuthorizer_2_xXepiV/fetch" --fetcher_cache_size="2GB"
--frameworks_home="" --gc_delay="1weeks" --gc_disk_headroom="0.1" --hadoop_home="" --help="false"
--hostname_lookup="true" --http_authenticators="basic" --http_command_executor="false" --http_credentials="/tmp/Endpoint_SlaveEndpointTest_NoAuthorizer_2_xXepiV/http_credentials"
--image_provisioner_backend="copy" --initialize_driver_logging="true" --isolation="posix/cpu,posix/mem"
--launcher_dir="/mesos/mesos-1.1.0/_build/src" --logbufsecs="0" --logging_level="INFO" --oversubscribed_resources_interval="15secs"
--perf_duration="10secs" --perf_interval="1mins" --qos_correction_interval_min="0ns" --quiet="false"
--recover="reconnect" --recovery_timeout="15mins" --registration_backoff_factor="10ms" --resources="cpus:2;gpus:0;mem:1024;disk:1024;ports:[31000-32000]"
--revocable_cpu_low_priority="true" --sandbox_directory="/mnt/mesos/sandbox" --strict="true"
--switch_user="true" --systemd_enable_support="true" --systemd_runtime_directory="/run/systemd/system"
--version="false" --work_dir="/tmp/Endpoint_SlaveEndpointTest_NoAuthorizer_2_xXepiV"
I0708 14:06:40.216147 28134 credentials.hpp:86] Loading credential for authentication from
'/tmp/Endpoint_SlaveEndpointTest_NoAuthorizer_2_xXepiV/credential'
I0708 14:06:40.216301 28134 slave.cpp:343] Agent using credential for: test-principal
I0708 14:06:40.216334 28134 credentials.hpp:37] Loading credentials for authentication from
'/tmp/Endpoint_SlaveEndpointTest_NoAuthorizer_2_xXepiV/http_credentials'
I0708 14:06:40.216646 28134 slave.cpp:395] Using default 'basic' HTTP authenticator
I0708 14:06:40.217020 28134 resources.cpp:572] Parsing resources as JSON failed: cpus:2;gpus:0;mem:1024;disk:1024;ports:[31000-32000]
Trying semicolon-delimited string format instead
I0708 14:06:40.217280 28134 resources.cpp:572] Parsing resources as JSON failed: cpus:2;gpus:0;mem:1024;disk:1024;ports:[31000-32000]
Trying semicolon-delimited string format instead
I0708 14:06:40.217638 28134 slave.cpp:594] Agent resources: cpus(*):2; mem(*):1024; disk(*):1024;
ports(*):[31000-32000]
I0708 14:06:40.217694 28134 slave.cpp:602] Agent attributes: [  ]
I0708 14:06:40.217710 28134 slave.cpp:607] Agent hostname: e9defb297f9d
I0708 14:06:40.218731 28128 state.cpp:57] Recovering state from '/tmp/Endpoint_SlaveEndpointTest_NoAuthorizer_2_xXepiV/meta'
I0708 14:06:40.218796 28134 process.cpp:3322] Handling HTTP event for process 'slave(557)'
with path: '/slave(557)/containers'
I0708 14:06:40.219175 28128 status_update_manager.cpp:200] Recovering status update manager
I0708 14:06:40.219432 28125 containerizer.cpp:522] Recovering containerizer
I0708 14:06:40.219521 28124 http.cpp:829] Authorizing principal 'test-principal' to GET the
'/containers' endpoint
I0708 14:06:40.220494 28133 provisioner.cpp:253] Provisioner recovery complete
I0708 14:06:40.220698 28134 slave.cpp:4856] Finished recovery
I0708 14:06:40.221210 28134 slave.cpp:5028] Querying resource estimator for oversubscribable
resources
I0708 14:06:40.221456 28124 slave.cpp:5042] Received oversubscribable resources  from the
resource estimator
I0708 14:06:40.221943 28127 slave.cpp:841] Agent terminating
[       OK ] Endpoint/SlaveEndpointTest.NoAuthorizer/2 (19 ms)
[----------] 9 tests from Endpoint/SlaveEndpointTest (216 ms total)

[----------] Global test environment tear-down
[==========] 1236 tests from 139 test cases ran. (839760 ms total)
[  PASSED  ] 1234 tests.
[  FAILED  ] 2 tests, listed below:
[  FAILED  ] ContentType/MasterAPITest.GetAgents/0, where GetParam() = application/x-protobuf
[  FAILED  ] ContentType/MasterAPITest.GetAgents/1, where GetParam() = application/json

 2 FAILED TESTS
  YOU HAVE 6 DISABLED TESTS

make[4]: *** [check-local] Error 1
make[4]: Leaving directory `/mesos/mesos-1.1.0/_build/src'
make[3]: Leaving directory `/mesos/mesos-1.1.0/_build/src'
make[3]: *** [check-am] Error 2
make[2]: *** [check] Error 2
make[2]: Leaving directory `/mesos/mesos-1.1.0/_build/src'
make[1]: *** [check-recursive] Error 1
make[1]: Leaving directory `/mesos/mesos-1.1.0/_build'
make: *** [distcheck] Error 1
+ docker rmi mesos-1467983780-6716
Untagged: mesos-1467983780-6716:latest
Deleted: 47b62cb64ee8fc7c7a3a90d242eb60b749a2df153680f85c38280b800f7445d8
Deleted: 7ae74686c65b75795874e6cb2f5c6a54ff2009cda627d02d2088ccfc6b9f3082
Deleted: 290a66ae086de9ec9ff1168306b23d2ad931882fc26ad3721278bd985e201bee
Deleted: 28efea298debce1a27078a401430ab010ed98fe4e96dc81ee082de517dc3c7f9
Deleted: f8d6addde14be437b8a8d40a983397daeabb82b38e27e96c044185721bbcc6c4
Deleted: 6932c8b9b37d2af15cc73f8477d5aef60612a20e2f1833375234d2f95e112545
Deleted: 553cc4cf48af85171fd1bab90d5a2f0cf4d8bbe5c352f10cb865154e82455573
Deleted: d659d64dcf45aeb917e5aaecc84cdbdedfbf65943e59e69324da99598f73e7d6
Deleted: 0daaf077d78c26b6a3ceef69b8513f26269288f74afc7ee1d525eca429c1b52f
Deleted: 11c5c98d5b9717c8d1f08de4b299a7a83044435f227838e6d7315bece401b288
Deleted: aad4c1d2b8b984f086df10bb8edbcd57b1cff2606105e8319b7d63c8d1d67eb1
Deleted: 53f0de1a2061c09518fdb02fa734d459b20d52129cf0ef422d8294cab4a6b921
Deleted: bc582d3fe15747962ef1c0454824eac0406dfd1edc16d24d60583e1aaff5ec7c
Deleted: 50de0d8dd9e5757b874fa454405555f10a3b98502406478f5f45831825c0afdc
Deleted: 9d08a840acef84d244fa64a95dd52fa7b8e6efa879af0bd13829bdbc52d9b13b
Build step 'Execute shell' marked build as failure

Mime
View raw message